GET /
{ 'cache-control': 'no-cache',
  'postman-token': '4949330a-9024-47f9-ab62-9afa740845a7',
  'user-agent': 'PostmanRuntime/7.6.0',
  accept: '*/*',
  host: 'localhost:8080',
  'accept-encoding': 'gzip, deflate',
  connection: 'keep-alive' }
