<svg width="39" height="50" viewBox="0 0 39 50" fill="none" xmlns="http://www.w3.org/2000/svg">
<path d="M36.0635 3.22266H32.6172V6.75879C32.6172 8.14746 31.4873 9.27734 30.0986 9.27734H8.76855C7.37988 9.27734 6.25 8.14746 6.25 6.75879V3.22266H2.80371C1.25781 3.22266 0 4.48047 0 6.02734V47.1963C0 48.7422 1.25781 50 2.80371 50H36.0635C37.6094 50 38.8672 48.7422 38.8672 47.1963V6.02734C38.8672 4.48047 37.6094 3.22266 36.0635 3.22266ZM10.8398 39.7461H7.71484C6.90625 39.7461 6.25 39.0898 6.25 38.2812C6.25 37.4727 6.90625 36.8164 7.71484 36.8164H10.8398C11.6484 36.8164 12.3047 37.4727 12.3047 38.2812C12.3047 39.0898 11.6484 39.7461 10.8398 39.7461ZM10.8398 33.4961H7.71484C6.90625 33.4961 6.25 32.8398 6.25 32.0312C6.25 31.2227 6.90625 30.5664 7.71484 30.5664H10.8398C11.6484 30.5664 12.3047 31.2227 12.3047 32.0312C12.3047 32.8398 11.6484 33.4961 10.8398 33.4961ZM12.5 20.3125C12.5 19.5039 13.1562 18.8477 13.9648 18.8477H17.9688V14.8438C17.9688 14.0352 18.625 13.3789 19.4336 13.3789C20.2422 13.3789 20.8984 14.0352 20.8984 14.8438V18.8477H24.9023C25.7109 18.8477 26.3672 19.5039 26.3672 20.3125C26.3672 21.1211 25.7109 21.7773 24.9023 21.7773H20.8984V25.7812C20.8984 26.5898 20.2422 27.2461 19.4336 27.2461C18.625 27.2461 17.9688 26.5898 17.9688 25.7812V21.7773H13.9648C13.1562 21.7773 12.5 21.1211 12.5 20.3125ZM31.1523 39.7461H17.8711C17.0625 39.7461 16.4062 39.0898 16.4062 38.2812C16.4062 37.4727 17.0625 36.8164 17.8711 36.8164H31.1523C31.9609 36.8164 32.6172 37.4727 32.6172 38.2812C32.6172 39.0898 31.9609 39.7461 31.1523 39.7461ZM31.1523 33.4961H17.8711C17.0625 33.4961 16.4062 32.8398 16.4062 32.0312C16.4062 31.2227 17.0625 30.5664 17.8711 30.5664H31.1523C31.9609 30.5664 32.6172 31.2227 32.6172 32.0312C32.6172 32.8398 31.9609 33.4961 31.1523 33.4961ZM29.6875 0H9.17969V6.34766H29.6875V0Z" fill="#006838"/>
</svg>
