<svg width="31" height="60" viewBox="0 0 31 60" fill="none" xmlns="http://www.w3.org/2000/svg">
<path d="M27.1666 21.1667L8.04158 2.04171C7.2609 1.26567 6.20485 0.830078 5.10407 0.830078C4.0033 0.830078 2.94725 1.26567 2.16657 2.04171C1.77604 2.42906 1.46606 2.8899 1.25453 3.39764C1.04299 3.90539 0.934082 4.45 0.934082 5.00005C0.934082 5.5501 1.04299 6.0947 1.25453 6.60245C1.46606 7.1102 1.77604 7.57103 2.16657 7.95838L21.3332 27.0417C21.7238 27.4291 22.0338 27.8899 22.2453 28.3976C22.4568 28.9054 22.5657 29.45 22.5657 30C22.5657 30.5501 22.4568 31.0947 22.2453 31.6025C22.0338 32.1102 21.7238 32.571 21.3332 32.9584L2.16657 52.0417C1.38198 52.8208 0.938998 53.8796 0.935091 54.9853C0.931184 56.091 1.36667 57.153 2.14575 57.9375C2.92482 58.7221 3.98366 59.1651 5.08934 59.169C6.19503 59.1729 7.25698 58.7375 8.04158 57.9584L27.1666 38.8334C29.5074 36.4896 30.8222 33.3126 30.8222 30C30.8222 26.6875 29.5074 23.5105 27.1666 21.1667Z" fill="#747676"/>
</svg>
