<svg width="50" height="50" viewBox="0 0 50 50" fill="none" xmlns="http://www.w3.org/2000/svg">
<g clip-path="url(#clip0_172_34)">
<path d="M44.1391 7.35645V5.96641H41.2058V11.6762H44.1391V10.2861H47.0667V16.0748C47.0667 20.1134 43.7809 23.399 39.742 23.399C35.7031 23.399 32.4173 20.1134 32.4173 16.0748V10.2861H35.3448V11.6762H38.2781V5.96641H35.3448V7.35645H29.484V16.0748C29.484 21.2311 33.3114 25.51 38.2754 26.2234V35.2915C38.2754 41.7864 32.9905 47.0705 26.4946 47.0705C21.6611 47.0705 17.4989 44.1445 15.6848 39.9714H26.4946V2.69287H22.1621V8.31533H4.33252V2.69287H0V39.9713H12.5424C12.0373 38.4669 11.7807 36.8954 11.7807 35.2914V33.9747C9.52832 33.3351 7.87344 31.2621 7.87344 28.8087C7.87344 25.8471 10.2842 23.4376 13.2474 23.4376C16.2105 23.4376 18.6213 25.8471 18.6213 28.8087C18.6213 31.2621 16.9663 33.3351 14.714 33.9748V35.2914C14.714 36.7255 15.1828 38.6433 15.6848 39.9713H12.5424C14.4696 45.8632 20.2104 50.0001 26.4946 50.0001C34.6079 50.0001 41.2086 43.4019 41.2086 35.2914V26.2233C46.1726 25.5099 50 21.2311 50 16.0747V7.35645H44.1391ZM8.73105 20.2811H5.80068V17.3514H8.73115L8.73105 20.2811ZM8.73105 14.4217H5.80068V11.492H8.73115L8.73105 14.4217ZM11.6615 11.492H20.6939V14.4217H11.6615V11.492ZM11.6615 20.2811V17.3514H20.6939V20.2811H11.6615Z" fill="#747676"/>
<path d="M15.6879 28.8086C15.6879 27.4624 14.593 26.3672 13.2473 26.3672C11.9016 26.3672 10.8066 27.4624 10.8066 28.8086C10.8066 30.1548 11.9015 31.25 13.2473 31.25C14.5931 31.25 15.6879 30.1548 15.6879 28.8086Z" fill="#747676"/>
<path d="M7.26562 0H19.2285V5.38564H7.26562V0Z" fill="#747676"/>
</g>
<defs>
<clipPath id="clip0_172_34">
<rect width="50" height="50" fill="white"/>
</clipPath>
</defs>
</svg>
