<svg width="31" height="60" viewBox="0 0 31 60" fill="none" xmlns="http://www.w3.org/2000/svg">
<path d="M3.83343 38.8333L22.9584 57.9583C23.7391 58.7343 24.7952 59.1699 25.8959 59.1699C26.9967 59.1699 28.0527 58.7343 28.8334 57.9583C29.224 57.5709 29.5339 57.1101 29.7455 56.6024C29.957 56.0946 30.0659 55.55 30.0659 55C30.0659 54.4499 29.957 53.9053 29.7455 53.3975C29.5339 52.8898 29.224 52.429 28.8334 52.0416L9.66676 32.9583C9.27622 32.5709 8.96625 32.1101 8.75471 31.6024C8.54318 31.0946 8.43427 30.55 8.43427 29.9999C8.43427 29.4499 8.54318 28.9053 8.75471 28.3975C8.96625 27.8898 9.27623 27.429 9.66676 27.0416L28.8334 7.95828C29.618 7.17921 30.061 6.12037 30.0649 5.01468C30.0688 3.909 29.6333 2.84705 28.8543 2.06245C28.0752 1.27785 27.0163 0.834869 25.9107 0.830963C24.805 0.827053 23.743 1.26255 22.9584 2.04162L3.83343 21.1666C1.49259 23.5104 0.177756 26.6874 0.177756 29.9999C0.177756 33.3125 1.49259 36.4895 3.83343 38.8333Z" fill="#747676"/>
</svg>
