<?xml version="1.0" encoding="utf-8"?>
<!-- Generator: Adobe Illustrator 19.0.0, SVG Export Plug-In . SVG Version: 6.00 Build 0)  -->
<svg version="1.1" id="Layer_1" xmlns="http://www.w3.org/2000/svg" xmlns:xlink="http://www.w3.org/1999/xlink" x="0px" y="0px"
	 width="675px" height="345px" viewBox="0 0 675 345" style="enable-background:new 0 0 675 345;" xml:space="preserve">
<style type="text/css">
	.st0{fill:#33A5C3;}
	.st1{fill:#FFFFFF;}
</style>
<g id="XMLID_2005_">
	<path id="XMLID_5248_" class="st0" d="M58.2,261.9c2.9,0,5.4,0.6,7.4,1.8c2,1.2,4,3.5,5.9,7l38.4,69.8c0.4,0.8,0.5,1.4,0.3,1.9
		c-0.2,0.5-0.8,0.8-1.7,0.8H93.9c-1.3,0-2.2-0.5-2.7-1.5l-8.2-15H28.4l-8,15c-0.5,1-1.4,1.5-2.7,1.5H2.6c-1,0-1.6-0.3-1.8-0.8
		c-0.2-0.5-0.1-1.1,0.3-1.9l38.1-69.8c1.9-3.5,3.8-5.8,5.7-7c1.9-1.2,4-1.8,6.5-1.8H58.2z M35.7,313.2h40l-18.5-34
		c-0.3-0.5-0.7-0.8-1.3-0.8h-0.7c-0.5,0-1,0.3-1.3,0.8L35.7,313.2z"/>
	<path id="XMLID_5246_" class="st0" d="M133.6,256.1c1.7,0,2.6,0.9,2.6,2.6v82c0,1.7-0.9,2.6-2.6,2.6h-11.4c-1.7,0-2.6-0.9-2.6-2.6
		v-82c0-1.7,0.9-2.6,2.6-2.6H133.6z"/>
	<path id="XMLID_5243_" class="st0" d="M165,255.9c1.7,0,2.6,0.9,2.6,2.6v11c0,1.8-0.9,2.7-2.6,2.7h-11.4c-1.8,0-2.7-0.9-2.7-2.7
		v-11c0-1.7,0.9-2.6,2.7-2.6H165z M165,279.4c1.7,0,2.6,0.9,2.6,2.7v58.5c0,1.7-0.9,2.6-2.6,2.6h-11.4c-1.7,0-2.6-0.9-2.6-2.6v-58.5
		c0-1.8,0.9-2.7,2.6-2.7H165z"/>
	<path id="XMLID_5224_" class="st0" d="M255.8,279.4c1.4,0,2.1,0.7,2.1,2.1v9.3c0,1.4-0.7,2.1-2.1,2.1h-52.4c-2.4,0-4.1,0.4-5,1.3
		c-0.9,0.9-1.4,2.2-1.4,3.9v1.7c0,1.6,0.5,2.8,1.4,3.7c0.9,0.9,2.6,1.3,5,1.3h39.1c6.5,0,11.2,1.4,13.9,4.1
		c2.8,2.7,4.2,6.5,4.2,11.5v6.5c0,2.6-0.3,4.8-0.9,6.9c-0.6,2-1.6,3.7-3.1,5.1c-1.4,1.4-3.3,2.5-5.6,3.2c-2.3,0.7-5.2,1.1-8.6,1.1
		H183c-1.4,0-2.1-0.7-2.1-2.1v-9.3c0-1.4,0.7-2.1,2.1-2.1H238c2.4,0,4.1-0.4,5.1-1.3c1-0.9,1.5-2.3,1.5-4.3V321
		c0-1.5-0.5-2.7-1.5-3.6c-1-0.9-2.7-1.3-5.1-1.3h-39c-6.5,0-11.2-1.3-13.9-4c-2.8-2.7-4.2-6.6-4.2-11.7v-5.1c0-2.4,0.3-4.6,0.9-6.6
		c0.6-2,1.6-3.7,3.1-5.1c1.4-1.4,3.3-2.5,5.6-3.2c2.3-0.7,5.2-1.1,8.6-1.1H255.8z"/>
	<path id="XMLID_5222_" class="st0" d="M281,279.4v-15.3c0-1.7,0.9-2.6,2.6-2.6h11.5c1.7,0,2.6,0.9,2.6,2.6v15.3h20.3
		c1.4,0,2.1,0.7,2.1,2.1v9.5c0,1.4-0.7,2.1-2.1,2.1h-20.3v27c0,3.3,0.7,5.6,2,7.1c1.3,1.5,3.9,2.3,7.8,2.3h11.3
		c1.4,0,2.1,0.7,2.1,2.1v9.5c0,1.4-0.7,2.1-2.1,2.1h-14.1c-4.7,0-8.5-0.4-11.5-1.3c-3-0.8-5.4-2.2-7.3-4.1c-1.8-1.9-3.1-4.3-3.8-7.2
		c-0.7-2.9-1-6.5-1-10.6v-27h-11c-1.4,0-2.1-0.7-2.1-2.1v-9.5c0-1.4,0.7-2.1,2.1-2.1H281z"/>
	<path id="XMLID_5218_" class="st0" d="M381.7,279.4c5.2,0,9.6,0.4,13.1,1.3c3.6,0.9,6.4,2.3,8.5,4.2c2.1,1.9,3.7,4.3,4.6,7.3
		c0.9,3,1.4,6.6,1.4,10.7v30.9c0,1.9-0.1,3.4-0.4,4.6c-0.3,1.2-0.7,2.2-1.4,2.8c-0.7,0.7-1.5,1.2-2.6,1.5c-1.1,0.3-2.5,0.4-4.2,0.4
		h-55.3c-3.4,0-6.3-0.3-8.5-1c-2.3-0.7-4.1-1.6-5.5-3c-1.4-1.3-2.4-3-3-5.1c-0.6-2.1-0.9-4.6-0.9-7.4v-5.6c0-2.4,0.3-4.5,0.9-6.4
		c0.6-1.9,1.6-3.5,3-4.8c1.4-1.3,3.2-2.3,5.5-3c2.3-0.7,5.1-1,8.5-1h47.3v-2.2c0-1.9-0.2-3.4-0.6-4.8c-0.4-1.3-1-2.4-2-3.2
		c-0.9-0.8-2.2-1.4-3.8-1.8c-1.6-0.4-3.7-0.6-6.3-0.6h-48.6c-1.4,0-2.1-0.7-2.1-2.1v-9.8c0-1.4,0.7-2.1,2.1-2.1H381.7z M389.4,330.4
		c1.2,0,2.1-0.3,2.6-0.9c0.5-0.6,0.8-1.6,0.8-3.1v-10.2h-42.5c-2.4,0-4.1,0.5-5.1,1.5c-1,1-1.5,2.4-1.5,4.2v2.4
		c0,2.1,0.5,3.6,1.5,4.6c1,1,2.7,1.5,5.1,1.5H389.4z"/>
	<path id="XMLID_5214_" class="st1" d="M506.1,261.9c1.7,0,2.6,0.9,2.6,2.6v11.4c0,1.8-0.9,2.7-2.6,2.7h-51.7c-3,0-5.5,0.3-7.5,0.8
		c-2,0.5-3.5,1.4-4.7,2.6c-1.2,1.2-2,2.8-2.5,4.8c-0.5,2-0.7,4.6-0.7,7.7v16.5c0,3.1,0.2,5.7,0.7,7.7c0.5,2.1,1.3,3.7,2.5,4.9
		c1.2,1.2,2.7,2.1,4.7,2.6c2,0.5,4.5,0.8,7.5,0.8h51.7c1.7,0,2.6,0.9,2.6,2.6v11.4c0,1.7-0.9,2.6-2.6,2.6h-52.4
		c-5.9,0-10.9-0.5-15-1.6c-4.1-1.1-7.5-2.8-10-5.3c-2.6-2.4-4.5-5.6-5.7-9.5c-1.2-3.9-1.8-8.7-1.8-14.2v-20c0-5.6,0.6-10.3,1.8-14.2
		c1.2-3.9,3.1-7,5.7-9.5c2.6-2.4,5.9-4.2,10-5.3c4.1-1.1,9.1-1.7,15-1.7H506.1z"/>
	<path id="XMLID_5211_" class="st1" d="M572.3,279.4c5.2,0,9.6,0.4,13.1,1.3c3.6,0.9,6.4,2.3,8.5,4.2c2.1,1.9,3.7,4.3,4.6,7.3
		c0.9,3,1.4,6.6,1.4,10.7v30.9c0,1.9-0.1,3.4-0.4,4.6c-0.3,1.2-0.7,2.2-1.4,2.8c-0.7,0.7-1.5,1.2-2.6,1.5c-1.1,0.3-2.5,0.4-4.2,0.4
		h-55.3c-3.4,0-6.3-0.3-8.5-1c-2.3-0.7-4.1-1.6-5.5-3c-1.4-1.3-2.4-3-3-5.1c-0.6-2.1-0.9-4.6-0.9-7.4v-5.6c0-2.4,0.3-4.5,0.9-6.4
		c0.6-1.9,1.6-3.5,3-4.8c1.4-1.3,3.2-2.3,5.5-3c2.3-0.7,5.1-1,8.5-1h47.3v-2.2c0-1.9-0.2-3.4-0.6-4.8c-0.4-1.3-1-2.4-2-3.2
		c-0.9-0.8-2.2-1.4-3.8-1.8c-1.6-0.4-3.7-0.6-6.3-0.6h-48.6c-1.4,0-2.1-0.7-2.1-2.1v-9.8c0-1.4,0.7-2.1,2.1-2.1H572.3z M580,330.4
		c1.2,0,2.1-0.3,2.6-0.9c0.5-0.6,0.8-1.6,0.8-3.1v-10.2h-42.5c-2.4,0-4.1,0.5-5.1,1.5c-1,1-1.4,2.4-1.4,4.2v2.4
		c0,2.1,0.5,3.6,1.4,4.6c1,1,2.7,1.5,5.1,1.5H580z"/>
	<path id="XMLID_5208_" class="st1" d="M672.2,279.4c1.4,0,2.1,0.7,2.1,2.1v9.8c0,1.4-0.7,2.1-2.1,2.1h-30.9c-2.5,0-4.5,0.2-6.2,0.6
		c-1.6,0.4-2.9,1.1-3.9,2.1c-1,1-1.6,2.3-2,3.9c-0.4,1.7-0.6,3.7-0.6,6.1v34.5c0,1.7-0.9,2.6-2.6,2.6h-11.4c-1.8,0-2.7-0.9-2.7-2.6
		V303c0-4.2,0.5-7.8,1.4-10.7c0.9-3,2.5-5.4,4.6-7.3c2.1-1.9,5-3.3,8.5-4.2c3.5-0.9,7.9-1.3,13.2-1.3H672.2z"/>
	<path id="XMLID_5205_" class="st0" d="M557.5,184.2c-1.2-32.4-28.4-57.7-60.8-56.5c-32.4,1.2-57.7,28.4-56.5,60.8
		c0.4,9.8,3.1,18.9,7.6,26.8c-6.6,0.2-13.2,0.6-19.7,1.1c-15.9,1.1-32.4,2.2-47.9-0.9c-7.1-1.4-12.4-7.6-18-14.1
		c-2-2.3-4.1-4.8-6.2-6.9c-1.4-1.4-2.7-2.7-3.9-4.1c-7.1-7.5-13.3-14-27.3-13.9c-7,0.1-14.2,0.1-21.1,0.1c-3.5,0-7,0-10.5,0
		l-36.9,0.1c0-1.4,0-2.8,0-4.2c-1.4-38-33.3-67.7-71.4-66.3c-38,1.4-67.7,33.3-66.3,71.4c1.4,38,33.3,67.7,71.4,66.3
		c33.3-1.2,60.1-25.8,65.4-57.4l37.8-0.1c3.5,0,7,0,10.5,0c6.9,0,14.1,0,21.2-0.1c9.7-0.1,13.4,3.8,20.1,10.9
		c1.3,1.4,2.6,2.7,4.1,4.2c1.9,1.9,3.7,4.1,5.7,6.4c6.1,7.1,13,15.2,23.5,17.3c8.3,1.6,16.6,2.2,24.9,2.2c8.6,0,17.1-0.6,25.5-1.1
		c6.8-0.5,18.3-0.5,26.4-0.5c11.2,12.5,27.7,20.1,45.8,19.4C533.4,243.8,558.7,216.6,557.5,184.2z"/>
	<path id="XMLID_5202_" class="st0" d="M537.4,128.5c0.9-0.3,1.6-1.1,1.7-2.6c0.2-2.4-2.1-6.8-3.3-8.5c-4.1-5.8-8.1-8.8-13.5-12.6
		c-5.5-3.8-12.5-7.3-18.7-9.7c-15-5.8-29.1-8.9-43.6-13c-6.4-1.8-12.8-3.6-16.3-9.6c-5.9-9.9-10.1-19.7-17.6-28.6
		c-12.1-14.5-27-27.1-44.6-34.6c-37.4-16-77.4-4-110.1,16.6c-16.6,10.5-29.7,24.5-45.4,35.9c-10.8,7.9-24.1,0.6-36-0.4
		c-13.3-1.1-26.9-0.2-38.2,7.4c-8.3,5.6-13.2,13.9-16,23.2c-1,3.4-4.5,16.8-0.6,18.9c2.3,1.2,4.2-0.3,5.9-1.8c4-3.5,8-6.9,12.6-9.5
		c10.1-5.7,23.6-9.6,35.1-9.8c15.1-0.4,31.7,3.7,43.6,11.4c8.1,5.2,16.9,11,21.7,19.7c1.5,2.6,3.2,5.1,4.4,7.8
		c2.2,5.1,5.1,13.7,6.4,19.7c2,9.1,9.7,11.9,19.3,13.3c5.7,0.8,13.5,0.5,19.8,0.5c4.9,0,9.7-0.1,14.5-0.1
		c27.3-0.3,38.3,7.6,50.5,24.5c8.3,11.5,13.4,15.6,27.8,16.5c16,1,21.1,0.6,23.8-13.8c2.3-12.1,4.1-23.3,9.4-34.6
		c7-14.9,19.8-26.3,35-32.4c10.1-4,21.1-5.8,31.9-5.3c6.1,0.3,12.2,1.3,18.1,2.9c4.9,1.3,10.1,3.8,14.4,6.5
		C531.2,127.3,535.1,129.2,537.4,128.5z M381.1,85.8c-15.9,12.2-31.9,24.3-48.1,36.2c-4.2,3.1-9.3,1.7-11.7-2.8
		c-3.7-7.1-7.1-14.3-10.5-21.6c-1.4-2.9-0.8-5.7,1.9-7.6c2.9-2,5.8-1.3,8.1,1.2c3.3,3.5,6.4,7.2,9.8,11.1
		c13.6-8.2,27.2-16.3,40.7-24.4c1.1-0.7,2.2-1.4,3.3-2c3.2-1.6,6-1.1,7.9,1.9C384.4,80.7,383.8,83.8,381.1,85.8z"/>
</g>
</svg>
