{
  "project_info": {
    "project_number": "989819467752",
    "firebase_url": "https://alistacar-1295.firebaseio.com",
    "project_id": "alistacar-1295",
    "storage_bucket": "alistacar-1295.appspot.com"
  },
  "client": [
    {
      "client_info": {
        "mobilesdk_app_id": "1:989819467752:android:40730f8938fd8be5",
        "android_client_info": {
          "package_name": "com.mocion.alistacar"
        }
      },
      "oauth_client": [
        {
          "client_id": "989819467752-8r04ffps6i83beuv5tkaojsgsam6ks6f.apps.googleusercontent.com",
          "client_type": 3
        },
        {
          "client_id": "989819467752-3uavt7pjfodji94a1p488rfaivbvpuod.apps.googleusercontent.com",
          "client_type": 3
        },
        {
          "client_id": "989819467752-7nrv92ksmq18n11et6c07bp1qnnc3eoe.apps.googleusercontent.com",
          "client_type": 3
        }
      ],
      "api_key": [
        {
          "current_key": "AIzaSyBprze3VNeWVRHwzE8uScnlMxdVvt8yY6Q"
        }
      ],
      "services": {
        "analytics_service": {
          "status": 1
        },
        "appinvite_service": {
          "status": 1,
          "other_platform_oauth_client": []
        },
        "ads_service": {
          "status": 2
        }
      }
    }
  ],
  "configuration_version": "1"
}