{
  "mapOptions"   : {

    "url"              : "https://{s}.basemaps.cartocdn.com/rastertiles/voyager/{z}/{x}/{y}{r}.png",
    "attribution"      : "&copy; <a href=\"https://www.openstreetmap.org/copyright\">OpenStreetMap</a> contributors &copy; <a href=\"https://carto.com/attributions\">CARTO</a>",
    "subdomains"       : "abcd",
    "center"           : [ -1.01, 47.64],
    "zoom"             : 6.8,
    "maxZoom"          : 18,
    "minZoom"          : 2,
    "useMarkerCluster" : true,

    "item_geo_fields"   : {
      "latitude" : "BAN_latitude",
      "longitude": "BAN_longitude"
    },

    "item_marker"       : "map-marker",
    "item_marker_color" : "primary",
    "item_marker_offset" : [ 0, 8 ],
    "item_marker_anchor" : "bottom",

    "DEPRECATED_pinIconUrl" : "/static/icons/icon_pin_plein_violet.svg",
    "pinIconSize"      : {
      "highlighted" : [46, 46],
      "normal"      : [29, 29]
    },

    "map_layers" : {

      "all_points_layer" : {
        "_COMMENT": "### all points source and layer",
        "is_activated"        : true,
        "source_id"           : "allPointsSource",
        "layer_id"            : "all-points",
        "is_default_visible"  : true,
        "is_source_distant"   : false,

        "is_live_data"        : false,
        "refresh_delay"       : 3000,

        "is_clickable"        : true,
        "add_zoom_on_click"   : 3.5,
        "is_hoverable"        : true,
        "hover_infos"         : {},
        "direct_to_detail"    : false,
        "has_popup"           : true,
        "popup_config"        : {
          "action" : "mousemove",
          "fields_settings": {
            "Nom lieu" : { "position": "main_title", "prefix" : null, "suffix" : null, "class": "is-size-6 has-text-weight-semibold" },
            "_datami_" : { "position": "info",       "prefix" : "(cliquez pour + d'infos)", "suffix" : null, "class": "has-text-centered has-text-weight-light" }
          }
        },

        "radius_min"          : 2,
        "radius_max"          : 20,
        "max_zoom"            : 14,
        "min_zoom"            : 4,
        "circle_color"        : "#004494",
        "circle_stroke_color" : "#fff",
        "circle_opacity"      : 0.7
      },

      "cluster_circles_layer" : {
        "_COMMENT": "### clusters source and layer",
        "is_activated"        : true,
        "source_id"           : "clusterSource",
        "layer_id"            : "cluster-circles",
        "is_default_visible"  : false,

        "is_source_distant"   : false,
        "is_clickable"        : true,

        "circle_color"     : "#e5ecf4",
        "circle_color_100" : "#b2c6de",
        "circle_color_250" : "#668ebe",
        "circle_color_500" : "#3269a9",
        "circle_color_750" : "#004494",

        "circle_radius"     : 15, 
        "circle_radius_100" : 20, 
        "circle_radius_250" : 25, 
        "circle_radius_500" : 30, 
        "circle_radius_750" : 35, 

        "circle_stroke_color" : "#fff",
        "circle_stroke_width" : 1
      },

      "cluster_count_layer" : {
        "is_activated"        : true,
        "source_id"           : "clusterSource",
        "layer_id"            : "cluster-counts",
        "is_default_visible"  : false,
        "is_source_distant"   : false,
        "is_clickable"        : true,

        "text_size"    : 11,
        "text_color"   : "#ffffff"
      },

      "cluster_unclustered_layer" : {
        "is_activated"        : false,
        "source_id"           : "clusterSource",
        "layer_id"            : "unclustered-point",
        "is_default_visible"  : true,
        "is_source_distant"   : false,
        "is_clickable"        : true,

        "circle_color"        : "#fff",
        "circle_stroke_color" : "#004494",
        "circle_radius"       : 5,
        "circle_stroke_width" : 5
      },

      "choropleth_layer" : {
        "_COMMENT": "### choropleth source and layer",
        "is_activated"        : true,
        "is_live_data"        : false,
        "refresh_delay"       : 3000,
        "is_default_visible"  : true,

        "is_source_distant"   : true,
        "_COMMENT_SOURCES_DISTANT": {
          "distant_source_url" : "https://raw.githubusercontent.com/gregoiredavid/france-geojson/master/departements-version-simplifiee.geojson",
          "distant_source_url_bis"  : "https://raw.githubusercontent.com/gregoiredavid/france-geojson/master/communes-avec-outre-mer.geojson"
        },
        
        "change_source_by_zoom" : true,
        "is_clickable"        : false,

        "_COMMENT_SOURCES": "### list of choropleth sources",
        "sources" : [
          
          { "_COMMENT": "### FR - départements",
            "is_activated" : true,
            "source_id" : "chorosource-departements",
            "layer_id"  : "chorolayer-departements",
            "is_default_visible" : true,
            "max_zoom" : 9,
            "min_zoom" : 0,

            "source_url" : "https://raw.githubusercontent.com/gregoiredavid/france-geojson/master/departements-version-simplifiee.geojson", 

            "update_src_from_previous_layer" : false,

            "need_aggregation" : true,
            "polygon_prop_id" : "code",
            "join_polygon_id_to_field"  : "departement",
            "agregated_data_field"      : "count_dep",
            "fill_color": [
              "interpolate",
              ["linear"],
              ["get", "count_dep" ],
              0,  "#f2f3f3",
              50,  "#67c1b5",
              100, "#158b7b",
              150, "#106268"
            ],
            "fill_opacity"        : 0.5,
            "fill_outline_color"  : "#004494",

            "has_popup" : false, 
            "popup_config" : {
              "action" : "mousemove",
              "fields_settings": {
                "Nom lieu" : { "position": "title",      "prefix" : null,       "suffix" : null },
                "code" :       { "position": "title_post", "prefix" : " (",       "suffix" : ")" },
                "count_dep" :  { "position": "value",      "prefix" : "total : ", "suffix" : " organisations" }
              }
            },
            "legend" : {
              "position" : "bottom-right",
              "title" : "Légende",
              "scales" : [
                { "value" : "100 à +150 lieux par département", "color" : "#106268"},
                { "value" : "50 à 100 lieux par département",  "color" : "#158b7b"},
                { "value" : "1 à 50 lieux par département",   "color" : "#67c1b5"},
                { "value" : "0 lieu par département",    "color" : "#f2f3f3"}
              ]
            }

          }
        ]

      },

      "heatmap_layer" : {
        "_COMMENT"            : "### heatmap source and layer",
        "is_activated"        : true,
        "is_default_visible"  : false,
        "source_id"           : "allPointsSource",
        "layer_id"            : "heatmap-layer",
        "source"              : "all-points",
        "prop_weight"         : "weight",
        "max_zoom"            : 18,
        "radius_min"          : 6,
        "radius_max"          : 25
      }

    },

    "layers_visibility" :{
      "is_activated"    : true,
      "is_drawer_open"  : false,
      "layers_switches" : [
        {
          "label" : "Lieux",
          "layers" : [ "all-points" ], 
          "default_visible" : true 
        },
        {
          "label" : "Départements",
          "layers" : [ "chorolayer-departements" ], 
          "default_visible" : true 
        },
        {
          "label" : "Clusters",
          "layers" : [ "cluster-circles", "cluster-counts" ],
          "default_visible" : false
        },
        {
          "label" : "Radar",
          "layers" : [ "heatmap-layer" ],
          "default_visible" : false
        }
      ]
    }

  }
}
