{
	"camera_settings": [
		{
			"id": "",
			"name": "",
			"intrinsic_settings":
			{
				"fx": 320,
				"fy": 320,
				"cx": 320,
				"cy": 240,
				"s": 0,
				"hfov": 90,
				"resolution":
				{
					"width": 1920,
					"height": 1080
				}
			},
			"captured_image_size":
			{
				"width": 1920,
				"height": 1080
			}
		}
	]
}