{
  "files": {
    "main.css": "./static/css/main.fc2f7450.css",
    "main.js": "./static/js/main.f70e22a9.js",
    "static/js/453.ecd021e3.chunk.js": "./static/js/453.ecd021e3.chunk.js",
    "static/media/SUT_freshmen-mobile-Animate.gif": "./static/media/SUT_freshmen-mobile-Animate.75ce3c120c71f822d582.gif",
    "static/media/home-fg.gif": "./static/media/home-fg.e24d679004c226314a0a.gif",
    "static/media/medicine-1.png": "./static/media/medicine-1.85193c7317b9a779271d.png",
    "static/media/home_bg.jpg": "./static/media/home_bg.6ebf11095123b5d59f25.jpg",
    "static/media/student_comp-01.png": "./static/media/student_comp-01.9c91731f0f3f60feb79b.png",
    "static/media/student_comp-02.png": "./static/media/student_comp-02.349b4e475f0c60c78c26.png",
    "static/media/SUT-Calendar.png": "./static/media/SUT-Calendar.6b70e68e1f2be3b9ac45.png",
    "static/media/Pic-02-InterCoop.png": "./static/media/Pic-02-InterCoop.fa0c74e427c1a99aee4d.png",
    "static/media/dentistry-tech4.jpg": "./static/media/dentistry-tech4.516efe0a09bc29299b92.jpg",
    "static/media/dentistry-tech2.jpg": "./static/media/dentistry-tech2.780cd958438ffb4b7f20.jpg",
    "static/media/Pic-01-Coop.png": "./static/media/Pic-01-Coop.9ad074a4f0e1a077a08f.png",
    "static/media/medical-father.png": "./static/media/medical-father.7fd3d1a5e5b9052138d7.png",
    "static/media/dentistry-tech3.jpg": "./static/media/dentistry-tech3.fbceac7dda2ecad13f3c.jpg",
    "static/media/medicine-3.jpg": "./static/media/medicine-3.36c58628b939be1f74e0.jpg",
    "static/media/dentistry-tech1.jpg": "./static/media/dentistry-tech1.623c597a48f2acc8409e.jpg",
    "static/media/THSarabunNew.ttf": "./static/media/THSarabunNew.a60f10a0bb7be182947e.ttf",
    "static/media/Pic-03.png": "./static/media/Pic-03.3c473449618a2f1898bd.png",
    "static/media/dentistry-tech6.jpg": "./static/media/dentistry-tech6.5bdf830c9ac2a8a1d83e.jpg",
    "static/media/dentistry-tech7.jpg": "./static/media/dentistry-tech7.b8b112567b4abfa124f3.jpg",
    "static/media/dentistry-tech8.jpg": "./static/media/dentistry-tech8.e721d6abaca63ffb0674.jpg",
    "static/media/dentistry-tech5.jpg": "./static/media/dentistry-tech5.e67c11ea447e343f9796.jpg",
    "static/media/Pic-06.png": "./static/media/Pic-06.71f160938a4ee48d8375.png",
    "static/media/Pic-04.png": "./static/media/Pic-04.72d82666d845f7b5fa1e.png",
    "static/media/Pic-02.png": "./static/media/Pic-02.51c3dcf79e09727923ae.png",
    "static/media/illus-maindata_reg.png": "./static/media/illus-maindata_reg.b20db4a40b3c0301ac29.png",
    "static/media/Pic-07.png": "./static/media/Pic-07.1a9559194af9cc1d0174.png",
    "static/media/Pic-05.png": "./static/media/Pic-05.22cc22adefa1d217ccd7.png",
    "static/media/medicine-2.jpg": "./static/media/medicine-2.8380c2b4774b20e00cc6.jpg",
    "static/media/01-Sci.png": "./static/media/01-Sci.2d39883a28386bff00a0.png",
    "static/media/09-DigiT.png": "./static/media/09-DigiT.7cbaf8dc5ee18d2b894d.png",
    "static/media/05-Med.png": "./static/media/05-Med.8ad318fa5b022147b120.png",
    "static/media/03-Agri.png": "./static/media/03-Agri.e0559c4e2b31f38fc721.png",
    "static/media/SUT_freshmen-mobile-bg.png": "./static/media/SUT_freshmen-mobile-bg.fb5c369c6e70956f5b5c.png",
    "static/media/04-Engi.png": "./static/media/04-Engi.9adb8daa6bc99e61968b.png",
    "static/media/Pic-01.png": "./static/media/Pic-01.250d9f6f420baaf013fc.png",
    "static/media/07-Dent.png": "./static/media/07-Dent.adfb299e8e6a7714ec78.png",
    "static/media/02-Soctech.png": "./static/media/02-Soctech.757e01760bda3773f700.png",
    "static/media/08-PubH.png": "./static/media/08-PubH.5c5c4351d06f248f82be.png",
    "static/media/regisCredit3.jpg": "./static/media/regisCredit3.e2eb1a2122d263606c03.jpg",
    "static/media/regis-home.png": "./static/media/regis-home.271d6fc38893fa6bcfc9.png",
    "static/media/regisCredit4.jpg": "./static/media/regisCredit4.efdaa15383a08a695175.jpg",
    "static/media/06-Nurs.png": "./static/media/06-Nurs.153ade40de22777c2598.png",
    "static/media/04-11-illus.png": "./static/media/04-11-illus.16d9e37af895a259cdd0.png",
    "static/media/regisCredit2.jpg": "./static/media/regisCredit2.8b11a54c07a0d2a9114e.jpg",
    "static/media/regisCredit6.jpg": "./static/media/regisCredit6.579b04af14cb04120f11.jpg",
    "static/media/regisCredit5.jpg": "./static/media/regisCredit5.db6d373c740fc17fbb33.jpg",
    "static/media/sci-table.png": "./static/media/sci-table.d5281bb6b3ff4fcc3e53.png",
    "static/media/regisCredit1.jpg": "./static/media/regisCredit1.b1f10841ed88b350fe8a.jpg",
    "static/media/illus-maindata_H79.png": "./static/media/illus-maindata_H79.a0095d26c5c8f98b13e3.png",
    "static/media/illus-maindata_H71.png": "./static/media/illus-maindata_H71.131abf47a161a62fafb4.png",
    "static/media/illus-maindata_H70.png": "./static/media/illus-maindata_H70.b97cad638729366c29cc.png",
    "static/media/illus-maindata_H81.png": "./static/media/illus-maindata_H81.a7a3d1f23986e9441db3.png",
    "static/media/illus-maindata_sci-scholaship-end.png": "./static/media/illus-maindata_sci-scholaship-end.14f468040d5bf8b3c6e2.png",
    "static/media/SUT-Light.ttf": "./static/media/SUT-Light.554db6add95174d316ed.ttf",
    "static/media/SUT-Regular.ttf": "./static/media/SUT-Regular.c350a5590a1e765dcd14.ttf",
    "static/media/SUT-Bold.ttf": "./static/media/SUT-Bold.087e64e212364553e367.ttf",
    "static/media/illus-maindata_H80.png": "./static/media/illus-maindata_H80.ce867f32d2361121fd48.png",
    "static/media/NotoSansThai-Light.ttf": "./static/media/NotoSansThai-Light.e683fde7ba1213e3e296.ttf",
    "static/media/NotoSansThai-Regular.ttf": "./static/media/NotoSansThai-Regular.fb120c4678511bdfd87f.ttf",
    "static/media/NotoSansThai-Bold.ttf": "./static/media/NotoSansThai-Bold.c9763ba4c00a214e2505.ttf",
    "static/media/illus-maindata_H28-2.png": "./static/media/illus-maindata_H28-2.2cea7ad7ead4a878fb75.png",
    "static/media/illus-maindata_H28-1.png": "./static/media/illus-maindata_H28-1.06194f5098c3b2fb372f.png",
    "static/media/illus-maindata_H86-1.png": "./static/media/illus-maindata_H86-1.3450cd0e5bd4a430636f.png",
    "static/media/illus-maindata_H86-2.png": "./static/media/illus-maindata_H86-2.dc0fcb3210378c405fc4.png",
    "static/media/illus-maindata_H86-3.png": "./static/media/illus-maindata_H86-3.b2bbe76468bfcdbbb677.png",
    "static/media/Brevia-Regular.otf": "./static/media/Brevia-Regular.be5625c23a3d12c9fe86.otf",
    "static/media/engi1.png": "./static/media/engi1.6706d768be84145dbaca.png",
    "static/media/Brevia-LightItalic.otf": "./static/media/Brevia-LightItalic.b7c3419547b23b88e1af.otf",
    "static/media/revicons.eot": "./static/media/revicons.a77de540a38981833f9e.eot",
    "static/media/revicons.ttf": "./static/media/revicons.57fd05d4ae650374c8de.ttf",
    "static/media/logo.svg": "./static/media/logo.7939e464cf13b284a5dc068b34d302fd.svg",
    "static/media/logo2.svg": "./static/media/logo2.01918a3b5207cbdd00d65892276f7a90.svg",
    "static/media/H67-2.svg": "./static/media/H67-2.efdf99db5502b27dd3d3125f613c8738.svg",
    "static/media/revicons.woff": "./static/media/revicons.e8746a624ed098489406.woff",
    "static/media/H67-1.svg": "./static/media/H67-1.d076f6a34538ad696ad88e5b50bf46e2.svg",
    "static/media/H67-6.svg": "./static/media/H67-6.ce52a58bac0314c078dbd8986af87ceb.svg",
    "static/media/H67-4.svg": "./static/media/H67-4.361081d98fab8f68af71a0a5f7d5dc0e.svg",
    "static/media/digitech1-c.svg": "./static/media/digitech1-c.d362a1524aaae676d98b40c3358bc2bd.svg",
    "static/media/digitech6-s.svg": "./static/media/digitech6-s.b46cb85bd49e22622957da92ae469e62.svg",
    "static/media/H67-5.svg": "./static/media/H67-5.c32e8fc51fcbac61779611a764ad18f2.svg",
    "static/media/H67-3.svg": "./static/media/H67-3.79950a44e1456ee22c3b57c132aaf9c0.svg",
    "static/media/digitech5-e-2.svg": "./static/media/digitech5-e-2.54f367df64b8f06225275534c9f6502c.svg",
    "static/media/digitech3-e-1.svg": "./static/media/digitech3-e-1.ee9cce88ea4e4f0a28fa36dd96746c95.svg",
    "static/media/H67-7.svg": "./static/media/H67-7.f4864af17c43a54ea74c3752c5f0ccdf.svg",
    "static/media/digitech2-r.svg": "./static/media/digitech2-r.41544f8ad42d06733571b9a11acfdefe.svg",
    "static/media/icons-website-while.svg": "./static/media/icons-website-while.09816f208dbb22776c5bc89a0da99d72.svg",
    "static/media/H67-8.svg": "./static/media/H67-8.b29aa9daa27967995f4850f2bbac567b.svg",
    "static/media/digitech4-p.svg": "./static/media/digitech4-p.d76d038828b5c212582539d01781850a.svg",
    "static/media/icon-note.svg": "./static/media/icon-note.72da6b86093c3ef6bc05170e2226d57b.svg",
    "static/media/checklist.svg": "./static/media/checklist.4ae3ffaea07affab751cb9e7a00dd9eb.svg",
    "static/media/icon-twitter.svg": "./static/media/icon-twitter.3137300a747af5b603231efb1281b3a6.svg",
    "static/media/title-dent-2.svg": "./static/media/title-dent-2.36b98923d024ecf4a48a1ba74d267e73.svg",
    "static/media/title-pubh-2.svg": "./static/media/title-pubh-2.f9b96c9a29d9e0cdb543bff4781858a6.svg",
    "static/media/title-agri-2.svg": "./static/media/title-agri-2.dc8abb86013c50a8c5ebf6b8d4c6e65a.svg",
    "static/media/title-digi-2.svg": "./static/media/title-digi-2.cf1d372f893921c1ed3b253484d976f4.svg",
    "static/media/title-engi-2.svg": "./static/media/title-engi-2.80a43065abd9de8b993e7b3c9a485fb9.svg",
    "static/media/title-med-2.svg": "./static/media/title-med-2.bb7017572b8282d06e229d095a8f31c0.svg",
    "static/media/title-nurs-2.svg": "./static/media/title-nurs-2.67f4a99eb03b1870cd4a48d3ca59b62c.svg",
    "static/media/title-sci-2.svg": "./static/media/title-sci-2.472c745e5b1931366ea8364d3d3df2b2.svg",
    "static/media/title-soct-2.svg": "./static/media/title-soct-2.e85dad2698cb6bbeadac65c0b7d93f4c.svg",
    "static/media/icon-file-pdf-pink.svg": "./static/media/icon-file-pdf-pink.1193c59ddaabfb2bf9423784077371c0.svg",
    "static/media/icon-file-pdf.svg": "./static/media/icon-file-pdf.1b879f832ee26e9c2052e20804900492.svg",
    "static/media/H09-1.svg": "./static/media/H09-1.4837122fb5e36fab51e895582e21284f.svg",
    "static/media/icons-office-phone-while.svg": "./static/media/icons-office-phone-while.4c6d360dc55e955f37bfa1f54c257023.svg",
    "static/media/H09-2.svg": "./static/media/H09-2.2eeb3cd69566ec223bfb639f9fbf3e83.svg",
    "static/media/pencil-green.svg": "./static/media/pencil-green.ca27667c4c0fd6b50189af0c39462dc0.svg",
    "static/media/title-dent-3.svg": "./static/media/title-dent-3.dfd584fa4bfa28c6432f4f5e4b84cede.svg",
    "static/media/title-pubh-3.svg": "./static/media/title-pubh-3.33c9040b47312bc3473ca09e1165bc24.svg",
    "static/media/title-sci-3.svg": "./static/media/title-sci-3.513b200911ad63cf59cd0da186d636e9.svg",
    "static/media/title-soct-3.svg": "./static/media/title-soct-3.751e38af5b2c4bf37051fdb0505a96f9.svg",
    "static/media/title-agri-3.svg": "./static/media/title-agri-3.780534a620ae79996725ba5a3999c0d3.svg",
    "static/media/title-digi-3.svg": "./static/media/title-digi-3.8d2d0f8442c90cfdb9db0a91c3b50d39.svg",
    "static/media/title-engi-3.svg": "./static/media/title-engi-3.49a6618977e5f3ab4fbed0683775ebe8.svg",
    "static/media/title-med-3.svg": "./static/media/title-med-3.7108a54eb3599b7da886a863dcce27a1.svg",
    "static/media/title-nurs-3.svg": "./static/media/title-nurs-3.5dd17fca7dabf6372cfa63a2973da3d6.svg",
    "static/media/icon-paper.svg": "./static/media/icon-paper.02c46f352af782a8fabb5025a2f039d0.svg",
    "static/media/icon-scanner.svg": "./static/media/icon-scanner.aac14e894f3b81014d5d0cb5f26a4bc3.svg",
    "static/media/icon-tiktok.svg": "./static/media/icon-tiktok.97063000932cf00641517425a454a505.svg",
    "static/media/button-next-up.svg": "./static/media/button-next-up.4f08136c765d96f2a0dcf5b335c3f358.svg",
    "static/media/H76.svg": "./static/media/H76.9845f8c9784f58626c16b9d5f372afd5.svg",
    "static/media/next.svg": "./static/media/next.2679b8a93a2722bc00a0ec1442d38f8b.svg",
    "static/media/engi.svg": "./static/media/engi.b477c3e8e424bd3559af67e615979d41.svg",
    "static/media/icon-awesome-hand-point-right.svg": "./static/media/icon-awesome-hand-point-right.70a704baeb09f862ef5ce06076d2dc06.svg",
    "static/media/title-dent-1.svg": "./static/media/title-dent-1.a970472192ad79c3cfb2980fe61e5698.svg",
    "static/media/title-pubh-1.svg": "./static/media/title-pubh-1.c7c39a480ee9dc24f5596bd5f0afa1eb.svg",
    "index.html": "./index.html",
    "static/media/title-agri-1.svg": "./static/media/title-agri-1.7f88c664479ef9cac6ee88a4e5a15e43.svg",
    "static/media/title-digi-1.svg": "./static/media/title-digi-1.6e0b08d2ce4f7d42679824d94f8d4b71.svg",
    "static/media/title-engi-1.svg": "./static/media/title-engi-1.3c4afb49563c2bf574cebf0fac871853.svg",
    "static/media/title-med-1.svg": "./static/media/title-med-1.28ef55eb9693cefd1108972e8af759ef.svg",
    "static/media/title-nurs-1.svg": "./static/media/title-nurs-1.bcfc439f01a27599d36468bcc3ee681d.svg",
    "static/media/title-sci-1.svg": "./static/media/title-sci-1.d65875339a64023b2aae9656ed5014fd.svg",
    "static/media/title-soct-1.svg": "./static/media/title-soct-1.2c54da8532e64d3e5116bcfb8b0e1602.svg",
    "static/media/H73-1.svg": "./static/media/H73-1.4afc42e8c03a1035423500f830c7d042.svg",
    "static/media/icon-file-download.svg": "./static/media/icon-file-download.c46e76097bce62a4eb025cca8ed2c50b.svg",
    "static/media/icon-email.svg": "./static/media/icon-email.b8bb303295397fec32c8bf1791f4448f.svg",
    "static/media/icon-email-while.svg": "./static/media/icon-email-while.1af448d654c8e000c5e729b71c4be6dc.svg",
    "static/media/H73-2.svg": "./static/media/H73-2.bbea8dba937561cea3993491e4126252.svg",
    "static/media/09-icon-paragraph.svg": "./static/media/09-icon-paragraph.9e42499ff81443341e2cd0b9fd2bf753.svg",
    "static/media/bullet.svg": "./static/media/bullet.5de044cb4c7c2cfaab25dc92cbb33d96.svg",
    "static/media/icon-facebook.svg": "./static/media/icon-facebook.c17d9f0bca2dfe1cc7d9677ce088652d.svg",
    "static/media/icon-facebook-while.svg": "./static/media/icon-facebook-while.b945210bef46c5ff6fb224a7202ca7e7.svg",
    "static/media/Icon awesome-facebook.svg": "./static/media/Icon awesome-facebook.372026453a092728e004394eeea27274.svg",
    "static/media/icons-phone-while.svg": "./static/media/icons-phone-while.e4d8ba454aeb62fab46099b2238d7dc0.svg",
    "static/media/icon-circle-notch180.svg": "./static/media/icon-circle-notch180.b24fea908cf17d7a01f95ff4c5203c58.svg",
    "static/media/icon-circle-notch90.svg": "./static/media/icon-circle-notch90.59bc5443933c3ac830a9735a9936c510.svg",
    "static/media/icon-video.svg": "./static/media/icon-video.d7ab9c0dd554f4ef5ed1a237173b1b44.svg",
    "static/media/icon-circle-notch-orenge.svg": "./static/media/icon-circle-notch-orenge.5e3b83f45de0e06d6db3b6fa910bf3ac.svg",
    "static/media/icon-slide-left.svg": "./static/media/icon-slide-left.a349356d419b294f34193a561f8e5b7e.svg",
    "static/media/icon-slide-right.svg": "./static/media/icon-slide-right.be3a3d4b5a4131585185da3166568c0b.svg",
    "static/media/rectangle-44.svg": "./static/media/rectangle-44.92c2af6614e902558af99e47fe3c2ba7.svg",
    "static/media/rectangle-39.svg": "./static/media/rectangle-39.cf8238cdfc1961cd44a9ade30401889e.svg",
    "static/media/Ellipse 31.svg": "./static/media/Ellipse 31.4be617ce055e9e498fb60a2be5e51f93.svg",
    "static/media/Ellipse 32.svg": "./static/media/Ellipse 32.e61f45f67a77abd29a8d12c3fb2d9bf3.svg",
    "static/media/Ellipse 34.svg": "./static/media/Ellipse 34.a409095245999b03796d1ce8ed4aa4f2.svg",
    "main.fc2f7450.css.map": "./static/css/main.fc2f7450.css.map",
    "main.f70e22a9.js.map": "./static/js/main.f70e22a9.js.map",
    "453.ecd021e3.chunk.js.map": "./static/js/453.ecd021e3.chunk.js.map"
  },
  "entrypoints": [
    "static/css/main.fc2f7450.css",
    "static/js/main.f70e22a9.js"
  ]
}