<svg xmlns="http://www.w3.org/2000/svg" width="21.32" height="21.32" viewBox="0 0 21.32 21.32">
  <path id="Icon_awesome-phone-alt" data-name="Icon awesome-phone-alt" d="M20.711,15.066l-4.664-2a1,1,0,0,0-1.166.287l-2.065,2.523A15.434,15.434,0,0,1,5.438,8.5L7.962,6.434a1,1,0,0,0,.287-1.166L6.25.6A1.006,1.006,0,0,0,5.105.026l-4.331,1A1,1,0,0,0,0,2,19.319,19.319,0,0,0,19.321,21.32a1,1,0,0,0,.974-.775l1-4.331a1.011,1.011,0,0,0-.583-1.149Z" fill="#fff"/>
</svg>
