{
  "project_info": {
    "project_number": "186470766035",
    "firebase_url": "https://wall-street-idle-66093686.firebaseio.com",
    "project_id": "wall-street-idle-66093686",
    "storage_bucket": "wall-street-idle-66093686.appspot.com"
  },
  "client": [
    {
      "client_info": {
        "mobilesdk_app_id": "1:186470766035:android:95a7d971db15c595584b26",
        "android_client_info": {
          "package_name": "com.Eden.WallStreetIdle"
        }
      },
      "oauth_client": [
        {
          "client_id": "186470766035-28lrtfb33qaqkgkb13pfcuu5igt483f3.apps.googleusercontent.com",
          "client_type": 1,
          "android_info": {
            "package_name": "com.Eden.WallStreetIdle",
            "certificate_hash": "d6e1eee68923d934d5160e02cd52ea2a940a0a9b"
          }
        },
        {
          "client_id": "186470766035-0ncoqtov98ih3abkpufgs75s3ehrgmiu.apps.googleusercontent.com",
          "client_type": 1,
          "android_info": {
            "package_name": "com.Eden.WallStreetIdle",
            "certificate_hash": "89afbdcf27bf13317f1316dbae7e7bd1e33e5a25"
          }
        },
        {
          "client_id": "186470766035-dt21qcp2hmr155fvrdko8rj4408e5tcn.apps.googleusercontent.com",
          "client_type": 3
        }
      ],
      "api_key": [
        {
          "current_key": "AIzaSyD4JIxZ3OHmEzP-mbN9nTgain0jCm-ZlOw"
        }
      ],
      "services": {
        "appinvite_service": {
          "other_platform_oauth_client": [
            {
              "client_id": "186470766035-dt21qcp2hmr155fvrdko8rj4408e5tcn.apps.googleusercontent.com",
              "client_type": 3
            }
          ]
        }
      }
    }
  ],
  "configuration_version": "1"
}