{
  "culture": "en",
  "texts": {
    "Menu:Home": "Home",
    "Welcome": "Welcome",
    "LongWelcomeMessage": "Welcome to the application. This is a startup project based on the ABP framework. For more information, visit abp.io.",

    "Permission:ExampAbp": "ExampAbp",
    "Permission:Library": "Library Management",
    "Permission:Library.Create": "Creating new Categories",
    "Permission:Library.Edit": "Editing the Categories",
    "Permission:Library.Delete": "Deleting the Categories"
  }
}
