{
  "project_info": {
    "project_number": "977663698040",
    "project_id": "apps-ammonia-sensor",
    "storage_bucket": "apps-ammonia-sensor.appspot.com"
  },
  "client": [
    {
      "client_info": {
        "mobilesdk_app_id": "1:977663698040:android:27af66a4bafe30af95798d",
        "android_client_info": {
          "package_name": "com.fadhlidzilikampohan.appsammoniasensor"
        }
      },
      "oauth_client": [
        {
          "client_id": "977663698040-3bunkmt5nc3idpoospeljm6dv6rqeocp.apps.googleusercontent.com",
          "client_type": 3
        }
      ],
      "api_key": [
        {
          "current_key": "AIzaSyASlmc2X4wsIiDuurY4RrBfnINRA0CWN_w"
        }
      ],
      "services": {
        "appinvite_service": {
          "other_platform_oauth_client": [
            {
              "client_id": "977663698040-3bunkmt5nc3idpoospeljm6dv6rqeocp.apps.googleusercontent.com",
              "client_type": 3
            }
          ]
        }
      }
    }
  ],
  "configuration_version": "1"
}