{
  "project_info": {
    "project_number": "1033609663254",
    "firebase_url": "https://apps-quiz-firebase-default-rtdb.firebaseio.com",
    "project_id": "apps-quiz-firebase",
    "storage_bucket": "apps-quiz-firebase.appspot.com"
  },
  "client": [
    {
      "client_info": {
        "mobilesdk_app_id": "1:1033609663254:android:ed9f26d02c912af409f637",
        "android_client_info": {
          "package_name": "com.muhammadfadhlidzilikram.apps_quiz_firebase"
        }
      },
      "oauth_client": [
        {
          "client_id": "1033609663254-ab8he8ikk69tr7mdjlf0l4l88s582loe.apps.googleusercontent.com",
          "client_type": 3
        }
      ],
      "api_key": [
        {
          "current_key": "AIzaSyBuKXCq8fUJrk0yb7QXm_4oEsFGplJjuSc"
        }
      ],
      "services": {
        "appinvite_service": {
          "other_platform_oauth_client": [
            {
              "client_id": "1033609663254-ab8he8ikk69tr7mdjlf0l4l88s582loe.apps.googleusercontent.com",
              "client_type": 3
            }
          ]
        }
      }
    }
  ],
  "configuration_version": "1"
}