{
  "project_info": {
    "project_number": "209197296820",
    "project_id": "apps-realtime-firebase",
    "storage_bucket": "apps-realtime-firebase.appspot.com"
  },
  "client": [
    {
      "client_info": {
        "mobilesdk_app_id": "1:209197296820:android:e7f76c1ff51336f2c33be1",
        "android_client_info": {
          "package_name": "com.fadhlidzilikampohan.apps_realtime_firebase"
        }
      },
      "oauth_client": [
        {
          "client_id": "209197296820-47gi87strmdl19am0o7lk7a7uiecie6k.apps.googleusercontent.com",
          "client_type": 3
        }
      ],
      "api_key": [
        {
          "current_key": "AIzaSyD8HUIypGQs8zMzhHGR7wJrwxqcEKcmk9Q"
        }
      ],
      "services": {
        "appinvite_service": {
          "other_platform_oauth_client": [
            {
              "client_id": "209197296820-47gi87strmdl19am0o7lk7a7uiecie6k.apps.googleusercontent.com",
              "client_type": 3
            }
          ]
        }
      }
    }
  ],
  "configuration_version": "1"
}