{
  "project_info": {
    "project_number": "197244723548",
    "project_id": "sensor-amoniak",
    "storage_bucket": "sensor-amoniak.appspot.com"
  },
  "client": [
    {
      "client_info": {
        "mobilesdk_app_id": "1:197244723548:android:d981e78c9d6d2364686199",
        "android_client_info": {
          "package_name": "com.fadhlidzilikampohan.amoniasensor"
        }
      },
      "oauth_client": [
        {
          "client_id": "197244723548-an29da3o78dis7omr30cpn4bpimmoblp.apps.googleusercontent.com",
          "client_type": 1,
          "android_info": {
            "package_name": "com.fadhlidzilikampohan.amoniasensor",
            "certificate_hash": "3cb3494ae27ec18077e5ec5527f44918549fbb9c"
          }
        },
        {
          "client_id": "197244723548-5vbe1tnudda0rh4v2mu1rr203vvvh2v7.apps.googleusercontent.com",
          "client_type": 3
        }
      ],
      "api_key": [
        {
          "current_key": "AIzaSyA-n_yoeSshh-0HePJXrT10kjXmM0-sM6k"
        }
      ],
      "services": {
        "appinvite_service": {
          "other_platform_oauth_client": [
            {
              "client_id": "197244723548-5vbe1tnudda0rh4v2mu1rr203vvvh2v7.apps.googleusercontent.com",
              "client_type": 3
            }
          ]
        }
      }
    }
  ],
  "configuration_version": "1"
}