{
  "swagger": "2.0",
  "info": {
    "description": "Challege 8",
    "version": "1.0.0",
    "title": "Challege 8",
    "termsOfService": "http://swagger.io/terms/",
    "contact": {
      "email": "muhammad.zaky.pnl@gmail.com"
    },
    "license": {
      "name": "Apache 2.0",
      "url": "http://www.apache.org/licenses/LICENSE-2.0.html"
    }
  },
  "host": "localhost:5000",
  "basePath": "/api",
  "tags": [
    {
      "name": "player",
      "description": "Index player"
    }
  ],
  "schemes": [
    "http"
  ],
  "paths": {
    "/players": {
      "get": {
        "tags": [
          "player"
        ],
        "summary": "index player",
        "description": "melihat semua daftar player",
        "produces": [
          "application/json"
        ],
        "responses": {
          "200": {
            "description": "sukses mendapat daftar player",
            "schema": {
              "type": "object",
              "items": {
                "type": "object",
                "properties": {
                  "result": {
                    "type": "integer",
                    "example": 1
                  },
                  "message": {
                    "type": "object",
                    "example": {
                      "id": 1,
                      "username": "zaky"
                    }
                  }
                }
              }
            }
          },
          "500": {
            "description": "Error get player data",
            "schema": {
              "type": "object",
              "items": {
                "type": "object",
                "properties": {
                  "message": {
                    "type": "string",
                    "example": "Some error occurred while retrieving players."
                  }
                }
              }
            }
          }
        }
      }
    }
  }
}