{
  "project_info": {
    "project_number": "909859387283",
    "project_id": "food-apps-uk",
    "storage_bucket": "food-apps-uk.appspot.com"
  },
  "client": [
    {
      "client_info": {
        "mobilesdk_app_id": "1:909859387283:android:c34679878defac80ccda66",
        "android_client_info": {
          "package_name": "com.foodapp.waiter.app"
        }
      },
      "oauth_client": [
        {
          "client_id": "909859387283-o3fthhppmu800luivi5q9puq5l7107qn.apps.googleusercontent.com",
          "client_type": 3
        }
      ],
      "api_key": [
        {
          "current_key": "AIzaSyDyft9IQJOXfsOKgr8_oNAUIn9kYkHRiEA"
        }
      ],
      "services": {
        "appinvite_service": {
          "other_platform_oauth_client": [
            {
              "client_id": "909859387283-o3fthhppmu800luivi5q9puq5l7107qn.apps.googleusercontent.com",
              "client_type": 3
            },
            {
              "client_id": "909859387283-7tq1us8aolk2jfapd2ku2ndhs1sfnqae.apps.googleusercontent.com",
              "client_type": 2,
              "ios_info": {
                "bundle_id": "com.foodapp.waiter.app"
              }
            }
          ]
        }
      }
    },
    {
      "client_info": {
        "mobilesdk_app_id": "1:909859387283:android:5cb785035e88d158ccda66",
        "android_client_info": {
          "package_name": "com.foodappsukpartner"
        }
      },
      "oauth_client": [
        {
          "client_id": "909859387283-o3fthhppmu800luivi5q9puq5l7107qn.apps.googleusercontent.com",
          "client_type": 3
        }
      ],
      "api_key": [
        {
          "current_key": "AIzaSyDyft9IQJOXfsOKgr8_oNAUIn9kYkHRiEA"
        }
      ],
      "services": {
        "appinvite_service": {
          "other_platform_oauth_client": [
            {
              "client_id": "909859387283-o3fthhppmu800luivi5q9puq5l7107qn.apps.googleusercontent.com",
              "client_type": 3
            },
            {
              "client_id": "909859387283-7tq1us8aolk2jfapd2ku2ndhs1sfnqae.apps.googleusercontent.com",
              "client_type": 2,
              "ios_info": {
                "bundle_id": "com.foodapp.waiter.app"
              }
            }
          ]
        }
      }
    }
  ],
  "configuration_version": "1"
}