%YAML 1.1
%TAG !u! tag:unity3d.com,2011:
--- !u!1045 &1
EditorBuildSettings:
  m_ObjectHideFlags: 0
  serializedVersion: 2
  m_Scenes:
  - enabled: 1
    path: Assets/Scenes/Loading.unity
    guid: 2cda990e2423bbf4892e6590ba056729
  - enabled: 1
    path: Assets/Scenes/Lobby.unity
    guid: 7d9224783d130734eadd90f00394e4bc
  - enabled: 1
    path: Assets/Scenes/Level_01.unity
    guid: b4693a1acc9b1a84f8c024ac12e47081
  m_configObjects: {}
