Nama                          : Muhammad Ichsan
Email                         : muhammad.ichsan9@gmail.com
Sistem Operasi Yang Digunakan : Windows 10
Akun Gitlab                   : muhammad.ichsan9
Akun Telegram                 : ichsanm99
