^C:\USERS\REUF\DESKTOP\KGFPROJEKTI\RAYTRACINGINONEWEEKEND\05-2\CONSOLEAPPLICATION4\DEBUG\HELPER.OBJ|C:\USERS\REUF\DESKTOP\KGFPROJEKTI\RAYTRACINGINONEWEEKEND\05-2\CONSOLEAPPLICATION4\DEBUG\HITABLE.OBJ|C:\USERS\REUF\DESKTOP\KGFPROJEKTI\RAYTRACINGINONEWEEKEND\05-2\CONSOLEAPPLICATION4\DEBUG\HITABLE_LIST.OBJ|C:\USERS\REUF\DESKTOP\KGFPROJEKTI\RAYTRACINGINONEWEEKEND\05-2\CONSOLEAPPLICATION4\DEBUG\MAIN.OBJ|C:\USERS\REUF\DESKTOP\KGFPROJEKTI\RAYTRACINGINONEWEEKEND\05-2\CONSOLEAPPLICATION4\DEBUG\RAY.OBJ|C:\USERS\REUF\DESKTOP\KGFPROJEKTI\RAYTRACINGINONEWEEKEND\05-2\CONSOLEAPPLICATION4\DEBUG\SPHERE.OBJ|C:\USERS\REUF\DESKTOP\KGFPROJEKTI\RAYTRACINGINONEWEEKEND\05-2\CONSOLEAPPLICATION4\DEBUG\STDAFX.OBJ|C:\USERS\REUF\DESKTOP\KGFPROJEKTI\RAYTRACINGINONEWEEKEND\05-2\CONSOLEAPPLICATION4\DEBUG\VEC3.OBJ
/OUT:"C:\USERS\REUF\DESKTOP\KGFPROJEKTI\RAYTRACINGINONEWEEKEND\05-2\DEBUG\RAYTRACIOW00.EXE" /INCREMENTAL /NOLOGO KERNEL32.LIB USER32.LIB GDI32.LIB WINSPOOL.LIB COMDLG32.LIB ADVAPI32.LIB SHELL32.LIB OLE32.LIB OLEAUT32.LIB UUID.LIB ODBC32.LIB ODBCCP32.LIB /MANIFEST /MANIFESTUAC:"level='asInvoker' uiAccess='false'" /manifest:embed /DEBUG /PDB:"C:\USERS\REUF\DESKTOP\KGFPROJEKTI\RAYTRACINGINONEWEEKEND\05-2\DEBUG\RAYTRACIOW00.PDB" /SUBSYSTEM:CONSOLE /TLBID:1 /DYNAMICBASE /NXCOMPAT /IMPLIB:"C:\USERS\REUF\DESKTOP\KGFPROJEKTI\RAYTRACINGINONEWEEKEND\05-2\DEBUG\RAYTRACIOW00.LIB" /MACHINE:X86 DEBUG\HITABLE.OBJDEBUG\HITABLE_LIST.OBJDEBUG\MAIN.OBJDEBUG\HELPER.OBJDEBUG\RAY.OBJDEBUG\SPHERE.OBJDEBUG\STDAFX.OBJDEBUG\VEC3.OBJ
^C:\USERS\MUHAMED.HALILOVIC\DESKTOP\RAYTRACINGINONEWEEK\05-2\CONSOLEAPPLICATION4\DEBUG\HELPER.OBJ|C:\USERS\MUHAMED.HALILOVIC\DESKTOP\RAYTRACINGINONEWEEK\05-2\CONSOLEAPPLICATION4\DEBUG\HITABLE.OBJ|C:\USERS\MUHAMED.HALILOVIC\DESKTOP\RAYTRACINGINONEWEEK\05-2\CONSOLEAPPLICATION4\DEBUG\HITABLE_LIST.OBJ|C:\USERS\MUHAMED.HALILOVIC\DESKTOP\RAYTRACINGINONEWEEK\05-2\CONSOLEAPPLICATION4\DEBUG\MAIN.OBJ|C:\USERS\MUHAMED.HALILOVIC\DESKTOP\RAYTRACINGINONEWEEK\05-2\CONSOLEAPPLICATION4\DEBUG\RAY.OBJ|C:\USERS\MUHAMED.HALILOVIC\DESKTOP\RAYTRACINGINONEWEEK\05-2\CONSOLEAPPLICATION4\DEBUG\SPHERE.OBJ|C:\USERS\MUHAMED.HALILOVIC\DESKTOP\RAYTRACINGINONEWEEK\05-2\CONSOLEAPPLICATION4\DEBUG\STDAFX.OBJ|C:\USERS\MUHAMED.HALILOVIC\DESKTOP\RAYTRACINGINONEWEEK\05-2\CONSOLEAPPLICATION4\DEBUG\VEC3.OBJ
/OUT:"C:\USERS\MUHAMED.HALILOVIC\DESKTOP\RAYTRACINGINONEWEEK\05-2\DEBUG\RAYTRACIOW00.EXE" /INCREMENTAL /NOLOGO KERNEL32.LIB USER32.LIB GDI32.LIB WINSPOOL.LIB COMDLG32.LIB ADVAPI32.LIB SHELL32.LIB OLE32.LIB OLEAUT32.LIB UUID.LIB ODBC32.LIB ODBCCP32.LIB /MANIFEST /MANIFESTUAC:"level='asInvoker' uiAccess='false'" /manifest:embed /DEBUG /PDB:"C:\USERS\MUHAMED.HALILOVIC\DESKTOP\RAYTRACINGINONEWEEK\05-2\DEBUG\RAYTRACIOW00.PDB" /SUBSYSTEM:CONSOLE /TLBID:1 /DYNAMICBASE /NXCOMPAT /IMPLIB:"C:\USERS\MUHAMED.HALILOVIC\DESKTOP\RAYTRACINGINONEWEEK\05-2\DEBUG\RAYTRACIOW00.LIB" /MACHINE:X86 DEBUG\HITABLE.OBJDEBUG\HITABLE_LIST.OBJDEBUG\MAIN.OBJDEBUG\HELPER.OBJDEBUG\RAY.OBJDEBUG\SPHERE.OBJDEBUG\STDAFX.OBJDEBUG\VEC3.OBJ
