^C:\USERS\MUHAMED.HALILOVIC\DESKTOP\RAYTRACINGINONEWEEK\10-2\CONSOLEAPPLICATION4\CAMERA.CPP
/c /I"C:\PROGRAM FILES (X86)\MICROSOFT VISUAL STUDIO 14.0\VC\ATLMFC\SRC\MFC" /I"C:\PROGRAM FILES (X86)\MICROSOFT VISUAL STUDIO 14.0\VC\ATLMFC\SRC\MFCM" /I"C:\PROGRAM FILES (X86)\MICROSOFT VISUAL STUDIO 14.0\VC\ATLMFC\SRC\ATL" /I"C:\PROGRAM FILES (X86)\MICROSOFT VISUAL STUDIO 14.0\VC\CRT\SRC" /I"C:\PROGRAM FILES (X86)\WINDOWS KITS\10\SOURCE\10.0.10240.0\UCRT" /ZI /nologo /W3 /WX- /Od /Oy- /D WIN32 /D _DEBUG /D _CONSOLE /D _UNICODE /D UNICODE /Gm /EHsc /RTC1 /MDd /GS /fp:precise /Zc:wchar_t /Zc:forScope /Zc:inline /Fo"DEBUG\\" /Fd"DEBUG\VC140.PDB" /Gd /TP /analyze- C:\USERS\MUHAMED.HALILOVIC\DESKTOP\RAYTRACINGINONEWEEK\10-2\CONSOLEAPPLICATION4\CAMERA.CPP
^C:\USERS\MUHAMED.HALILOVIC\DESKTOP\RAYTRACINGINONEWEEK\10-2\CONSOLEAPPLICATION4\MAIN.CPP
/c /I"C:\PROGRAM FILES (X86)\MICROSOFT VISUAL STUDIO 14.0\VC\ATLMFC\SRC\MFC" /I"C:\PROGRAM FILES (X86)\MICROSOFT VISUAL STUDIO 14.0\VC\ATLMFC\SRC\MFCM" /I"C:\PROGRAM FILES (X86)\MICROSOFT VISUAL STUDIO 14.0\VC\ATLMFC\SRC\ATL" /I"C:\PROGRAM FILES (X86)\MICROSOFT VISUAL STUDIO 14.0\VC\CRT\SRC" /I"C:\PROGRAM FILES (X86)\WINDOWS KITS\10\SOURCE\10.0.10240.0\UCRT" /ZI /nologo /W3 /WX- /Od /Oy- /D WIN32 /D _DEBUG /D _CONSOLE /D _UNICODE /D UNICODE /Gm /EHsc /RTC1 /MDd /GS /fp:precise /Zc:wchar_t /Zc:forScope /Zc:inline /Fo"DEBUG\\" /Fd"DEBUG\VC140.PDB" /Gd /TP /analyze- C:\USERS\MUHAMED.HALILOVIC\DESKTOP\RAYTRACINGINONEWEEK\10-2\CONSOLEAPPLICATION4\MAIN.CPP
^C:\USERS\MUHAMED.HALILOVIC\DESKTOP\RAYTRACINGINONEWEEK\10-2\CONSOLEAPPLICATION4\HELPER.CPP
/c /I"C:\PROGRAM FILES (X86)\MICROSOFT VISUAL STUDIO 14.0\VC\ATLMFC\SRC\MFC" /I"C:\PROGRAM FILES (X86)\MICROSOFT VISUAL STUDIO 14.0\VC\ATLMFC\SRC\MFCM" /I"C:\PROGRAM FILES (X86)\MICROSOFT VISUAL STUDIO 14.0\VC\ATLMFC\SRC\ATL" /I"C:\PROGRAM FILES (X86)\MICROSOFT VISUAL STUDIO 14.0\VC\CRT\SRC" /I"C:\PROGRAM FILES (X86)\WINDOWS KITS\10\SOURCE\10.0.10240.0\UCRT" /ZI /nologo /W3 /WX- /Od /Oy- /D WIN32 /D _DEBUG /D _CONSOLE /D _UNICODE /D UNICODE /Gm /EHsc /RTC1 /MDd /GS /fp:precise /Zc:wchar_t /Zc:forScope /Zc:inline /Fo"DEBUG\\" /Fd"DEBUG\VC140.PDB" /Gd /TP /analyze- C:\USERS\MUHAMED.HALILOVIC\DESKTOP\RAYTRACINGINONEWEEK\10-2\CONSOLEAPPLICATION4\HELPER.CPP
^C:\USERS\MUHAMED.HALILOVIC\DESKTOP\RAYTRACINGINONEWEEK\10-2\CONSOLEAPPLICATION4\HITABLE.CPP
/c /I"C:\PROGRAM FILES (X86)\MICROSOFT VISUAL STUDIO 14.0\VC\ATLMFC\SRC\MFC" /I"C:\PROGRAM FILES (X86)\MICROSOFT VISUAL STUDIO 14.0\VC\ATLMFC\SRC\MFCM" /I"C:\PROGRAM FILES (X86)\MICROSOFT VISUAL STUDIO 14.0\VC\ATLMFC\SRC\ATL" /I"C:\PROGRAM FILES (X86)\MICROSOFT VISUAL STUDIO 14.0\VC\CRT\SRC" /I"C:\PROGRAM FILES (X86)\WINDOWS KITS\10\SOURCE\10.0.10240.0\UCRT" /ZI /nologo /W3 /WX- /Od /Oy- /D WIN32 /D _DEBUG /D _CONSOLE /D _UNICODE /D UNICODE /Gm /EHsc /RTC1 /MDd /GS /fp:precise /Zc:wchar_t /Zc:forScope /Zc:inline /Fo"DEBUG\\" /Fd"DEBUG\VC140.PDB" /Gd /TP /analyze- C:\USERS\MUHAMED.HALILOVIC\DESKTOP\RAYTRACINGINONEWEEK\10-2\CONSOLEAPPLICATION4\HITABLE.CPP
^C:\USERS\MUHAMED.HALILOVIC\DESKTOP\RAYTRACINGINONEWEEK\10-2\CONSOLEAPPLICATION4\HITABLE_LIST.CPP
/c /I"C:\PROGRAM FILES (X86)\MICROSOFT VISUAL STUDIO 14.0\VC\ATLMFC\SRC\MFC" /I"C:\PROGRAM FILES (X86)\MICROSOFT VISUAL STUDIO 14.0\VC\ATLMFC\SRC\MFCM" /I"C:\PROGRAM FILES (X86)\MICROSOFT VISUAL STUDIO 14.0\VC\ATLMFC\SRC\ATL" /I"C:\PROGRAM FILES (X86)\MICROSOFT VISUAL STUDIO 14.0\VC\CRT\SRC" /I"C:\PROGRAM FILES (X86)\WINDOWS KITS\10\SOURCE\10.0.10240.0\UCRT" /ZI /nologo /W3 /WX- /Od /Oy- /D WIN32 /D _DEBUG /D _CONSOLE /D _UNICODE /D UNICODE /Gm /EHsc /RTC1 /MDd /GS /fp:precise /Zc:wchar_t /Zc:forScope /Zc:inline /Fo"DEBUG\\" /Fd"DEBUG\VC140.PDB" /Gd /TP /analyze- C:\USERS\MUHAMED.HALILOVIC\DESKTOP\RAYTRACINGINONEWEEK\10-2\CONSOLEAPPLICATION4\HITABLE_LIST.CPP
^C:\USERS\MUHAMED.HALILOVIC\DESKTOP\RAYTRACINGINONEWEEK\10-2\CONSOLEAPPLICATION4\MATERIAL.CPP
/c /I"C:\PROGRAM FILES (X86)\MICROSOFT VISUAL STUDIO 14.0\VC\ATLMFC\SRC\MFC" /I"C:\PROGRAM FILES (X86)\MICROSOFT VISUAL STUDIO 14.0\VC\ATLMFC\SRC\MFCM" /I"C:\PROGRAM FILES (X86)\MICROSOFT VISUAL STUDIO 14.0\VC\ATLMFC\SRC\ATL" /I"C:\PROGRAM FILES (X86)\MICROSOFT VISUAL STUDIO 14.0\VC\CRT\SRC" /I"C:\PROGRAM FILES (X86)\WINDOWS KITS\10\SOURCE\10.0.10240.0\UCRT" /ZI /nologo /W3 /WX- /Od /Oy- /D WIN32 /D _DEBUG /D _CONSOLE /D _UNICODE /D UNICODE /Gm /EHsc /RTC1 /MDd /GS /fp:precise /Zc:wchar_t /Zc:forScope /Zc:inline /Fo"DEBUG\\" /Fd"DEBUG\VC140.PDB" /Gd /TP /analyze- C:\USERS\MUHAMED.HALILOVIC\DESKTOP\RAYTRACINGINONEWEEK\10-2\CONSOLEAPPLICATION4\MATERIAL.CPP
^C:\USERS\MUHAMED.HALILOVIC\DESKTOP\RAYTRACINGINONEWEEK\10-2\CONSOLEAPPLICATION4\RAY.CPP
/c /I"C:\PROGRAM FILES (X86)\MICROSOFT VISUAL STUDIO 14.0\VC\ATLMFC\SRC\MFC" /I"C:\PROGRAM FILES (X86)\MICROSOFT VISUAL STUDIO 14.0\VC\ATLMFC\SRC\MFCM" /I"C:\PROGRAM FILES (X86)\MICROSOFT VISUAL STUDIO 14.0\VC\ATLMFC\SRC\ATL" /I"C:\PROGRAM FILES (X86)\MICROSOFT VISUAL STUDIO 14.0\VC\CRT\SRC" /I"C:\PROGRAM FILES (X86)\WINDOWS KITS\10\SOURCE\10.0.10240.0\UCRT" /ZI /nologo /W3 /WX- /Od /Oy- /D WIN32 /D _DEBUG /D _CONSOLE /D _UNICODE /D UNICODE /Gm /EHsc /RTC1 /MDd /GS /fp:precise /Zc:wchar_t /Zc:forScope /Zc:inline /Fo"DEBUG\\" /Fd"DEBUG\VC140.PDB" /Gd /TP /analyze- C:\USERS\MUHAMED.HALILOVIC\DESKTOP\RAYTRACINGINONEWEEK\10-2\CONSOLEAPPLICATION4\RAY.CPP
^C:\USERS\MUHAMED.HALILOVIC\DESKTOP\RAYTRACINGINONEWEEK\10-2\CONSOLEAPPLICATION4\SPHERE.CPP
/c /I"C:\PROGRAM FILES (X86)\MICROSOFT VISUAL STUDIO 14.0\VC\ATLMFC\SRC\MFC" /I"C:\PROGRAM FILES (X86)\MICROSOFT VISUAL STUDIO 14.0\VC\ATLMFC\SRC\MFCM" /I"C:\PROGRAM FILES (X86)\MICROSOFT VISUAL STUDIO 14.0\VC\ATLMFC\SRC\ATL" /I"C:\PROGRAM FILES (X86)\MICROSOFT VISUAL STUDIO 14.0\VC\CRT\SRC" /I"C:\PROGRAM FILES (X86)\WINDOWS KITS\10\SOURCE\10.0.10240.0\UCRT" /ZI /nologo /W3 /WX- /Od /Oy- /D WIN32 /D _DEBUG /D _CONSOLE /D _UNICODE /D UNICODE /Gm /EHsc /RTC1 /MDd /GS /fp:precise /Zc:wchar_t /Zc:forScope /Zc:inline /Fo"DEBUG\\" /Fd"DEBUG\VC140.PDB" /Gd /TP /analyze- C:\USERS\MUHAMED.HALILOVIC\DESKTOP\RAYTRACINGINONEWEEK\10-2\CONSOLEAPPLICATION4\SPHERE.CPP
^C:\USERS\MUHAMED.HALILOVIC\DESKTOP\RAYTRACINGINONEWEEK\10-2\CONSOLEAPPLICATION4\STDAFX.CPP
/c /I"C:\PROGRAM FILES (X86)\MICROSOFT VISUAL STUDIO 14.0\VC\ATLMFC\SRC\MFC" /I"C:\PROGRAM FILES (X86)\MICROSOFT VISUAL STUDIO 14.0\VC\ATLMFC\SRC\MFCM" /I"C:\PROGRAM FILES (X86)\MICROSOFT VISUAL STUDIO 14.0\VC\ATLMFC\SRC\ATL" /I"C:\PROGRAM FILES (X86)\MICROSOFT VISUAL STUDIO 14.0\VC\CRT\SRC" /I"C:\PROGRAM FILES (X86)\WINDOWS KITS\10\SOURCE\10.0.10240.0\UCRT" /ZI /nologo /W3 /WX- /Od /Oy- /D WIN32 /D _DEBUG /D _CONSOLE /D _UNICODE /D UNICODE /Gm /EHsc /RTC1 /MDd /GS /fp:precise /Zc:wchar_t /Zc:forScope /Zc:inline /Fo"DEBUG\\" /Fd"DEBUG\VC140.PDB" /Gd /TP /analyze- C:\USERS\MUHAMED.HALILOVIC\DESKTOP\RAYTRACINGINONEWEEK\10-2\CONSOLEAPPLICATION4\STDAFX.CPP
^C:\USERS\MUHAMED.HALILOVIC\DESKTOP\RAYTRACINGINONEWEEK\10-2\CONSOLEAPPLICATION4\VEC3.CPP
/c /I"C:\PROGRAM FILES (X86)\MICROSOFT VISUAL STUDIO 14.0\VC\ATLMFC\SRC\MFC" /I"C:\PROGRAM FILES (X86)\MICROSOFT VISUAL STUDIO 14.0\VC\ATLMFC\SRC\MFCM" /I"C:\PROGRAM FILES (X86)\MICROSOFT VISUAL STUDIO 14.0\VC\ATLMFC\SRC\ATL" /I"C:\PROGRAM FILES (X86)\MICROSOFT VISUAL STUDIO 14.0\VC\CRT\SRC" /I"C:\PROGRAM FILES (X86)\WINDOWS KITS\10\SOURCE\10.0.10240.0\UCRT" /ZI /nologo /W3 /WX- /Od /Oy- /D WIN32 /D _DEBUG /D _CONSOLE /D _UNICODE /D UNICODE /Gm /EHsc /RTC1 /MDd /GS /fp:precise /Zc:wchar_t /Zc:forScope /Zc:inline /Fo"DEBUG\\" /Fd"DEBUG\VC140.PDB" /Gd /TP /analyze- C:\USERS\MUHAMED.HALILOVIC\DESKTOP\RAYTRACINGINONEWEEK\10-2\CONSOLEAPPLICATION4\VEC3.CPP
