^C:\USERS\MUHAMED.HALILOVIC\DOCUMENTS\VISUAL STUDIO 2015\PROJECTS\CONSOLEAPPLICATION4\CONSOLEAPPLICATION4\CONSOLEAPPLICATION4.CPP|C:\USERS\MUHAMED.HALILOVIC\DOCUMENTS\VISUAL STUDIO 2015\PROJECTS\CONSOLEAPPLICATION4\CONSOLEAPPLICATION4\STDAFX.CPP
C:\USERS\MUHAMED.HALILOVIC\DOCUMENTS\VISUAL STUDIO 2015\PROJECTS\CONSOLEAPPLICATION4\CONSOLEAPPLICATION4\DEBUG\VC140.PDB
C:\USERS\MUHAMED.HALILOVIC\DOCUMENTS\VISUAL STUDIO 2015\PROJECTS\CONSOLEAPPLICATION4\CONSOLEAPPLICATION4\DEBUG\VC140.IDB
C:\USERS\MUHAMED.HALILOVIC\DOCUMENTS\VISUAL STUDIO 2015\PROJECTS\CONSOLEAPPLICATION4\CONSOLEAPPLICATION4\DEBUG\CONSOLEAPPLICATION4.OBJ
C:\USERS\MUHAMED.HALILOVIC\DOCUMENTS\VISUAL STUDIO 2015\PROJECTS\CONSOLEAPPLICATION4\CONSOLEAPPLICATION4\DEBUG\STDAFX.OBJ
^C:\USERS\MUHAMED.HALILOVIC\DOCUMENTS\VISUAL STUDIO 2015\PROJECTS\CONSOLEAPPLICATION4\CONSOLEAPPLICATION4\CONSOLEAPPLICATION4.CPP
C:\USERS\MUHAMED.HALILOVIC\DOCUMENTS\VISUAL STUDIO 2015\PROJECTS\CONSOLEAPPLICATION4\CONSOLEAPPLICATION4\DEBUG\VC140.PDB
C:\USERS\MUHAMED.HALILOVIC\DOCUMENTS\VISUAL STUDIO 2015\PROJECTS\CONSOLEAPPLICATION4\CONSOLEAPPLICATION4\DEBUG\VC140.IDB
C:\USERS\MUHAMED.HALILOVIC\DOCUMENTS\VISUAL STUDIO 2015\PROJECTS\CONSOLEAPPLICATION4\CONSOLEAPPLICATION4\DEBUG\CONSOLEAPPLICATION4.OBJ
^C:\USERS\MUHAMED.HALILOVIC\DOCUMENTS\VISUAL STUDIO 2015\PROJECTS\CONSOLEAPPLICATION4\CONSOLEAPPLICATION4\STDAFX.CPP
C:\USERS\MUHAMED.HALILOVIC\DOCUMENTS\VISUAL STUDIO 2015\PROJECTS\CONSOLEAPPLICATION4\CONSOLEAPPLICATION4\DEBUG\VC140.PDB
^C:\USERS\MUHAMED.HALILOVIC\DOCUMENTS\VISUAL STUDIO 2015\PROJECTS\CONSOLEAPPLICATION4\CONSOLEAPPLICATION4\CONSOLEAPPLICATION4.CPP|C:\USERS\MUHAMED.HALILOVIC\DOCUMENTS\VISUAL STUDIO 2015\PROJECTS\CONSOLEAPPLICATION4\CONSOLEAPPLICATION4\STDAFX.CPP|C:\USERS\MUHAMED.HALILOVIC\DOCUMENTS\VISUAL STUDIO 2015\PROJECTS\CONSOLEAPPLICATION4\CONSOLEAPPLICATION4\VEC3.CPP
C:\USERS\MUHAMED.HALILOVIC\DOCUMENTS\VISUAL STUDIO 2015\PROJECTS\CONSOLEAPPLICATION4\CONSOLEAPPLICATION4\DEBUG\VC140.PDB
C:\USERS\MUHAMED.HALILOVIC\DOCUMENTS\VISUAL STUDIO 2015\PROJECTS\CONSOLEAPPLICATION4\CONSOLEAPPLICATION4\DEBUG\VC140.IDB
C:\USERS\MUHAMED.HALILOVIC\DOCUMENTS\VISUAL STUDIO 2015\PROJECTS\CONSOLEAPPLICATION4\CONSOLEAPPLICATION4\DEBUG\CONSOLEAPPLICATION4.OBJ
C:\USERS\MUHAMED.HALILOVIC\DOCUMENTS\VISUAL STUDIO 2015\PROJECTS\CONSOLEAPPLICATION4\CONSOLEAPPLICATION4\DEBUG\STDAFX.OBJ
C:\USERS\MUHAMED.HALILOVIC\DOCUMENTS\VISUAL STUDIO 2015\PROJECTS\CONSOLEAPPLICATION4\CONSOLEAPPLICATION4\DEBUG\VEC3.OBJ
^C:\USERS\MUHAMED.HALILOVIC\DOCUMENTS\VISUAL STUDIO 2015\PROJECTS\CONSOLEAPPLICATION4\CONSOLEAPPLICATION4\VEC3.CPP
C:\USERS\MUHAMED.HALILOVIC\DOCUMENTS\VISUAL STUDIO 2015\PROJECTS\CONSOLEAPPLICATION4\CONSOLEAPPLICATION4\DEBUG\VC140.PDB
^C:\USERS\MUHAMED.HALILOVIC\DOCUMENTS\VISUAL STUDIO 2015\PROJECTS\CONSOLEAPPLICATION4\CONSOLEAPPLICATION4\CONSOLEAPPLICATION4.CPP|C:\USERS\MUHAMED.HALILOVIC\DOCUMENTS\VISUAL STUDIO 2015\PROJECTS\CONSOLEAPPLICATION4\CONSOLEAPPLICATION4\RAY.CPP
C:\USERS\MUHAMED.HALILOVIC\DOCUMENTS\VISUAL STUDIO 2015\PROJECTS\CONSOLEAPPLICATION4\CONSOLEAPPLICATION4\DEBUG\VC140.PDB
C:\USERS\MUHAMED.HALILOVIC\DOCUMENTS\VISUAL STUDIO 2015\PROJECTS\CONSOLEAPPLICATION4\CONSOLEAPPLICATION4\DEBUG\VC140.IDB
C:\USERS\MUHAMED.HALILOVIC\DOCUMENTS\VISUAL STUDIO 2015\PROJECTS\CONSOLEAPPLICATION4\CONSOLEAPPLICATION4\DEBUG\CONSOLEAPPLICATION4.OBJ
C:\USERS\MUHAMED.HALILOVIC\DOCUMENTS\VISUAL STUDIO 2015\PROJECTS\CONSOLEAPPLICATION4\CONSOLEAPPLICATION4\DEBUG\RAY.OBJ
^C:\USERS\MUHAMED.HALILOVIC\DOCUMENTS\VISUAL STUDIO 2015\PROJECTS\CONSOLEAPPLICATION4\CONSOLEAPPLICATION4\RAY.CPP
C:\USERS\MUHAMED.HALILOVIC\DOCUMENTS\VISUAL STUDIO 2015\PROJECTS\CONSOLEAPPLICATION4\CONSOLEAPPLICATION4\DEBUG\VC140.PDB
^C:\USERS\MUHAMED.HALILOVIC\DOCUMENTS\VISUAL STUDIO 2015\PROJECTS\CONSOLEAPPLICATION4\CONSOLEAPPLICATION4\CONSOLEAPPLICATION4.CPP|C:\USERS\MUHAMED.HALILOVIC\DOCUMENTS\VISUAL STUDIO 2015\PROJECTS\CONSOLEAPPLICATION4\CONSOLEAPPLICATION4\HITABLE.CPP|C:\USERS\MUHAMED.HALILOVIC\DOCUMENTS\VISUAL STUDIO 2015\PROJECTS\CONSOLEAPPLICATION4\CONSOLEAPPLICATION4\HITABLE_LIST.CPP|C:\USERS\MUHAMED.HALILOVIC\DOCUMENTS\VISUAL STUDIO 2015\PROJECTS\CONSOLEAPPLICATION4\CONSOLEAPPLICATION4\SPHERE.CPP
C:\USERS\MUHAMED.HALILOVIC\DOCUMENTS\VISUAL STUDIO 2015\PROJECTS\CONSOLEAPPLICATION4\CONSOLEAPPLICATION4\DEBUG\VC140.PDB
C:\USERS\MUHAMED.HALILOVIC\DOCUMENTS\VISUAL STUDIO 2015\PROJECTS\CONSOLEAPPLICATION4\CONSOLEAPPLICATION4\DEBUG\VC140.IDB
C:\USERS\MUHAMED.HALILOVIC\DOCUMENTS\VISUAL STUDIO 2015\PROJECTS\CONSOLEAPPLICATION4\CONSOLEAPPLICATION4\DEBUG\HITABLE.OBJ
C:\USERS\MUHAMED.HALILOVIC\DOCUMENTS\VISUAL STUDIO 2015\PROJECTS\CONSOLEAPPLICATION4\CONSOLEAPPLICATION4\DEBUG\HITABLE_LIST.OBJ
C:\USERS\MUHAMED.HALILOVIC\DOCUMENTS\VISUAL STUDIO 2015\PROJECTS\CONSOLEAPPLICATION4\CONSOLEAPPLICATION4\DEBUG\SPHERE.OBJ
^C:\USERS\MUHAMED.HALILOVIC\DOCUMENTS\VISUAL STUDIO 2015\PROJECTS\CONSOLEAPPLICATION4\CONSOLEAPPLICATION4\HITABLE.CPP
C:\USERS\MUHAMED.HALILOVIC\DOCUMENTS\VISUAL STUDIO 2015\PROJECTS\CONSOLEAPPLICATION4\CONSOLEAPPLICATION4\DEBUG\VC140.PDB
^C:\USERS\MUHAMED.HALILOVIC\DOCUMENTS\VISUAL STUDIO 2015\PROJECTS\CONSOLEAPPLICATION4\CONSOLEAPPLICATION4\HITABLE_LIST.CPP
C:\USERS\MUHAMED.HALILOVIC\DOCUMENTS\VISUAL STUDIO 2015\PROJECTS\CONSOLEAPPLICATION4\CONSOLEAPPLICATION4\DEBUG\VC140.PDB
^C:\USERS\MUHAMED.HALILOVIC\DOCUMENTS\VISUAL STUDIO 2015\PROJECTS\CONSOLEAPPLICATION4\CONSOLEAPPLICATION4\SPHERE.CPP
C:\USERS\MUHAMED.HALILOVIC\DOCUMENTS\VISUAL STUDIO 2015\PROJECTS\CONSOLEAPPLICATION4\CONSOLEAPPLICATION4\DEBUG\VC140.PDB
^C:\USERS\MUHAMED.HALILOVIC\DOCUMENTS\VISUAL STUDIO 2015\PROJECTS\CONSOLEAPPLICATION4\CONSOLEAPPLICATION4\CONSOLEAPPLICATION4.CPP|C:\USERS\MUHAMED.HALILOVIC\DOCUMENTS\VISUAL STUDIO 2015\PROJECTS\CONSOLEAPPLICATION4\CONSOLEAPPLICATION4\HITABLE_LIST.CPP
C:\USERS\MUHAMED.HALILOVIC\DOCUMENTS\VISUAL STUDIO 2015\PROJECTS\CONSOLEAPPLICATION4\CONSOLEAPPLICATION4\DEBUG\VC140.PDB
C:\USERS\MUHAMED.HALILOVIC\DOCUMENTS\VISUAL STUDIO 2015\PROJECTS\CONSOLEAPPLICATION4\CONSOLEAPPLICATION4\DEBUG\VC140.IDB
C:\USERS\MUHAMED.HALILOVIC\DOCUMENTS\VISUAL STUDIO 2015\PROJECTS\CONSOLEAPPLICATION4\CONSOLEAPPLICATION4\DEBUG\CONSOLEAPPLICATION4.OBJ
^C:\USERS\MUHAMED.HALILOVIC\DOCUMENTS\VISUAL STUDIO 2015\PROJECTS\CONSOLEAPPLICATION4\CONSOLEAPPLICATION4\CONSOLEAPPLICATION4.CPP|C:\USERS\MUHAMED.HALILOVIC\DOCUMENTS\VISUAL STUDIO 2015\PROJECTS\CONSOLEAPPLICATION4\CONSOLEAPPLICATION4\SPHERE.CPP
C:\USERS\MUHAMED.HALILOVIC\DOCUMENTS\VISUAL STUDIO 2015\PROJECTS\CONSOLEAPPLICATION4\CONSOLEAPPLICATION4\DEBUG\VC140.PDB
C:\USERS\MUHAMED.HALILOVIC\DOCUMENTS\VISUAL STUDIO 2015\PROJECTS\CONSOLEAPPLICATION4\CONSOLEAPPLICATION4\DEBUG\VC140.IDB
C:\USERS\MUHAMED.HALILOVIC\DOCUMENTS\VISUAL STUDIO 2015\PROJECTS\CONSOLEAPPLICATION4\CONSOLEAPPLICATION4\DEBUG\CONSOLEAPPLICATION4.OBJ
C:\USERS\MUHAMED.HALILOVIC\DOCUMENTS\VISUAL STUDIO 2015\PROJECTS\CONSOLEAPPLICATION4\CONSOLEAPPLICATION4\DEBUG\SPHERE.OBJ
^C:\USERS\MUHAMED.HALILOVIC\DOCUMENTS\VISUAL STUDIO 2015\PROJECTS\CONSOLEAPPLICATION4\CONSOLEAPPLICATION4\CONSOLEAPPLICATION4.CPP|C:\USERS\MUHAMED.HALILOVIC\DOCUMENTS\VISUAL STUDIO 2015\PROJECTS\CONSOLEAPPLICATION4\CONSOLEAPPLICATION4\HITABLE_LIST.CPP|C:\USERS\MUHAMED.HALILOVIC\DOCUMENTS\VISUAL STUDIO 2015\PROJECTS\CONSOLEAPPLICATION4\CONSOLEAPPLICATION4\SPHERE.CPP
C:\USERS\MUHAMED.HALILOVIC\DOCUMENTS\VISUAL STUDIO 2015\PROJECTS\CONSOLEAPPLICATION4\CONSOLEAPPLICATION4\DEBUG\VC140.PDB
C:\USERS\MUHAMED.HALILOVIC\DOCUMENTS\VISUAL STUDIO 2015\PROJECTS\CONSOLEAPPLICATION4\CONSOLEAPPLICATION4\DEBUG\VC140.IDB
C:\USERS\MUHAMED.HALILOVIC\DOCUMENTS\VISUAL STUDIO 2015\PROJECTS\CONSOLEAPPLICATION4\CONSOLEAPPLICATION4\DEBUG\HITABLE_LIST.OBJ
C:\USERS\MUHAMED.HALILOVIC\DOCUMENTS\VISUAL STUDIO 2015\PROJECTS\CONSOLEAPPLICATION4\CONSOLEAPPLICATION4\DEBUG\SPHERE.OBJ
C:\USERS\MUHAMED.HALILOVIC\DOCUMENTS\VISUAL STUDIO 2015\PROJECTS\CONSOLEAPPLICATION4\CONSOLEAPPLICATION4\DEBUG\CONSOLEAPPLICATION4.OBJ
^C:\USERS\MUHAMED.HALILOVIC\DOCUMENTS\VISUAL STUDIO 2015\PROJECTS\CONSOLEAPPLICATION4\CONSOLEAPPLICATION4\CAMERA.CPP|C:\USERS\MUHAMED.HALILOVIC\DOCUMENTS\VISUAL STUDIO 2015\PROJECTS\CONSOLEAPPLICATION4\CONSOLEAPPLICATION4\CONSOLEAPPLICATION4.CPP|C:\USERS\MUHAMED.HALILOVIC\DOCUMENTS\VISUAL STUDIO 2015\PROJECTS\CONSOLEAPPLICATION4\CONSOLEAPPLICATION4\HITABLE.CPP|C:\USERS\MUHAMED.HALILOVIC\DOCUMENTS\VISUAL STUDIO 2015\PROJECTS\CONSOLEAPPLICATION4\CONSOLEAPPLICATION4\HITABLE_LIST.CPP|C:\USERS\MUHAMED.HALILOVIC\DOCUMENTS\VISUAL STUDIO 2015\PROJECTS\CONSOLEAPPLICATION4\CONSOLEAPPLICATION4\MATERIAL.CPP|C:\USERS\MUHAMED.HALILOVIC\DOCUMENTS\VISUAL STUDIO 2015\PROJECTS\CONSOLEAPPLICATION4\CONSOLEAPPLICATION4\RAY.CPP|C:\USERS\MUHAMED.HALILOVIC\DOCUMENTS\VISUAL STUDIO 2015\PROJECTS\CONSOLEAPPLICATION4\CONSOLEAPPLICATION4\SPHERE.CPP|C:\USERS\MUHAMED.HALILOVIC\DOCUMENTS\VISUAL STUDIO 2015\PROJECTS\CONSOLEAPPLICATION4\CONSOLEAPPLICATION4\VEC3.CPP
C:\USERS\MUHAMED.HALILOVIC\DOCUMENTS\VISUAL STUDIO 2015\PROJECTS\CONSOLEAPPLICATION4\CONSOLEAPPLICATION4\DEBUG\VC140.PDB
C:\USERS\MUHAMED.HALILOVIC\DOCUMENTS\VISUAL STUDIO 2015\PROJECTS\CONSOLEAPPLICATION4\CONSOLEAPPLICATION4\DEBUG\VC140.IDB
C:\USERS\MUHAMED.HALILOVIC\DOCUMENTS\VISUAL STUDIO 2015\PROJECTS\CONSOLEAPPLICATION4\CONSOLEAPPLICATION4\DEBUG\CAMERA.OBJ
C:\USERS\MUHAMED.HALILOVIC\DOCUMENTS\VISUAL STUDIO 2015\PROJECTS\CONSOLEAPPLICATION4\CONSOLEAPPLICATION4\DEBUG\MATERIAL.OBJ
C:\USERS\MUHAMED.HALILOVIC\DOCUMENTS\VISUAL STUDIO 2015\PROJECTS\CONSOLEAPPLICATION4\CONSOLEAPPLICATION4\DEBUG\HITABLE.OBJ
C:\USERS\MUHAMED.HALILOVIC\DOCUMENTS\VISUAL STUDIO 2015\PROJECTS\CONSOLEAPPLICATION4\CONSOLEAPPLICATION4\DEBUG\HITABLE_LIST.OBJ
C:\USERS\MUHAMED.HALILOVIC\DOCUMENTS\VISUAL STUDIO 2015\PROJECTS\CONSOLEAPPLICATION4\CONSOLEAPPLICATION4\DEBUG\RAY.OBJ
C:\USERS\MUHAMED.HALILOVIC\DOCUMENTS\VISUAL STUDIO 2015\PROJECTS\CONSOLEAPPLICATION4\CONSOLEAPPLICATION4\DEBUG\SPHERE.OBJ
C:\USERS\MUHAMED.HALILOVIC\DOCUMENTS\VISUAL STUDIO 2015\PROJECTS\CONSOLEAPPLICATION4\CONSOLEAPPLICATION4\DEBUG\VEC3.OBJ
^C:\USERS\MUHAMED.HALILOVIC\DOCUMENTS\VISUAL STUDIO 2015\PROJECTS\CONSOLEAPPLICATION4\CONSOLEAPPLICATION4\CAMERA.CPP
C:\USERS\MUHAMED.HALILOVIC\DOCUMENTS\VISUAL STUDIO 2015\PROJECTS\CONSOLEAPPLICATION4\CONSOLEAPPLICATION4\DEBUG\VC140.PDB
C:\USERS\MUHAMED.HALILOVIC\DOCUMENTS\VISUAL STUDIO 2015\PROJECTS\CONSOLEAPPLICATION4\CONSOLEAPPLICATION4\DEBUG\VC140.IDB
C:\USERS\MUHAMED.HALILOVIC\DOCUMENTS\VISUAL STUDIO 2015\PROJECTS\CONSOLEAPPLICATION4\CONSOLEAPPLICATION4\DEBUG\CAMERA.OBJ
^C:\USERS\MUHAMED.HALILOVIC\DOCUMENTS\VISUAL STUDIO 2015\PROJECTS\CONSOLEAPPLICATION4\CONSOLEAPPLICATION4\MATERIAL.CPP
C:\USERS\MUHAMED.HALILOVIC\DOCUMENTS\VISUAL STUDIO 2015\PROJECTS\CONSOLEAPPLICATION4\CONSOLEAPPLICATION4\DEBUG\VC140.PDB
^C:\USERS\MUHAMED.HALILOVIC\DOCUMENTS\VISUAL STUDIO 2015\PROJECTS\CONSOLEAPPLICATION4\CONSOLEAPPLICATION4\CAMERA.CPP|C:\USERS\MUHAMED.HALILOVIC\DOCUMENTS\VISUAL STUDIO 2015\PROJECTS\CONSOLEAPPLICATION4\CONSOLEAPPLICATION4\CONSOLEAPPLICATION4.CPP
C:\USERS\MUHAMED.HALILOVIC\DOCUMENTS\VISUAL STUDIO 2015\PROJECTS\CONSOLEAPPLICATION4\CONSOLEAPPLICATION4\DEBUG\VC140.PDB
C:\USERS\MUHAMED.HALILOVIC\DOCUMENTS\VISUAL STUDIO 2015\PROJECTS\CONSOLEAPPLICATION4\CONSOLEAPPLICATION4\DEBUG\VC140.IDB
C:\USERS\MUHAMED.HALILOVIC\DOCUMENTS\VISUAL STUDIO 2015\PROJECTS\CONSOLEAPPLICATION4\CONSOLEAPPLICATION4\DEBUG\CAMERA.OBJ
^C:\USERS\MUHAMED.HALILOVIC\DOCUMENTS\VISUAL STUDIO 2015\PROJECTS\CONSOLEAPPLICATION4\CONSOLEAPPLICATION4\CAMERA.CPP|C:\USERS\MUHAMED.HALILOVIC\DOCUMENTS\VISUAL STUDIO 2015\PROJECTS\CONSOLEAPPLICATION4\CONSOLEAPPLICATION4\CONSOLEAPPLICATION4.CPP|C:\USERS\MUHAMED.HALILOVIC\DOCUMENTS\VISUAL STUDIO 2015\PROJECTS\CONSOLEAPPLICATION4\CONSOLEAPPLICATION4\HELPER.CPP|C:\USERS\MUHAMED.HALILOVIC\DOCUMENTS\VISUAL STUDIO 2015\PROJECTS\CONSOLEAPPLICATION4\CONSOLEAPPLICATION4\HITABLE.CPP|C:\USERS\MUHAMED.HALILOVIC\DOCUMENTS\VISUAL STUDIO 2015\PROJECTS\CONSOLEAPPLICATION4\CONSOLEAPPLICATION4\HITABLE_LIST.CPP|C:\USERS\MUHAMED.HALILOVIC\DOCUMENTS\VISUAL STUDIO 2015\PROJECTS\CONSOLEAPPLICATION4\CONSOLEAPPLICATION4\MATERIAL.CPP|C:\USERS\MUHAMED.HALILOVIC\DOCUMENTS\VISUAL STUDIO 2015\PROJECTS\CONSOLEAPPLICATION4\CONSOLEAPPLICATION4\RAY.CPP|C:\USERS\MUHAMED.HALILOVIC\DOCUMENTS\VISUAL STUDIO 2015\PROJECTS\CONSOLEAPPLICATION4\CONSOLEAPPLICATION4\SPHERE.CPP|C:\USERS\MUHAMED.HALILOVIC\DOCUMENTS\VISUAL STUDIO 2015\PROJECTS\CONSOLEAPPLICATION4\CONSOLEAPPLICATION4\VEC3.CPP
C:\USERS\MUHAMED.HALILOVIC\DOCUMENTS\VISUAL STUDIO 2015\PROJECTS\CONSOLEAPPLICATION4\CONSOLEAPPLICATION4\DEBUG\VC140.PDB
C:\USERS\MUHAMED.HALILOVIC\DOCUMENTS\VISUAL STUDIO 2015\PROJECTS\CONSOLEAPPLICATION4\CONSOLEAPPLICATION4\DEBUG\VC140.IDB
C:\USERS\MUHAMED.HALILOVIC\DOCUMENTS\VISUAL STUDIO 2015\PROJECTS\CONSOLEAPPLICATION4\CONSOLEAPPLICATION4\DEBUG\CONSOLEAPPLICATION4.OBJ
C:\USERS\MUHAMED.HALILOVIC\DOCUMENTS\VISUAL STUDIO 2015\PROJECTS\CONSOLEAPPLICATION4\CONSOLEAPPLICATION4\DEBUG\HELPER.OBJ
C:\USERS\MUHAMED.HALILOVIC\DOCUMENTS\VISUAL STUDIO 2015\PROJECTS\CONSOLEAPPLICATION4\CONSOLEAPPLICATION4\DEBUG\VEC3.OBJ
C:\USERS\MUHAMED.HALILOVIC\DOCUMENTS\VISUAL STUDIO 2015\PROJECTS\CONSOLEAPPLICATION4\CONSOLEAPPLICATION4\DEBUG\CAMERA.OBJ
C:\USERS\MUHAMED.HALILOVIC\DOCUMENTS\VISUAL STUDIO 2015\PROJECTS\CONSOLEAPPLICATION4\CONSOLEAPPLICATION4\DEBUG\HITABLE.OBJ
C:\USERS\MUHAMED.HALILOVIC\DOCUMENTS\VISUAL STUDIO 2015\PROJECTS\CONSOLEAPPLICATION4\CONSOLEAPPLICATION4\DEBUG\HITABLE_LIST.OBJ
C:\USERS\MUHAMED.HALILOVIC\DOCUMENTS\VISUAL STUDIO 2015\PROJECTS\CONSOLEAPPLICATION4\CONSOLEAPPLICATION4\DEBUG\MATERIAL.OBJ
C:\USERS\MUHAMED.HALILOVIC\DOCUMENTS\VISUAL STUDIO 2015\PROJECTS\CONSOLEAPPLICATION4\CONSOLEAPPLICATION4\DEBUG\RAY.OBJ
C:\USERS\MUHAMED.HALILOVIC\DOCUMENTS\VISUAL STUDIO 2015\PROJECTS\CONSOLEAPPLICATION4\CONSOLEAPPLICATION4\DEBUG\SPHERE.OBJ
^C:\USERS\MUHAMED.HALILOVIC\DOCUMENTS\VISUAL STUDIO 2015\PROJECTS\CONSOLEAPPLICATION4\CONSOLEAPPLICATION4\HELPER.CPP
C:\USERS\MUHAMED.HALILOVIC\DOCUMENTS\VISUAL STUDIO 2015\PROJECTS\CONSOLEAPPLICATION4\CONSOLEAPPLICATION4\DEBUG\VC140.PDB
^C:\USERS\MUHAMED.HALILOVIC\DOCUMENTS\VISUAL STUDIO 2015\PROJECTS\CONSOLEAPPLICATION4\CONSOLEAPPLICATION4\CAMERA.CPP|C:\USERS\MUHAMED.HALILOVIC\DOCUMENTS\VISUAL STUDIO 2015\PROJECTS\CONSOLEAPPLICATION4\CONSOLEAPPLICATION4\CONSOLEAPPLICATION4.CPP|C:\USERS\MUHAMED.HALILOVIC\DOCUMENTS\VISUAL STUDIO 2015\PROJECTS\CONSOLEAPPLICATION4\CONSOLEAPPLICATION4\HELPER.CPP|C:\USERS\MUHAMED.HALILOVIC\DOCUMENTS\VISUAL STUDIO 2015\PROJECTS\CONSOLEAPPLICATION4\CONSOLEAPPLICATION4\MATERIAL.CPP
C:\USERS\MUHAMED.HALILOVIC\DOCUMENTS\VISUAL STUDIO 2015\PROJECTS\CONSOLEAPPLICATION4\CONSOLEAPPLICATION4\DEBUG\VC140.PDB
C:\USERS\MUHAMED.HALILOVIC\DOCUMENTS\VISUAL STUDIO 2015\PROJECTS\CONSOLEAPPLICATION4\CONSOLEAPPLICATION4\DEBUG\VC140.IDB
C:\USERS\MUHAMED.HALILOVIC\DOCUMENTS\VISUAL STUDIO 2015\PROJECTS\CONSOLEAPPLICATION4\CONSOLEAPPLICATION4\DEBUG\CONSOLEAPPLICATION4.OBJ
C:\USERS\MUHAMED.HALILOVIC\DOCUMENTS\VISUAL STUDIO 2015\PROJECTS\CONSOLEAPPLICATION4\CONSOLEAPPLICATION4\DEBUG\CAMERA.OBJ
C:\USERS\MUHAMED.HALILOVIC\DOCUMENTS\VISUAL STUDIO 2015\PROJECTS\CONSOLEAPPLICATION4\CONSOLEAPPLICATION4\DEBUG\HELPER.OBJ
C:\USERS\MUHAMED.HALILOVIC\DOCUMENTS\VISUAL STUDIO 2015\PROJECTS\CONSOLEAPPLICATION4\CONSOLEAPPLICATION4\DEBUG\MATERIAL.OBJ
^C:\USERS\MUHAMED.HALILOVIC\DOCUMENTS\VISUAL STUDIO 2015\PROJECTS\CONSOLEAPPLICATION4\CONSOLEAPPLICATION4\CONSOLEAPPLICATION4.CPP|C:\USERS\MUHAMED.HALILOVIC\DOCUMENTS\VISUAL STUDIO 2015\PROJECTS\CONSOLEAPPLICATION4\CONSOLEAPPLICATION4\MATERIAL.CPP
C:\USERS\MUHAMED.HALILOVIC\DOCUMENTS\VISUAL STUDIO 2015\PROJECTS\CONSOLEAPPLICATION4\CONSOLEAPPLICATION4\DEBUG\VC140.PDB
C:\USERS\MUHAMED.HALILOVIC\DOCUMENTS\VISUAL STUDIO 2015\PROJECTS\CONSOLEAPPLICATION4\CONSOLEAPPLICATION4\DEBUG\VC140.IDB
C:\USERS\MUHAMED.HALILOVIC\DOCUMENTS\VISUAL STUDIO 2015\PROJECTS\CONSOLEAPPLICATION4\CONSOLEAPPLICATION4\DEBUG\CONSOLEAPPLICATION4.OBJ
C:\USERS\MUHAMED.HALILOVIC\DOCUMENTS\VISUAL STUDIO 2015\PROJECTS\CONSOLEAPPLICATION4\CONSOLEAPPLICATION4\DEBUG\MATERIAL.OBJ
^C:\USERS\MUHAMED.HALILOVIC\DOCUMENTS\VISUAL STUDIO 2015\PROJECTS\CONSOLEAPPLICATION4\CONSOLEAPPLICATION4\CAMERA.CPP|C:\USERS\MUHAMED.HALILOVIC\DOCUMENTS\VISUAL STUDIO 2015\PROJECTS\CONSOLEAPPLICATION4\CONSOLEAPPLICATION4\CONSOLEAPPLICATION4.CPP|C:\USERS\MUHAMED.HALILOVIC\DOCUMENTS\VISUAL STUDIO 2015\PROJECTS\CONSOLEAPPLICATION4\CONSOLEAPPLICATION4\MATERIAL.CPP
C:\USERS\MUHAMED.HALILOVIC\DOCUMENTS\VISUAL STUDIO 2015\PROJECTS\CONSOLEAPPLICATION4\CONSOLEAPPLICATION4\DEBUG\VC140.PDB
C:\USERS\MUHAMED.HALILOVIC\DOCUMENTS\VISUAL STUDIO 2015\PROJECTS\CONSOLEAPPLICATION4\CONSOLEAPPLICATION4\DEBUG\VC140.IDB
C:\USERS\MUHAMED.HALILOVIC\DOCUMENTS\VISUAL STUDIO 2015\PROJECTS\CONSOLEAPPLICATION4\CONSOLEAPPLICATION4\DEBUG\CONSOLEAPPLICATION4.OBJ
C:\USERS\MUHAMED.HALILOVIC\DOCUMENTS\VISUAL STUDIO 2015\PROJECTS\CONSOLEAPPLICATION4\CONSOLEAPPLICATION4\DEBUG\MATERIAL.OBJ
^C:\USERS\MUHAMED.HALILOVIC\DESKTOP\RAYTRACINGINONEWEEK\00\CONSOLEAPPLICATION4\CAMERA.CPP|C:\USERS\MUHAMED.HALILOVIC\DESKTOP\RAYTRACINGINONEWEEK\00\CONSOLEAPPLICATION4\CONSOLEAPPLICATION4.CPP|C:\USERS\MUHAMED.HALILOVIC\DESKTOP\RAYTRACINGINONEWEEK\00\CONSOLEAPPLICATION4\HELPER.CPP|C:\USERS\MUHAMED.HALILOVIC\DESKTOP\RAYTRACINGINONEWEEK\00\CONSOLEAPPLICATION4\HITABLE.CPP|C:\USERS\MUHAMED.HALILOVIC\DESKTOP\RAYTRACINGINONEWEEK\00\CONSOLEAPPLICATION4\HITABLE_LIST.CPP|C:\USERS\MUHAMED.HALILOVIC\DESKTOP\RAYTRACINGINONEWEEK\00\CONSOLEAPPLICATION4\MATERIAL.CPP|C:\USERS\MUHAMED.HALILOVIC\DESKTOP\RAYTRACINGINONEWEEK\00\CONSOLEAPPLICATION4\RAY.CPP|C:\USERS\MUHAMED.HALILOVIC\DESKTOP\RAYTRACINGINONEWEEK\00\CONSOLEAPPLICATION4\SPHERE.CPP|C:\USERS\MUHAMED.HALILOVIC\DESKTOP\RAYTRACINGINONEWEEK\00\CONSOLEAPPLICATION4\STDAFX.CPP|C:\USERS\MUHAMED.HALILOVIC\DESKTOP\RAYTRACINGINONEWEEK\00\CONSOLEAPPLICATION4\VEC3.CPP
C:\USERS\MUHAMED.HALILOVIC\DESKTOP\RAYTRACINGINONEWEEK\00\CONSOLEAPPLICATION4\DEBUG\VC140.PDB
C:\USERS\MUHAMED.HALILOVIC\DESKTOP\RAYTRACINGINONEWEEK\00\CONSOLEAPPLICATION4\DEBUG\VC140.IDB
C:\USERS\MUHAMED.HALILOVIC\DESKTOP\RAYTRACINGINONEWEEK\00\CONSOLEAPPLICATION4\DEBUG\HITABLE.OBJ
C:\USERS\MUHAMED.HALILOVIC\DESKTOP\RAYTRACINGINONEWEEK\00\CONSOLEAPPLICATION4\DEBUG\HITABLE_LIST.OBJ
C:\USERS\MUHAMED.HALILOVIC\DESKTOP\RAYTRACINGINONEWEEK\00\CONSOLEAPPLICATION4\DEBUG\RAY.OBJ
C:\USERS\MUHAMED.HALILOVIC\DESKTOP\RAYTRACINGINONEWEEK\00\CONSOLEAPPLICATION4\DEBUG\SPHERE.OBJ
C:\USERS\MUHAMED.HALILOVIC\DESKTOP\RAYTRACINGINONEWEEK\00\CONSOLEAPPLICATION4\DEBUG\STDAFX.OBJ
C:\USERS\MUHAMED.HALILOVIC\DESKTOP\RAYTRACINGINONEWEEK\00\CONSOLEAPPLICATION4\DEBUG\VEC3.OBJ
^C:\USERS\MUHAMED.HALILOVIC\DESKTOP\RAYTRACINGINONEWEEK\00\CONSOLEAPPLICATION4\CAMERA.CPP
C:\USERS\MUHAMED.HALILOVIC\DESKTOP\RAYTRACINGINONEWEEK\00\CONSOLEAPPLICATION4\DEBUG\VC140.PDB
^C:\USERS\MUHAMED.HALILOVIC\DESKTOP\RAYTRACINGINONEWEEK\00\CONSOLEAPPLICATION4\CONSOLEAPPLICATION4.CPP
C:\USERS\MUHAMED.HALILOVIC\DESKTOP\RAYTRACINGINONEWEEK\00\CONSOLEAPPLICATION4\DEBUG\VC140.PDB
C:\USERS\MUHAMED.HALILOVIC\DESKTOP\RAYTRACINGINONEWEEK\00\CONSOLEAPPLICATION4\DEBUG\VC140.IDB
C:\USERS\MUHAMED.HALILOVIC\DESKTOP\RAYTRACINGINONEWEEK\00\CONSOLEAPPLICATION4\DEBUG\CONSOLEAPPLICATION4.OBJ
^C:\USERS\MUHAMED.HALILOVIC\DESKTOP\RAYTRACINGINONEWEEK\00\CONSOLEAPPLICATION4\HELPER.CPP
C:\USERS\MUHAMED.HALILOVIC\DESKTOP\RAYTRACINGINONEWEEK\00\CONSOLEAPPLICATION4\DEBUG\VC140.PDB
^C:\USERS\MUHAMED.HALILOVIC\DESKTOP\RAYTRACINGINONEWEEK\00\CONSOLEAPPLICATION4\HITABLE.CPP
C:\USERS\MUHAMED.HALILOVIC\DESKTOP\RAYTRACINGINONEWEEK\00\CONSOLEAPPLICATION4\DEBUG\VC140.PDB
^C:\USERS\MUHAMED.HALILOVIC\DESKTOP\RAYTRACINGINONEWEEK\00\CONSOLEAPPLICATION4\HITABLE_LIST.CPP
C:\USERS\MUHAMED.HALILOVIC\DESKTOP\RAYTRACINGINONEWEEK\00\CONSOLEAPPLICATION4\DEBUG\VC140.PDB
^C:\USERS\MUHAMED.HALILOVIC\DESKTOP\RAYTRACINGINONEWEEK\00\CONSOLEAPPLICATION4\MATERIAL.CPP
C:\USERS\MUHAMED.HALILOVIC\DESKTOP\RAYTRACINGINONEWEEK\00\CONSOLEAPPLICATION4\DEBUG\VC140.PDB
^C:\USERS\MUHAMED.HALILOVIC\DESKTOP\RAYTRACINGINONEWEEK\00\CONSOLEAPPLICATION4\RAY.CPP
C:\USERS\MUHAMED.HALILOVIC\DESKTOP\RAYTRACINGINONEWEEK\00\CONSOLEAPPLICATION4\DEBUG\VC140.PDB
^C:\USERS\MUHAMED.HALILOVIC\DESKTOP\RAYTRACINGINONEWEEK\00\CONSOLEAPPLICATION4\SPHERE.CPP
C:\USERS\MUHAMED.HALILOVIC\DESKTOP\RAYTRACINGINONEWEEK\00\CONSOLEAPPLICATION4\DEBUG\VC140.PDB
^C:\USERS\MUHAMED.HALILOVIC\DESKTOP\RAYTRACINGINONEWEEK\00\CONSOLEAPPLICATION4\STDAFX.CPP
C:\USERS\MUHAMED.HALILOVIC\DESKTOP\RAYTRACINGINONEWEEK\00\CONSOLEAPPLICATION4\DEBUG\VC140.PDB
^C:\USERS\MUHAMED.HALILOVIC\DESKTOP\RAYTRACINGINONEWEEK\00\CONSOLEAPPLICATION4\VEC3.CPP
C:\USERS\MUHAMED.HALILOVIC\DESKTOP\RAYTRACINGINONEWEEK\00\CONSOLEAPPLICATION4\DEBUG\VC140.PDB
^C:\USERS\MUHAMED.HALILOVIC\DESKTOP\RAYTRACINGINONEWEEK\00\CONSOLEAPPLICATION4\CAMERA.CPP|C:\USERS\MUHAMED.HALILOVIC\DESKTOP\RAYTRACINGINONEWEEK\00\CONSOLEAPPLICATION4\CONSOLEAPPLICATION4.CPP|C:\USERS\MUHAMED.HALILOVIC\DESKTOP\RAYTRACINGINONEWEEK\00\CONSOLEAPPLICATION4\HELPER.CPP|C:\USERS\MUHAMED.HALILOVIC\DESKTOP\RAYTRACINGINONEWEEK\00\CONSOLEAPPLICATION4\MATERIAL.CPP
C:\USERS\MUHAMED.HALILOVIC\DESKTOP\RAYTRACINGINONEWEEK\00\CONSOLEAPPLICATION4\DEBUG\VC140.PDB
C:\USERS\MUHAMED.HALILOVIC\DESKTOP\RAYTRACINGINONEWEEK\00\CONSOLEAPPLICATION4\DEBUG\VC140.IDB
C:\USERS\MUHAMED.HALILOVIC\DESKTOP\RAYTRACINGINONEWEEK\00\CONSOLEAPPLICATION4\DEBUG\CONSOLEAPPLICATION4.OBJ
C:\USERS\MUHAMED.HALILOVIC\DESKTOP\RAYTRACINGINONEWEEK\00\CONSOLEAPPLICATION4\DEBUG\CAMERA.OBJ
C:\USERS\MUHAMED.HALILOVIC\DESKTOP\RAYTRACINGINONEWEEK\00\CONSOLEAPPLICATION4\DEBUG\HELPER.OBJ
C:\USERS\MUHAMED.HALILOVIC\DESKTOP\RAYTRACINGINONEWEEK\00\CONSOLEAPPLICATION4\DEBUG\MATERIAL.OBJ
