^C:\USERS\MUHAMED.HALILOVIC\DOCUMENTS\VISUAL STUDIO 2015\PROJECTS\CONSOLEAPPLICATION4\CONSOLEAPPLICATION4\DEBUG\CAMERA.OBJ|C:\USERS\MUHAMED.HALILOVIC\DOCUMENTS\VISUAL STUDIO 2015\PROJECTS\CONSOLEAPPLICATION4\CONSOLEAPPLICATION4\DEBUG\CONSOLEAPPLICATION4.OBJ|C:\USERS\MUHAMED.HALILOVIC\DOCUMENTS\VISUAL STUDIO 2015\PROJECTS\CONSOLEAPPLICATION4\CONSOLEAPPLICATION4\DEBUG\HELPER.OBJ|C:\USERS\MUHAMED.HALILOVIC\DOCUMENTS\VISUAL STUDIO 2015\PROJECTS\CONSOLEAPPLICATION4\CONSOLEAPPLICATION4\DEBUG\HITABLE.OBJ|C:\USERS\MUHAMED.HALILOVIC\DOCUMENTS\VISUAL STUDIO 2015\PROJECTS\CONSOLEAPPLICATION4\CONSOLEAPPLICATION4\DEBUG\HITABLE_LIST.OBJ|C:\USERS\MUHAMED.HALILOVIC\DOCUMENTS\VISUAL STUDIO 2015\PROJECTS\CONSOLEAPPLICATION4\CONSOLEAPPLICATION4\DEBUG\MATERIAL.OBJ|C:\USERS\MUHAMED.HALILOVIC\DOCUMENTS\VISUAL STUDIO 2015\PROJECTS\CONSOLEAPPLICATION4\CONSOLEAPPLICATION4\DEBUG\RAY.OBJ|C:\USERS\MUHAMED.HALILOVIC\DOCUMENTS\VISUAL STUDIO 2015\PROJECTS\CONSOLEAPPLICATION4\CONSOLEAPPLICATION4\DEBUG\SPHERE.OBJ|C:\USERS\MUHAMED.HALILOVIC\DOCUMENTS\VISUAL STUDIO 2015\PROJECTS\CONSOLEAPPLICATION4\CONSOLEAPPLICATION4\DEBUG\STDAFX.OBJ|C:\USERS\MUHAMED.HALILOVIC\DOCUMENTS\VISUAL STUDIO 2015\PROJECTS\CONSOLEAPPLICATION4\CONSOLEAPPLICATION4\DEBUG\VEC3.OBJ
C:\WINDOWS\GLOBALIZATION\SORTING\SORTDEFAULT.NLS
C:\PROGRAM FILES (X86)\WINDOWS KITS\8.1\LIB\WINV6.3\UM\X86\KERNEL32.LIB
C:\PROGRAM FILES (X86)\WINDOWS KITS\8.1\LIB\WINV6.3\UM\X86\USER32.LIB
C:\PROGRAM FILES (X86)\WINDOWS KITS\8.1\LIB\WINV6.3\UM\X86\GDI32.LIB
C:\PROGRAM FILES (X86)\WINDOWS KITS\8.1\LIB\WINV6.3\UM\X86\WINSPOOL.LIB
C:\PROGRAM FILES (X86)\WINDOWS KITS\8.1\LIB\WINV6.3\UM\X86\COMDLG32.LIB
C:\PROGRAM FILES (X86)\WINDOWS KITS\8.1\LIB\WINV6.3\UM\X86\ADVAPI32.LIB
C:\PROGRAM FILES (X86)\WINDOWS KITS\8.1\LIB\WINV6.3\UM\X86\SHELL32.LIB
C:\PROGRAM FILES (X86)\WINDOWS KITS\8.1\LIB\WINV6.3\UM\X86\OLE32.LIB
C:\PROGRAM FILES (X86)\WINDOWS KITS\8.1\LIB\WINV6.3\UM\X86\OLEAUT32.LIB
C:\PROGRAM FILES (X86)\WINDOWS KITS\8.1\LIB\WINV6.3\UM\X86\UUID.LIB
C:\PROGRAM FILES (X86)\WINDOWS KITS\8.1\LIB\WINV6.3\UM\X86\ODBC32.LIB
C:\PROGRAM FILES (X86)\WINDOWS KITS\8.1\LIB\WINV6.3\UM\X86\ODBCCP32.LIB
C:\USERS\MUHAMED.HALILOVIC\DOCUMENTS\VISUAL STUDIO 2015\PROJECTS\CONSOLEAPPLICATION4\CONSOLEAPPLICATION4\DEBUG\CAMERA.OBJ
C:\USERS\MUHAMED.HALILOVIC\DOCUMENTS\VISUAL STUDIO 2015\PROJECTS\CONSOLEAPPLICATION4\CONSOLEAPPLICATION4\DEBUG\CONSOLEAPPLICATION4.OBJ
C:\USERS\MUHAMED.HALILOVIC\DOCUMENTS\VISUAL STUDIO 2015\PROJECTS\CONSOLEAPPLICATION4\CONSOLEAPPLICATION4\DEBUG\HELPER.OBJ
C:\USERS\MUHAMED.HALILOVIC\DOCUMENTS\VISUAL STUDIO 2015\PROJECTS\CONSOLEAPPLICATION4\CONSOLEAPPLICATION4\DEBUG\HITABLE.OBJ
C:\USERS\MUHAMED.HALILOVIC\DOCUMENTS\VISUAL STUDIO 2015\PROJECTS\CONSOLEAPPLICATION4\CONSOLEAPPLICATION4\DEBUG\HITABLE_LIST.OBJ
C:\USERS\MUHAMED.HALILOVIC\DOCUMENTS\VISUAL STUDIO 2015\PROJECTS\CONSOLEAPPLICATION4\CONSOLEAPPLICATION4\DEBUG\MATERIAL.OBJ
C:\USERS\MUHAMED.HALILOVIC\DOCUMENTS\VISUAL STUDIO 2015\PROJECTS\CONSOLEAPPLICATION4\CONSOLEAPPLICATION4\DEBUG\RAY.OBJ
C:\USERS\MUHAMED.HALILOVIC\DOCUMENTS\VISUAL STUDIO 2015\PROJECTS\CONSOLEAPPLICATION4\CONSOLEAPPLICATION4\DEBUG\SPHERE.OBJ
C:\USERS\MUHAMED.HALILOVIC\DOCUMENTS\VISUAL STUDIO 2015\PROJECTS\CONSOLEAPPLICATION4\CONSOLEAPPLICATION4\DEBUG\STDAFX.OBJ
C:\USERS\MUHAMED.HALILOVIC\DOCUMENTS\VISUAL STUDIO 2015\PROJECTS\CONSOLEAPPLICATION4\CONSOLEAPPLICATION4\DEBUG\VEC3.OBJ
C:\WINDOWS\SYSTEM32\TZRES.DLL
C:\PROGRAM FILES (X86)\MICROSOFT VISUAL STUDIO 14.0\VC\LIB\MSVCPRTD.LIB
C:\PROGRAM FILES (X86)\MICROSOFT VISUAL STUDIO 14.0\VC\LIB\MSVCRTD.LIB
C:\PROGRAM FILES (X86)\MICROSOFT VISUAL STUDIO 14.0\VC\LIB\OLDNAMES.LIB
C:\PROGRAM FILES (X86)\MICROSOFT VISUAL STUDIO 14.0\VC\LIB\VCRUNTIMED.LIB
C:\PROGRAM FILES (X86)\WINDOWS KITS\10\LIB\10.0.10240.0\UCRT\X86\UCRTD.LIB
^C:\USERS\MUHAMED.HALILOVIC\DESKTOP\RAYTRACINGINONEWEEK\00\CONSOLEAPPLICATION4\DEBUG\CAMERA.OBJ|C:\USERS\MUHAMED.HALILOVIC\DESKTOP\RAYTRACINGINONEWEEK\00\CONSOLEAPPLICATION4\DEBUG\CONSOLEAPPLICATION4.OBJ|C:\USERS\MUHAMED.HALILOVIC\DESKTOP\RAYTRACINGINONEWEEK\00\CONSOLEAPPLICATION4\DEBUG\HELPER.OBJ|C:\USERS\MUHAMED.HALILOVIC\DESKTOP\RAYTRACINGINONEWEEK\00\CONSOLEAPPLICATION4\DEBUG\HITABLE.OBJ|C:\USERS\MUHAMED.HALILOVIC\DESKTOP\RAYTRACINGINONEWEEK\00\CONSOLEAPPLICATION4\DEBUG\HITABLE_LIST.OBJ|C:\USERS\MUHAMED.HALILOVIC\DESKTOP\RAYTRACINGINONEWEEK\00\CONSOLEAPPLICATION4\DEBUG\MATERIAL.OBJ|C:\USERS\MUHAMED.HALILOVIC\DESKTOP\RAYTRACINGINONEWEEK\00\CONSOLEAPPLICATION4\DEBUG\RAY.OBJ|C:\USERS\MUHAMED.HALILOVIC\DESKTOP\RAYTRACINGINONEWEEK\00\CONSOLEAPPLICATION4\DEBUG\SPHERE.OBJ|C:\USERS\MUHAMED.HALILOVIC\DESKTOP\RAYTRACINGINONEWEEK\00\CONSOLEAPPLICATION4\DEBUG\STDAFX.OBJ|C:\USERS\MUHAMED.HALILOVIC\DESKTOP\RAYTRACINGINONEWEEK\00\CONSOLEAPPLICATION4\DEBUG\VEC3.OBJ
C:\WINDOWS\GLOBALIZATION\SORTING\SORTDEFAULT.NLS
C:\PROGRAM FILES (X86)\WINDOWS KITS\8.1\LIB\WINV6.3\UM\X86\KERNEL32.LIB
C:\PROGRAM FILES (X86)\WINDOWS KITS\8.1\LIB\WINV6.3\UM\X86\USER32.LIB
C:\PROGRAM FILES (X86)\WINDOWS KITS\8.1\LIB\WINV6.3\UM\X86\GDI32.LIB
C:\PROGRAM FILES (X86)\WINDOWS KITS\8.1\LIB\WINV6.3\UM\X86\WINSPOOL.LIB
C:\PROGRAM FILES (X86)\WINDOWS KITS\8.1\LIB\WINV6.3\UM\X86\COMDLG32.LIB
C:\PROGRAM FILES (X86)\WINDOWS KITS\8.1\LIB\WINV6.3\UM\X86\ADVAPI32.LIB
C:\PROGRAM FILES (X86)\WINDOWS KITS\8.1\LIB\WINV6.3\UM\X86\SHELL32.LIB
C:\PROGRAM FILES (X86)\WINDOWS KITS\8.1\LIB\WINV6.3\UM\X86\OLE32.LIB
C:\PROGRAM FILES (X86)\WINDOWS KITS\8.1\LIB\WINV6.3\UM\X86\OLEAUT32.LIB
C:\PROGRAM FILES (X86)\WINDOWS KITS\8.1\LIB\WINV6.3\UM\X86\UUID.LIB
C:\PROGRAM FILES (X86)\WINDOWS KITS\8.1\LIB\WINV6.3\UM\X86\ODBC32.LIB
C:\PROGRAM FILES (X86)\WINDOWS KITS\8.1\LIB\WINV6.3\UM\X86\ODBCCP32.LIB
C:\USERS\MUHAMED.HALILOVIC\DESKTOP\RAYTRACINGINONEWEEK\00\CONSOLEAPPLICATION4\DEBUG\CAMERA.OBJ
C:\USERS\MUHAMED.HALILOVIC\DESKTOP\RAYTRACINGINONEWEEK\00\CONSOLEAPPLICATION4\DEBUG\CONSOLEAPPLICATION4.OBJ
C:\USERS\MUHAMED.HALILOVIC\DESKTOP\RAYTRACINGINONEWEEK\00\CONSOLEAPPLICATION4\DEBUG\HELPER.OBJ
C:\USERS\MUHAMED.HALILOVIC\DESKTOP\RAYTRACINGINONEWEEK\00\CONSOLEAPPLICATION4\DEBUG\HITABLE.OBJ
C:\USERS\MUHAMED.HALILOVIC\DESKTOP\RAYTRACINGINONEWEEK\00\CONSOLEAPPLICATION4\DEBUG\HITABLE_LIST.OBJ
C:\USERS\MUHAMED.HALILOVIC\DESKTOP\RAYTRACINGINONEWEEK\00\CONSOLEAPPLICATION4\DEBUG\MATERIAL.OBJ
C:\USERS\MUHAMED.HALILOVIC\DESKTOP\RAYTRACINGINONEWEEK\00\CONSOLEAPPLICATION4\DEBUG\RAY.OBJ
C:\USERS\MUHAMED.HALILOVIC\DESKTOP\RAYTRACINGINONEWEEK\00\CONSOLEAPPLICATION4\DEBUG\SPHERE.OBJ
C:\USERS\MUHAMED.HALILOVIC\DESKTOP\RAYTRACINGINONEWEEK\00\CONSOLEAPPLICATION4\DEBUG\STDAFX.OBJ
C:\USERS\MUHAMED.HALILOVIC\DESKTOP\RAYTRACINGINONEWEEK\00\CONSOLEAPPLICATION4\DEBUG\VEC3.OBJ
C:\WINDOWS\SYSTEM32\TZRES.DLL
C:\PROGRAM FILES (X86)\MICROSOFT VISUAL STUDIO 14.0\VC\LIB\MSVCPRTD.LIB
C:\PROGRAM FILES (X86)\MICROSOFT VISUAL STUDIO 14.0\VC\LIB\MSVCRTD.LIB
C:\PROGRAM FILES (X86)\MICROSOFT VISUAL STUDIO 14.0\VC\LIB\OLDNAMES.LIB
C:\PROGRAM FILES (X86)\MICROSOFT VISUAL STUDIO 14.0\VC\LIB\VCRUNTIMED.LIB
C:\PROGRAM FILES (X86)\WINDOWS KITS\10\LIB\10.0.10240.0\UCRT\X86\UCRTD.LIB
