^C:\USERS\MUHAMED.HALILOVIC\DOCUMENTS\VISUAL STUDIO 2015\PROJECTS\CONSOLEAPPLICATION4\CONSOLEAPPLICATION4\DEBUG\CAMERA.OBJ|C:\USERS\MUHAMED.HALILOVIC\DOCUMENTS\VISUAL STUDIO 2015\PROJECTS\CONSOLEAPPLICATION4\CONSOLEAPPLICATION4\DEBUG\CONSOLEAPPLICATION4.OBJ|C:\USERS\MUHAMED.HALILOVIC\DOCUMENTS\VISUAL STUDIO 2015\PROJECTS\CONSOLEAPPLICATION4\CONSOLEAPPLICATION4\DEBUG\HELPER.OBJ|C:\USERS\MUHAMED.HALILOVIC\DOCUMENTS\VISUAL STUDIO 2015\PROJECTS\CONSOLEAPPLICATION4\CONSOLEAPPLICATION4\DEBUG\HITABLE.OBJ|C:\USERS\MUHAMED.HALILOVIC\DOCUMENTS\VISUAL STUDIO 2015\PROJECTS\CONSOLEAPPLICATION4\CONSOLEAPPLICATION4\DEBUG\HITABLE_LIST.OBJ|C:\USERS\MUHAMED.HALILOVIC\DOCUMENTS\VISUAL STUDIO 2015\PROJECTS\CONSOLEAPPLICATION4\CONSOLEAPPLICATION4\DEBUG\MATERIAL.OBJ|C:\USERS\MUHAMED.HALILOVIC\DOCUMENTS\VISUAL STUDIO 2015\PROJECTS\CONSOLEAPPLICATION4\CONSOLEAPPLICATION4\DEBUG\RAY.OBJ|C:\USERS\MUHAMED.HALILOVIC\DOCUMENTS\VISUAL STUDIO 2015\PROJECTS\CONSOLEAPPLICATION4\CONSOLEAPPLICATION4\DEBUG\SPHERE.OBJ|C:\USERS\MUHAMED.HALILOVIC\DOCUMENTS\VISUAL STUDIO 2015\PROJECTS\CONSOLEAPPLICATION4\CONSOLEAPPLICATION4\DEBUG\STDAFX.OBJ|C:\USERS\MUHAMED.HALILOVIC\DOCUMENTS\VISUAL STUDIO 2015\PROJECTS\CONSOLEAPPLICATION4\CONSOLEAPPLICATION4\DEBUG\VEC3.OBJ
/OUT:"C:\USERS\MUHAMED.HALILOVIC\DOCUMENTS\VISUAL STUDIO 2015\PROJECTS\CONSOLEAPPLICATION4\DEBUG\CONSOLEAPPLICATION4.EXE" /INCREMENTAL /NOLOGO KERNEL32.LIB USER32.LIB GDI32.LIB WINSPOOL.LIB COMDLG32.LIB ADVAPI32.LIB SHELL32.LIB OLE32.LIB OLEAUT32.LIB UUID.LIB ODBC32.LIB ODBCCP32.LIB /MANIFEST /MANIFESTUAC:"level='asInvoker' uiAccess='false'" /manifest:embed /DEBUG /PDB:"C:\USERS\MUHAMED.HALILOVIC\DOCUMENTS\VISUAL STUDIO 2015\PROJECTS\CONSOLEAPPLICATION4\DEBUG\CONSOLEAPPLICATION4.PDB" /SUBSYSTEM:CONSOLE /TLBID:1 /DYNAMICBASE /NXCOMPAT /IMPLIB:"C:\USERS\MUHAMED.HALILOVIC\DOCUMENTS\VISUAL STUDIO 2015\PROJECTS\CONSOLEAPPLICATION4\DEBUG\CONSOLEAPPLICATION4.LIB" /MACHINE:X86 DEBUG\CAMERA.OBJDEBUG\CONSOLEAPPLICATION4.OBJDEBUG\HELPER.OBJDEBUG\HITABLE.OBJDEBUG\HITABLE_LIST.OBJDEBUG\MATERIAL.OBJDEBUG\RAY.OBJDEBUG\SPHERE.OBJDEBUG\STDAFX.OBJDEBUG\VEC3.OBJ
^C:\USERS\MUHAMED.HALILOVIC\DESKTOP\RAYTRACINGINONEWEEK\00\CONSOLEAPPLICATION4\DEBUG\CAMERA.OBJ|C:\USERS\MUHAMED.HALILOVIC\DESKTOP\RAYTRACINGINONEWEEK\00\CONSOLEAPPLICATION4\DEBUG\CONSOLEAPPLICATION4.OBJ|C:\USERS\MUHAMED.HALILOVIC\DESKTOP\RAYTRACINGINONEWEEK\00\CONSOLEAPPLICATION4\DEBUG\HELPER.OBJ|C:\USERS\MUHAMED.HALILOVIC\DESKTOP\RAYTRACINGINONEWEEK\00\CONSOLEAPPLICATION4\DEBUG\HITABLE.OBJ|C:\USERS\MUHAMED.HALILOVIC\DESKTOP\RAYTRACINGINONEWEEK\00\CONSOLEAPPLICATION4\DEBUG\HITABLE_LIST.OBJ|C:\USERS\MUHAMED.HALILOVIC\DESKTOP\RAYTRACINGINONEWEEK\00\CONSOLEAPPLICATION4\DEBUG\MATERIAL.OBJ|C:\USERS\MUHAMED.HALILOVIC\DESKTOP\RAYTRACINGINONEWEEK\00\CONSOLEAPPLICATION4\DEBUG\RAY.OBJ|C:\USERS\MUHAMED.HALILOVIC\DESKTOP\RAYTRACINGINONEWEEK\00\CONSOLEAPPLICATION4\DEBUG\SPHERE.OBJ|C:\USERS\MUHAMED.HALILOVIC\DESKTOP\RAYTRACINGINONEWEEK\00\CONSOLEAPPLICATION4\DEBUG\STDAFX.OBJ|C:\USERS\MUHAMED.HALILOVIC\DESKTOP\RAYTRACINGINONEWEEK\00\CONSOLEAPPLICATION4\DEBUG\VEC3.OBJ
/OUT:"C:\USERS\MUHAMED.HALILOVIC\DESKTOP\RAYTRACINGINONEWEEK\00\DEBUG\CONSOLEAPPLICATION4.EXE" /INCREMENTAL /NOLOGO KERNEL32.LIB USER32.LIB GDI32.LIB WINSPOOL.LIB COMDLG32.LIB ADVAPI32.LIB SHELL32.LIB OLE32.LIB OLEAUT32.LIB UUID.LIB ODBC32.LIB ODBCCP32.LIB /MANIFEST /MANIFESTUAC:"level='asInvoker' uiAccess='false'" /manifest:embed /DEBUG /PDB:"C:\USERS\MUHAMED.HALILOVIC\DESKTOP\RAYTRACINGINONEWEEK\00\DEBUG\CONSOLEAPPLICATION4.PDB" /SUBSYSTEM:CONSOLE /TLBID:1 /DYNAMICBASE /NXCOMPAT /IMPLIB:"C:\USERS\MUHAMED.HALILOVIC\DESKTOP\RAYTRACINGINONEWEEK\00\DEBUG\CONSOLEAPPLICATION4.LIB" /MACHINE:X86 DEBUG\CAMERA.OBJDEBUG\CONSOLEAPPLICATION4.OBJDEBUG\HELPER.OBJDEBUG\HITABLE.OBJDEBUG\HITABLE_LIST.OBJDEBUG\MATERIAL.OBJDEBUG\RAY.OBJDEBUG\SPHERE.OBJDEBUG\STDAFX.OBJDEBUG\VEC3.OBJ
