^C:\USERS\REUF\DESKTOP\KGFPROJEKTI\RAYTRACINGINONEWEEKEND\00\CONSOLEAPPLICATION4\CAMERA.CPP|C:\USERS\REUF\DESKTOP\KGFPROJEKTI\RAYTRACINGINONEWEEKEND\00\CONSOLEAPPLICATION4\HELPER.CPP|C:\USERS\REUF\DESKTOP\KGFPROJEKTI\RAYTRACINGINONEWEEKEND\00\CONSOLEAPPLICATION4\HITABLE.CPP|C:\USERS\REUF\DESKTOP\KGFPROJEKTI\RAYTRACINGINONEWEEKEND\00\CONSOLEAPPLICATION4\HITABLE_LIST.CPP|C:\USERS\REUF\DESKTOP\KGFPROJEKTI\RAYTRACINGINONEWEEKEND\00\CONSOLEAPPLICATION4\MATERIAL.CPP|C:\USERS\REUF\DESKTOP\KGFPROJEKTI\RAYTRACINGINONEWEEKEND\00\CONSOLEAPPLICATION4\RAY.CPP|C:\USERS\REUF\DESKTOP\KGFPROJEKTI\RAYTRACINGINONEWEEKEND\00\CONSOLEAPPLICATION4\RAYTRACIOW00.CPP|C:\USERS\REUF\DESKTOP\KGFPROJEKTI\RAYTRACINGINONEWEEKEND\00\CONSOLEAPPLICATION4\SPHERE.CPP|C:\USERS\REUF\DESKTOP\KGFPROJEKTI\RAYTRACINGINONEWEEKEND\00\CONSOLEAPPLICATION4\STDAFX.CPP|C:\USERS\REUF\DESKTOP\KGFPROJEKTI\RAYTRACINGINONEWEEKEND\00\CONSOLEAPPLICATION4\VEC3.CPP
C:\USERS\REUF\DESKTOP\KGFPROJEKTI\RAYTRACINGINONEWEEKEND\00\CONSOLEAPPLICATION4\DEBUG\VC140.PDB
C:\USERS\REUF\DESKTOP\KGFPROJEKTI\RAYTRACINGINONEWEEKEND\00\CONSOLEAPPLICATION4\DEBUG\VC140.IDB
C:\USERS\REUF\DESKTOP\KGFPROJEKTI\RAYTRACINGINONEWEEKEND\00\CONSOLEAPPLICATION4\DEBUG\CAMERA.OBJ
C:\USERS\REUF\DESKTOP\KGFPROJEKTI\RAYTRACINGINONEWEEKEND\00\CONSOLEAPPLICATION4\DEBUG\RAYTRACIOW00.OBJ
C:\USERS\REUF\DESKTOP\KGFPROJEKTI\RAYTRACINGINONEWEEKEND\00\CONSOLEAPPLICATION4\DEBUG\HELPER.OBJ
C:\USERS\REUF\DESKTOP\KGFPROJEKTI\RAYTRACINGINONEWEEKEND\00\CONSOLEAPPLICATION4\DEBUG\HITABLE.OBJ
C:\USERS\REUF\DESKTOP\KGFPROJEKTI\RAYTRACINGINONEWEEKEND\00\CONSOLEAPPLICATION4\DEBUG\HITABLE_LIST.OBJ
C:\USERS\REUF\DESKTOP\KGFPROJEKTI\RAYTRACINGINONEWEEKEND\00\CONSOLEAPPLICATION4\DEBUG\MATERIAL.OBJ
C:\USERS\REUF\DESKTOP\KGFPROJEKTI\RAYTRACINGINONEWEEKEND\00\CONSOLEAPPLICATION4\DEBUG\RAY.OBJ
C:\USERS\REUF\DESKTOP\KGFPROJEKTI\RAYTRACINGINONEWEEKEND\00\CONSOLEAPPLICATION4\DEBUG\SPHERE.OBJ
C:\USERS\REUF\DESKTOP\KGFPROJEKTI\RAYTRACINGINONEWEEKEND\00\CONSOLEAPPLICATION4\DEBUG\STDAFX.OBJ
C:\USERS\REUF\DESKTOP\KGFPROJEKTI\RAYTRACINGINONEWEEKEND\00\CONSOLEAPPLICATION4\DEBUG\VEC3.OBJ
^C:\USERS\REUF\DESKTOP\KGFPROJEKTI\RAYTRACINGINONEWEEKEND\00\CONSOLEAPPLICATION4\CAMERA.CPP
C:\USERS\REUF\DESKTOP\KGFPROJEKTI\RAYTRACINGINONEWEEKEND\00\CONSOLEAPPLICATION4\DEBUG\VC140.PDB
^C:\USERS\REUF\DESKTOP\KGFPROJEKTI\RAYTRACINGINONEWEEKEND\00\CONSOLEAPPLICATION4\RAYTRACIOW00.CPP
C:\USERS\REUF\DESKTOP\KGFPROJEKTI\RAYTRACINGINONEWEEKEND\00\CONSOLEAPPLICATION4\DEBUG\VC140.PDB
^C:\USERS\REUF\DESKTOP\KGFPROJEKTI\RAYTRACINGINONEWEEKEND\00\CONSOLEAPPLICATION4\HELPER.CPP
C:\USERS\REUF\DESKTOP\KGFPROJEKTI\RAYTRACINGINONEWEEKEND\00\CONSOLEAPPLICATION4\DEBUG\VC140.PDB
^C:\USERS\REUF\DESKTOP\KGFPROJEKTI\RAYTRACINGINONEWEEKEND\00\CONSOLEAPPLICATION4\HITABLE.CPP
C:\USERS\REUF\DESKTOP\KGFPROJEKTI\RAYTRACINGINONEWEEKEND\00\CONSOLEAPPLICATION4\DEBUG\VC140.PDB
^C:\USERS\REUF\DESKTOP\KGFPROJEKTI\RAYTRACINGINONEWEEKEND\00\CONSOLEAPPLICATION4\HITABLE_LIST.CPP
C:\USERS\REUF\DESKTOP\KGFPROJEKTI\RAYTRACINGINONEWEEKEND\00\CONSOLEAPPLICATION4\DEBUG\VC140.PDB
^C:\USERS\REUF\DESKTOP\KGFPROJEKTI\RAYTRACINGINONEWEEKEND\00\CONSOLEAPPLICATION4\MATERIAL.CPP
C:\USERS\REUF\DESKTOP\KGFPROJEKTI\RAYTRACINGINONEWEEKEND\00\CONSOLEAPPLICATION4\DEBUG\VC140.PDB
^C:\USERS\REUF\DESKTOP\KGFPROJEKTI\RAYTRACINGINONEWEEKEND\00\CONSOLEAPPLICATION4\RAY.CPP
C:\USERS\REUF\DESKTOP\KGFPROJEKTI\RAYTRACINGINONEWEEKEND\00\CONSOLEAPPLICATION4\DEBUG\VC140.PDB
^C:\USERS\REUF\DESKTOP\KGFPROJEKTI\RAYTRACINGINONEWEEKEND\00\CONSOLEAPPLICATION4\SPHERE.CPP
C:\USERS\REUF\DESKTOP\KGFPROJEKTI\RAYTRACINGINONEWEEKEND\00\CONSOLEAPPLICATION4\DEBUG\VC140.PDB
^C:\USERS\REUF\DESKTOP\KGFPROJEKTI\RAYTRACINGINONEWEEKEND\00\CONSOLEAPPLICATION4\STDAFX.CPP
C:\USERS\REUF\DESKTOP\KGFPROJEKTI\RAYTRACINGINONEWEEKEND\00\CONSOLEAPPLICATION4\DEBUG\VC140.PDB
^C:\USERS\REUF\DESKTOP\KGFPROJEKTI\RAYTRACINGINONEWEEKEND\00\CONSOLEAPPLICATION4\VEC3.CPP
C:\USERS\REUF\DESKTOP\KGFPROJEKTI\RAYTRACINGINONEWEEKEND\00\CONSOLEAPPLICATION4\DEBUG\VC140.PDB
^C:\USERS\REUF\DESKTOP\KGFPROJEKTI\RAYTRACINGINONEWEEKEND\VADJENJE\CONSOLEAPPLICATION4\CAMERA.CPP|C:\USERS\REUF\DESKTOP\KGFPROJEKTI\RAYTRACINGINONEWEEKEND\VADJENJE\CONSOLEAPPLICATION4\HELPER.CPP|C:\USERS\REUF\DESKTOP\KGFPROJEKTI\RAYTRACINGINONEWEEKEND\VADJENJE\CONSOLEAPPLICATION4\HITABLE.CPP|C:\USERS\REUF\DESKTOP\KGFPROJEKTI\RAYTRACINGINONEWEEKEND\VADJENJE\CONSOLEAPPLICATION4\HITABLE_LIST.CPP|C:\USERS\REUF\DESKTOP\KGFPROJEKTI\RAYTRACINGINONEWEEKEND\VADJENJE\CONSOLEAPPLICATION4\MATERIAL.CPP|C:\USERS\REUF\DESKTOP\KGFPROJEKTI\RAYTRACINGINONEWEEKEND\VADJENJE\CONSOLEAPPLICATION4\RAY.CPP|C:\USERS\REUF\DESKTOP\KGFPROJEKTI\RAYTRACINGINONEWEEKEND\VADJENJE\CONSOLEAPPLICATION4\RAYTRACIOW00.CPP|C:\USERS\REUF\DESKTOP\KGFPROJEKTI\RAYTRACINGINONEWEEKEND\VADJENJE\CONSOLEAPPLICATION4\SPHERE.CPP|C:\USERS\REUF\DESKTOP\KGFPROJEKTI\RAYTRACINGINONEWEEKEND\VADJENJE\CONSOLEAPPLICATION4\STDAFX.CPP|C:\USERS\REUF\DESKTOP\KGFPROJEKTI\RAYTRACINGINONEWEEKEND\VADJENJE\CONSOLEAPPLICATION4\VEC3.CPP
C:\USERS\REUF\DESKTOP\KGFPROJEKTI\RAYTRACINGINONEWEEKEND\VADJENJE\CONSOLEAPPLICATION4\DEBUG\VC140.PDB
C:\USERS\REUF\DESKTOP\KGFPROJEKTI\RAYTRACINGINONEWEEKEND\VADJENJE\CONSOLEAPPLICATION4\DEBUG\VC140.IDB
C:\USERS\REUF\DESKTOP\KGFPROJEKTI\RAYTRACINGINONEWEEKEND\VADJENJE\CONSOLEAPPLICATION4\DEBUG\CAMERA.OBJ
C:\USERS\REUF\DESKTOP\KGFPROJEKTI\RAYTRACINGINONEWEEKEND\VADJENJE\CONSOLEAPPLICATION4\DEBUG\RAYTRACIOW00.OBJ
C:\USERS\REUF\DESKTOP\KGFPROJEKTI\RAYTRACINGINONEWEEKEND\VADJENJE\CONSOLEAPPLICATION4\DEBUG\HELPER.OBJ
C:\USERS\REUF\DESKTOP\KGFPROJEKTI\RAYTRACINGINONEWEEKEND\VADJENJE\CONSOLEAPPLICATION4\DEBUG\HITABLE.OBJ
C:\USERS\REUF\DESKTOP\KGFPROJEKTI\RAYTRACINGINONEWEEKEND\VADJENJE\CONSOLEAPPLICATION4\DEBUG\HITABLE_LIST.OBJ
C:\USERS\REUF\DESKTOP\KGFPROJEKTI\RAYTRACINGINONEWEEKEND\VADJENJE\CONSOLEAPPLICATION4\DEBUG\MATERIAL.OBJ
C:\USERS\REUF\DESKTOP\KGFPROJEKTI\RAYTRACINGINONEWEEKEND\VADJENJE\CONSOLEAPPLICATION4\DEBUG\RAY.OBJ
C:\USERS\REUF\DESKTOP\KGFPROJEKTI\RAYTRACINGINONEWEEKEND\VADJENJE\CONSOLEAPPLICATION4\DEBUG\SPHERE.OBJ
C:\USERS\REUF\DESKTOP\KGFPROJEKTI\RAYTRACINGINONEWEEKEND\VADJENJE\CONSOLEAPPLICATION4\DEBUG\STDAFX.OBJ
C:\USERS\REUF\DESKTOP\KGFPROJEKTI\RAYTRACINGINONEWEEKEND\VADJENJE\CONSOLEAPPLICATION4\DEBUG\VEC3.OBJ
^C:\USERS\REUF\DESKTOP\KGFPROJEKTI\RAYTRACINGINONEWEEKEND\VADJENJE\CONSOLEAPPLICATION4\CAMERA.CPP
C:\USERS\REUF\DESKTOP\KGFPROJEKTI\RAYTRACINGINONEWEEKEND\VADJENJE\CONSOLEAPPLICATION4\DEBUG\VC140.PDB
^C:\USERS\REUF\DESKTOP\KGFPROJEKTI\RAYTRACINGINONEWEEKEND\VADJENJE\CONSOLEAPPLICATION4\RAYTRACIOW00.CPP
C:\USERS\REUF\DESKTOP\KGFPROJEKTI\RAYTRACINGINONEWEEKEND\VADJENJE\CONSOLEAPPLICATION4\DEBUG\VC140.PDB
^C:\USERS\REUF\DESKTOP\KGFPROJEKTI\RAYTRACINGINONEWEEKEND\VADJENJE\CONSOLEAPPLICATION4\HELPER.CPP
C:\USERS\REUF\DESKTOP\KGFPROJEKTI\RAYTRACINGINONEWEEKEND\VADJENJE\CONSOLEAPPLICATION4\DEBUG\VC140.PDB
^C:\USERS\REUF\DESKTOP\KGFPROJEKTI\RAYTRACINGINONEWEEKEND\VADJENJE\CONSOLEAPPLICATION4\HITABLE.CPP
C:\USERS\REUF\DESKTOP\KGFPROJEKTI\RAYTRACINGINONEWEEKEND\VADJENJE\CONSOLEAPPLICATION4\DEBUG\VC140.PDB
^C:\USERS\REUF\DESKTOP\KGFPROJEKTI\RAYTRACINGINONEWEEKEND\VADJENJE\CONSOLEAPPLICATION4\HITABLE_LIST.CPP
C:\USERS\REUF\DESKTOP\KGFPROJEKTI\RAYTRACINGINONEWEEKEND\VADJENJE\CONSOLEAPPLICATION4\DEBUG\VC140.PDB
^C:\USERS\REUF\DESKTOP\KGFPROJEKTI\RAYTRACINGINONEWEEKEND\VADJENJE\CONSOLEAPPLICATION4\MATERIAL.CPP
C:\USERS\REUF\DESKTOP\KGFPROJEKTI\RAYTRACINGINONEWEEKEND\VADJENJE\CONSOLEAPPLICATION4\DEBUG\VC140.PDB
^C:\USERS\REUF\DESKTOP\KGFPROJEKTI\RAYTRACINGINONEWEEKEND\VADJENJE\CONSOLEAPPLICATION4\RAY.CPP
C:\USERS\REUF\DESKTOP\KGFPROJEKTI\RAYTRACINGINONEWEEKEND\VADJENJE\CONSOLEAPPLICATION4\DEBUG\VC140.PDB
^C:\USERS\REUF\DESKTOP\KGFPROJEKTI\RAYTRACINGINONEWEEKEND\VADJENJE\CONSOLEAPPLICATION4\SPHERE.CPP
C:\USERS\REUF\DESKTOP\KGFPROJEKTI\RAYTRACINGINONEWEEKEND\VADJENJE\CONSOLEAPPLICATION4\DEBUG\VC140.PDB
^C:\USERS\REUF\DESKTOP\KGFPROJEKTI\RAYTRACINGINONEWEEKEND\VADJENJE\CONSOLEAPPLICATION4\STDAFX.CPP
C:\USERS\REUF\DESKTOP\KGFPROJEKTI\RAYTRACINGINONEWEEKEND\VADJENJE\CONSOLEAPPLICATION4\DEBUG\VC140.PDB
^C:\USERS\REUF\DESKTOP\KGFPROJEKTI\RAYTRACINGINONEWEEKEND\VADJENJE\CONSOLEAPPLICATION4\VEC3.CPP
C:\USERS\REUF\DESKTOP\KGFPROJEKTI\RAYTRACINGINONEWEEKEND\VADJENJE\CONSOLEAPPLICATION4\DEBUG\VC140.PDB
