^C:\USERS\MUHAMED.HALILOVIC\DOCUMENTS\VISUAL STUDIO 2015\PROJECTS\CONSOLEAPPLICATION4\CONSOLEAPPLICATION4\DEBUG\CAMERA.OBJ|C:\USERS\MUHAMED.HALILOVIC\DOCUMENTS\VISUAL STUDIO 2015\PROJECTS\CONSOLEAPPLICATION4\CONSOLEAPPLICATION4\DEBUG\CONSOLEAPPLICATION4.OBJ|C:\USERS\MUHAMED.HALILOVIC\DOCUMENTS\VISUAL STUDIO 2015\PROJECTS\CONSOLEAPPLICATION4\CONSOLEAPPLICATION4\DEBUG\HELPER.OBJ|C:\USERS\MUHAMED.HALILOVIC\DOCUMENTS\VISUAL STUDIO 2015\PROJECTS\CONSOLEAPPLICATION4\CONSOLEAPPLICATION4\DEBUG\HITABLE.OBJ|C:\USERS\MUHAMED.HALILOVIC\DOCUMENTS\VISUAL STUDIO 2015\PROJECTS\CONSOLEAPPLICATION4\CONSOLEAPPLICATION4\DEBUG\HITABLE_LIST.OBJ|C:\USERS\MUHAMED.HALILOVIC\DOCUMENTS\VISUAL STUDIO 2015\PROJECTS\CONSOLEAPPLICATION4\CONSOLEAPPLICATION4\DEBUG\MATERIAL.OBJ|C:\USERS\MUHAMED.HALILOVIC\DOCUMENTS\VISUAL STUDIO 2015\PROJECTS\CONSOLEAPPLICATION4\CONSOLEAPPLICATION4\DEBUG\RAY.OBJ|C:\USERS\MUHAMED.HALILOVIC\DOCUMENTS\VISUAL STUDIO 2015\PROJECTS\CONSOLEAPPLICATION4\CONSOLEAPPLICATION4\DEBUG\SPHERE.OBJ|C:\USERS\MUHAMED.HALILOVIC\DOCUMENTS\VISUAL STUDIO 2015\PROJECTS\CONSOLEAPPLICATION4\CONSOLEAPPLICATION4\DEBUG\STDAFX.OBJ|C:\USERS\MUHAMED.HALILOVIC\DOCUMENTS\VISUAL STUDIO 2015\PROJECTS\CONSOLEAPPLICATION4\CONSOLEAPPLICATION4\DEBUG\VEC3.OBJ
C:\USERS\MUHAMED.HALILOVIC\DOCUMENTS\VISUAL STUDIO 2015\PROJECTS\CONSOLEAPPLICATION4\DEBUG\CONSOLEAPPLICATION4.ILK
C:\USERS\MUHAMED.HALILOVIC\DOCUMENTS\VISUAL STUDIO 2015\PROJECTS\CONSOLEAPPLICATION4\DEBUG\CONSOLEAPPLICATION4.EXE
C:\USERS\MUHAMED.HALILOVIC\DOCUMENTS\VISUAL STUDIO 2015\PROJECTS\CONSOLEAPPLICATION4\DEBUG\CONSOLEAPPLICATION4.PDB
^C:\USERS\MUHAMED.HALILOVIC\DESKTOP\RAYTRACINGINONEWEEK\00\CONSOLEAPPLICATION4\DEBUG\CAMERA.OBJ|C:\USERS\MUHAMED.HALILOVIC\DESKTOP\RAYTRACINGINONEWEEK\00\CONSOLEAPPLICATION4\DEBUG\CONSOLEAPPLICATION4.OBJ|C:\USERS\MUHAMED.HALILOVIC\DESKTOP\RAYTRACINGINONEWEEK\00\CONSOLEAPPLICATION4\DEBUG\HELPER.OBJ|C:\USERS\MUHAMED.HALILOVIC\DESKTOP\RAYTRACINGINONEWEEK\00\CONSOLEAPPLICATION4\DEBUG\HITABLE.OBJ|C:\USERS\MUHAMED.HALILOVIC\DESKTOP\RAYTRACINGINONEWEEK\00\CONSOLEAPPLICATION4\DEBUG\HITABLE_LIST.OBJ|C:\USERS\MUHAMED.HALILOVIC\DESKTOP\RAYTRACINGINONEWEEK\00\CONSOLEAPPLICATION4\DEBUG\MATERIAL.OBJ|C:\USERS\MUHAMED.HALILOVIC\DESKTOP\RAYTRACINGINONEWEEK\00\CONSOLEAPPLICATION4\DEBUG\RAY.OBJ|C:\USERS\MUHAMED.HALILOVIC\DESKTOP\RAYTRACINGINONEWEEK\00\CONSOLEAPPLICATION4\DEBUG\SPHERE.OBJ|C:\USERS\MUHAMED.HALILOVIC\DESKTOP\RAYTRACINGINONEWEEK\00\CONSOLEAPPLICATION4\DEBUG\STDAFX.OBJ|C:\USERS\MUHAMED.HALILOVIC\DESKTOP\RAYTRACINGINONEWEEK\00\CONSOLEAPPLICATION4\DEBUG\VEC3.OBJ
C:\USERS\MUHAMED.HALILOVIC\DESKTOP\RAYTRACINGINONEWEEK\00\DEBUG\CONSOLEAPPLICATION4.ILK
C:\USERS\MUHAMED.HALILOVIC\DESKTOP\RAYTRACINGINONEWEEK\00\DEBUG\CONSOLEAPPLICATION4.EXE
C:\USERS\MUHAMED.HALILOVIC\DESKTOP\RAYTRACINGINONEWEEK\00\DEBUG\CONSOLEAPPLICATION4.PDB
