<svg version="1.2" xmlns="http://www.w3.org/2000/svg" viewBox="0 0 400 287" width="400" height="287">
	<title>&lt;Group&gt;</title>
	<style>
		.s0 { fill: #b8e8f2 } 
		.s1 { fill: #88cfe5 } 
		.s2 { fill: #16246d } 
		.s3 { fill: #111e56 } 
	</style>
	<g id="&lt;Group&gt;">
		<g id="&lt;Group&gt;">
			<path id="&lt;Path&gt;" class="s0" d="m164.7 47.5l74.5-43.7v38z"/>
			<path id="&lt;Path&gt;" class="s1" d="m164.7 47.5l90.3-33.5v27.2z"/>
			<path id="&lt;Path&gt;" class="s0" d="m164.7 47.5l-96.8-47.2v37z"/>
			<path id="&lt;Path&gt;" class="s1" d="m164.7 47.5l-117.2-38.6v26.1z"/>
			<path id="&lt;Path&gt;" class="s2" d="m164.8 230.2l-130.1-25.2-0.1-182.7 130.1 25.2z"/>
			<g id="&lt;Group&gt;">
				<path id="&lt;Compound Path&gt;" fill-rule="evenodd" class="s3" d="m295.3 151.2c0 32.3-25.4 58.4-56.8 64.5l-73.8 14.4v-182.6l68.8-13.4c30.6-5.9 55.5 9.9 55.5 41.4 0 15.1-5.8 28.2-15.3 38.7 13 6.1 21.5 18.5 21.6 37zm-90.4-72.4v32.4l28.6-5.6c9-1.8 15.3-9.8 15.3-19.2 0-9.3-6-14.9-15.3-13.1zm50.2 77c0-10.2-6.5-16.2-16.6-14.2l-33.6 6.5v35l33.6-6.6c10.1-1.9 16.6-10.5 16.6-20.7z"/>
			</g>
		</g>
		<path id="THEBOOKSTORE
" class="s1" aria-label="THEBOOKSTORE"  d="m0.3 260.1v-6.2h29.6v6.2h-10.7v25.9h-8.3v-25.9zm33.9 25.9v-32.1h8.3v12.2h12.2v-12.2h8.3v32.1h-8.3v-13.6h-12.2v13.6zm36.9 0v-32.1h22.3v6.2h-14.1v6h13.3v6.3h-13.3v7.3h14.6v6.3zm195-31.1v6.8q-2.6-1.2-5.1-1.8-2.5-0.6-4.8-0.6-2.9 0-4.4 0.8-1.4 0.8-1.4 2.6 0 1.3 1 2 0.9 0.7 3.5 1.2l3.5 0.7q5.3 1.1 7.6 3.3 2.3 2.2 2.3 6.2 0 5.3-3.2 7.9-3.1 2.6-9.6 2.6-3.1 0-6.2-0.6-3-0.5-6.1-1.7v-7q3.1 1.7 5.9 2.5 2.9 0.8 5.6 0.8 2.7 0 4.1-0.9 1.5-0.9 1.5-2.6 0-1.5-1-2.3-1-0.8-3.9-1.4l-3.2-0.8q-4.8-1-7.1-3.2-2.2-2.3-2.2-6.1 0-4.8 3.1-7.4 3.1-2.6 8.9-2.6 2.7 0 5.5 0.4 2.8 0.4 5.7 1.2zm5.6 5.2v-6.2h29.6v6.2h-10.7v25.9h-8.2v-25.9zm48.5-0.8q-3.8 0-5.9 2.8-2 2.8-2 7.9 0 5 2 7.8 2.1 2.8 5.9 2.8 3.8 0 5.9-2.8 2.1-2.8 2.1-7.8 0-5.1-2.1-7.9-2.1-2.8-5.9-2.8zm0-6q7.8 0 12.1 4.4 4.4 4.5 4.4 12.3 0 7.8-4.4 12.2-4.3 4.4-12.1 4.4-7.7 0-12.1-4.4-4.4-4.4-4.4-12.2 0-7.8 4.4-12.3 4.4-4.4 12.1-4.4zm31.1 14.8h3.5q2.6 0 3.7-0.9 1.1-1 1.1-3.2 0-2.2-1.1-3.2-1.1-0.9-3.7-0.9h-3.5zm2.3 5.7h-2.3v12.2h-8.3v-32.2h12.6q6.4 0 9.3 2.2 3 2.1 3 6.7 0 3.2-1.5 5.2-1.6 2.1-4.7 3 1.7 0.4 3.1 1.8 1.3 1.4 2.7 4.1l4.5 9.2h-8.8l-3.9-8q-1.2-2.4-2.5-3.3-1.2-0.9-3.2-0.9zm23.3 12.2v-32.2h22.4v6.3h-14.1v6h13.2v6.2h-13.2v7.4h14.5v6.3z"/>
		<path id="THEBOOKSTORE
" class="s2" aria-label="THEBOOKSTORE"  d="m109.4 266.3h4.6q1.9 0 2.9-0.8 1-0.9 1-2.6 0-1.6-1-2.5-1-0.9-2.9-0.9h-4.6zm0 14.1h4.8q2.5 0 3.8-1.1 1.3-1 1.3-3.2 0-2.1-1.3-3.1-1.2-1-3.8-1h-4.8zm12.5-11.6q2.7 0.8 4.2 2.9 1.4 2.1 1.4 5.1 0 4.6-3.1 6.9-3.1 2.3-9.6 2.3h-13.7v-32.1h12.4q6.7 0 9.7 2 3 2 3 6.5 0 2.3-1.1 4-1.1 1.6-3.2 2.4zm27.5-9.5q-3.8 0-5.9 2.8-2.1 2.8-2.1 7.9 0 5 2.1 7.8 2.1 2.8 5.9 2.8 3.8 0 5.8-2.8 2.1-2.8 2.1-7.8 0-5.1-2.1-7.9-2-2.8-5.8-2.8zm0-6q7.7 0 12.1 4.4 4.4 4.5 4.4 12.3 0 7.8-4.4 12.2-4.4 4.4-12.1 4.4-7.8 0-12.2-4.4-4.4-4.4-4.4-12.2 0-7.8 4.4-12.3 4.4-4.4 12.2-4.4zm37.4 6q-3.8 0-5.9 2.8-2.1 2.8-2.1 7.9 0 5 2.1 7.8 2.1 2.8 5.9 2.8 3.8 0 5.9-2.8 2.1-2.8 2.1-7.8 0-5.1-2.1-7.9-2.1-2.8-5.9-2.8zm0-6q7.7 0 12.1 4.4 4.4 4.5 4.4 12.3 0 7.8-4.4 12.2-4.4 4.4-12.1 4.4-7.7 0-12.1-4.4-4.4-4.4-4.4-12.2 0-7.8 4.4-12.3 4.4-4.4 12.1-4.4zm22.8 32.7v-32.1h8.3v11.7l11.9-11.7h9.6l-15.4 15.2 17 16.9h-10.4l-12.7-12.7v12.7z"/>
	</g>
</svg>