{
    "name": "MuffinDev.Unity.Core.Demos",
    "rootNamespace": "",
    "references": [
        "MuffinDev.Unity.Core"
    ],
    "includePlatforms": [],
    "excludePlatforms": [],
    "allowUnsafeCode": false,
    "overrideReferences": false,
    "precompiledReferences": [],
    "autoReferenced": true,
    "defineConstraints": [],
    "versionDefines": [],
    "noEngineReferences": false
}