Dakota version 6.19 released Nov. 15 2023.
Repository revision 262961b80 (2023-11-10) built Nov 10 2023 11:18:17.
Running MPI Dakota executable in serial mode.
Start time: Mon Jan 15 16:55:05 2024

-----------------------
Begin DAKOTA input file
dakota.in
-----------------------
environment
  tabular_data
    tabular_data_file 'aerofoilNACA0012_optimization.dat'

method
  efficient_global
    initial_samples = 10
    max_iterations  = 20

variables
  continuous_design = 1
    descriptors   'theta'
    upper_bounds  20.0
    initial_point 10.0
    lower_bounds  0.0

interface
  fork
    analysis_drivers = 'sim-allrun-parallel'
    parameters_file = 'params.in'
    results_file = 'results.out'

responses
  descriptors 'ldratio'
  objective_functions = 1
    sense "maximization"
  no_gradients
  no_hessians
---------------------
End DAKOTA input file
---------------------

Using Dakota input file 'dakota.in'
Writing new restart file 'dakota.rst'.

>>>>> Executing environment.

>>>>> Running efficient_global iterator.

>>>>> Building global_kriging approximations.

NonD lhs Samples = 10 Seed (system-generated) = 902587

---------------------
Begin Evaluation    1
---------------------
Parameters for evaluation 1:
                      1.7699248997e+01 theta

blocking fork: sim-allrun-parallel params.in results.out

Active response data for evaluation 1:
Active set vector = { 1 }
                      4.4116147124e+00 ldratio



---------------------
Begin Evaluation    2
---------------------
Parameters for evaluation 2:
                      1.9436300565e+01 theta

blocking fork: sim-allrun-parallel params.in results.out

Active response data for evaluation 2:
Active set vector = { 1 }
                      3.7449186506e+00 ldratio



---------------------
Begin Evaluation    3
---------------------
Parameters for evaluation 3:
                      8.8340992304e+00 theta

blocking fork: sim-allrun-parallel params.in results.out

Active response data for evaluation 3:
Active set vector = { 1 }
                      2.0383487845e+01 ldratio



---------------------
Begin Evaluation    4
---------------------
Parameters for evaluation 4:
                      1.5627435869e+01 theta

blocking fork: sim-allrun-parallel params.in results.out

Active response data for evaluation 4:
Active set vector = { 1 }
                      5.5080518177e+00 ldratio



---------------------
Begin Evaluation    5
---------------------
Parameters for evaluation 5:
                      6.1362867244e-01 theta

blocking fork: sim-allrun-parallel params.in results.out

Active response data for evaluation 5:
Active set vector = { 1 }
                      4.7718337900e+00 ldratio



---------------------
Begin Evaluation    6
---------------------
Parameters for evaluation 6:
                      2.1001991150e+00 theta

blocking fork: sim-allrun-parallel params.in results.out

Active response data for evaluation 6:
Active set vector = { 1 }
                      1.5309339994e+01 ldratio



---------------------
Begin Evaluation    7
---------------------
Parameters for evaluation 7:
                      1.3700668429e+01 theta

blocking fork: sim-allrun-parallel params.in results.out

Active response data for evaluation 7:
Active set vector = { 1 }
                      7.3329895899e+00 ldratio



---------------------
Begin Evaluation    8
---------------------
Parameters for evaluation 8:
                      6.4136010809e+00 theta

blocking fork: sim-allrun-parallel params.in results.out

Active response data for evaluation 8:
Active set vector = { 1 }
                      2.3403023777e+01 ldratio



---------------------
Begin Evaluation    9
---------------------
Parameters for evaluation 9:
                      5.0727431369e+00 theta

blocking fork: sim-allrun-parallel params.in results.out

Active response data for evaluation 9:
Active set vector = { 1 }
                      2.4076035551e+01 ldratio



---------------------
Begin Evaluation   10
---------------------
Parameters for evaluation 10:
                      1.0806784206e+01 theta

blocking fork: sim-allrun-parallel params.in results.out

Active response data for evaluation 10:
Active set vector = { 1 }
                      1.6455300077e+01 ldratio



>>>>> Appending 10 points to global_kriging approximations.

<<<<< global_kriging approximation updates completed.
Constructing global approximations with no anchor, 10 DACE samples, and 0 reused points.

<<<<< global_kriging approximation builds completed.

>>>>> Initiating global iteration 1 (acquisition batch 1)
Beginning Approximate Fn Evaluations...
NCSU DIRECT succeeded with code 1
(maximum function evaluations exceeded)

Results of EGO iteration:
Final point =
                      5.2648261719e+00 theta
Expected Improvement    =
                      2.3342504027e-02

---------------------
Begin Evaluation   11
---------------------
Parameters for evaluation 11:
                      5.2648261719e+00 theta

blocking fork: sim-allrun-parallel params.in results.out

Active response data for evaluation 11:
Active set vector = { 1 }
                      2.4102989347e+01 ldratio



>>>>> Appending to global_kriging approximations.

<<<<< global_kriging approximation updates completed.

>>>>> Initiating global iteration 2 (acquisition batch 1)
NCSU DIRECT succeeded with code 2
(maximum iterations reached)

Results of EGO iteration:
Final point =
                      5.2711761716e+00 theta
Expected Improvement    =
                      2.6843220231e-05

---------------------
Begin Evaluation   12
---------------------
Parameters for evaluation 12:
                      5.2711761716e+00 theta

blocking fork: sim-allrun-parallel params.in results.out

Active response data for evaluation 12:
Active set vector = { 1 }
                      2.4102842641e+01 ldratio



>>>>> Appending to global_kriging approximations.

<<<<< global_kriging approximation updates completed.

>>>>> Initiating global iteration 3 (acquisition batch 1)
NCSU DIRECT succeeded with code 2
(maximum iterations reached)

Results of EGO iteration:
Final point =
                      5.2533569282e+00 theta
Expected Improvement    =
                      1.0407926647e-04

---------------------
Begin Evaluation   13
---------------------
Parameters for evaluation 13:
                      5.2533569282e+00 theta

blocking fork: sim-allrun-parallel params.in results.out

Active response data for evaluation 13:
Active set vector = { 1 }
                      2.4102990911e+01 ldratio



>>>>> Appending to global_kriging approximations.

<<<<< global_kriging approximation updates completed.

>>>>> Initiating global iteration 4 (acquisition batch 1)
NCSU DIRECT succeeded with code 1
(maximum function evaluations exceeded)

Results of EGO iteration:
Final point =
                      7.4557727637e+00 theta
Expected Improvement    =
                      1.6161608531e+00

---------------------
Begin Evaluation   14
---------------------
Parameters for evaluation 14:
                      7.4557727637e+00 theta

blocking fork: sim-allrun-parallel params.in results.out

Active response data for evaluation 14:
Active set vector = { 1 }
                      2.2291306504e+01 ldratio



>>>>> Appending to global_kriging approximations.

<<<<< global_kriging approximation updates completed.

>>>>> Initiating global iteration 5 (acquisition batch 1)
NCSU DIRECT succeeded with code 2
(maximum iterations reached)

Results of EGO iteration:
Final point =
                      5.2567779140e+00 theta
Expected Improvement    =
                      8.9119964173e-06

---------------------
Begin Evaluation   15
---------------------
Parameters for evaluation 15:
                      5.2567779140e+00 theta

blocking fork: sim-allrun-parallel params.in results.out

Active response data for evaluation 15:
Active set vector = { 1 }
                      2.4103043177e+01 ldratio



>>>>> Appending to global_kriging approximations.

<<<<< global_kriging approximation updates completed.

>>>>> Initiating global iteration 6 (acquisition batch 1)
NCSU DIRECT succeeded with code 2
(maximum iterations reached)

Results of EGO iteration:
Final point =
                      5.2570840413e+00 theta
Expected Improvement    =
                      2.3526924421e-08

---------------------
Begin Evaluation   16
---------------------
Parameters for evaluation 16:
                      5.2570840413e+00 theta

blocking fork: sim-allrun-parallel params.in results.out

Active response data for evaluation 16:
Active set vector = { 1 }
                      2.4103044716e+01 ldratio



>>>>> Appending to global_kriging approximations.

<<<<< global_kriging approximation updates completed.

>>>>> Initiating global iteration 7 (acquisition batch 1)
NCSU DIRECT succeeded with code 2
(maximum iterations reached)

Results of EGO iteration:
Final point =
                      5.2567202505e+00 theta
Expected Improvement    =
                      4.0655271994e-08

---------------------
Begin Evaluation   17
---------------------
Parameters for evaluation 17:
                      5.2567202505e+00 theta

blocking fork: sim-allrun-parallel params.in results.out

Active response data for evaluation 17:
Active set vector = { 1 }
                      2.4103042901e+01 ldratio



>>>>> Appending to global_kriging approximations.

<<<<< global_kriging approximation updates completed.

>>>>> Initiating global iteration 8 (acquisition batch 1)
NCSU DIRECT succeeded with code 2
(maximum iterations reached)

Results of EGO iteration:
Final point =
                      5.2568094559e+00 theta
Expected Improvement    =
                      5.1176411880e-08

---------------------
Begin Evaluation   18
---------------------
Parameters for evaluation 18:
                      5.2568094559e+00 theta

blocking fork: sim-allrun-parallel params.in results.out

Active response data for evaluation 18:
Active set vector = { 1 }
                      2.4103043402e+01 ldratio



>>>>> Appending to global_kriging approximations.

<<<<< global_kriging approximation updates completed.

>>>>> Initiating global iteration 9 (acquisition batch 1)
NCSU DIRECT succeeded with code 2
(maximum iterations reached)

Results of EGO iteration:
Final point =
                      5.2568206066e+00 theta
Expected Improvement    =
                      4.1193880529e-08

---------------------
Begin Evaluation   19
---------------------
Parameters for evaluation 19:
                      5.2568206066e+00 theta

blocking fork: sim-allrun-parallel params.in results.out

Active response data for evaluation 19:
Active set vector = { 1 }
                      2.4103043514e+01 ldratio



>>>>> Appending to global_kriging approximations.

<<<<< global_kriging approximation updates completed.

>>>>> Initiating global iteration 10 (acquisition batch 1)
NCSU DIRECT succeeded with code 2
(maximum iterations reached)

Results of EGO iteration:
Final point =
                      5.2566324390e+00 theta
Expected Improvement    =
                      3.4617483016e-08

---------------------
Begin Evaluation   20
---------------------
Parameters for evaluation 20:
                      5.2566324390e+00 theta

blocking fork: sim-allrun-parallel params.in results.out

Active response data for evaluation 20:
Active set vector = { 1 }
                      2.4103037705e+01 ldratio



>>>>> Appending to global_kriging approximations.

<<<<< global_kriging approximation updates completed.

>>>>> Initiating global iteration 11 (acquisition batch 1)
NCSU DIRECT succeeded with code 2
(maximum iterations reached)

Results of EGO iteration:
Final point =
                      5.2568080621e+00 theta
Expected Improvement    =
                      5.9219064581e-08

---------------------
Begin Evaluation   21
---------------------
Parameters for evaluation 21:
                      5.2568080621e+00 theta

blocking fork: sim-allrun-parallel params.in results.out

Active response data for evaluation 21:
Active set vector = { 1 }
                      2.4103043412e+01 ldratio



>>>>> Appending to global_kriging approximations.

<<<<< global_kriging approximation updates completed.

>>>>> Initiating global iteration 12 (acquisition batch 1)
NCSU DIRECT succeeded with code 2
(maximum iterations reached)

Results of EGO iteration:
Final point =
                      5.2565194868e+00 theta
Expected Improvement    =
                      2.1524345031e-08

---------------------
Begin Evaluation   22
---------------------
Parameters for evaluation 22:
                      5.2565194868e+00 theta

blocking fork: sim-allrun-parallel params.in results.out

Active response data for evaluation 22:
Active set vector = { 1 }
                      2.4103037034e+01 ldratio



>>>>> Appending to global_kriging approximations.

<<<<< global_kriging approximation updates completed.

>>>>> Initiating global iteration 13 (acquisition batch 1)
NCSU DIRECT succeeded with code 2
(maximum iterations reached)

Results of EGO iteration:
Final point =
                      5.2567453396e+00 theta
Expected Improvement    =
                      4.1830944301e-08

---------------------
Begin Evaluation   23
---------------------
Parameters for evaluation 23:
                      5.2567453396e+00 theta

blocking fork: sim-allrun-parallel params.in results.out

Active response data for evaluation 23:
Active set vector = { 1 }
                      2.4103043080e+01 ldratio



>>>>> Appending to global_kriging approximations.

<<<<< global_kriging approximation updates completed.

>>>>> Initiating global iteration 14 (acquisition batch 1)
NCSU DIRECT succeeded with code 2
(maximum iterations reached)

Results of EGO iteration:
Final point =
                      5.2569167812e+00 theta
Expected Improvement    =
                      5.2276013304e-08

---------------------
Begin Evaluation   24
---------------------
Parameters for evaluation 24:
                      5.2569167812e+00 theta

blocking fork: sim-allrun-parallel params.in results.out

Active response data for evaluation 24:
Active set vector = { 1 }
                      2.4103043767e+01 ldratio



>>>>> Appending to global_kriging approximations.

<<<<< global_kriging approximation updates completed.

>>>>> Initiating global iteration 15 (acquisition batch 1)
NCSU DIRECT succeeded with code 2
(maximum iterations reached)

Results of EGO iteration:
Final point =
                      5.2567717708e+00 theta
Expected Improvement    =
                      4.2139035505e-08

---------------------
Begin Evaluation   25
---------------------
Parameters for evaluation 25:
                      5.2567717708e+00 theta

blocking fork: sim-allrun-parallel params.in results.out

Active response data for evaluation 25:
Active set vector = { 1 }
                      2.4103043207e+01 ldratio



>>>>> Appending to global_kriging approximations.

<<<<< global_kriging approximation updates completed.

>>>>> Initiating global iteration 16 (acquisition batch 1)
NCSU DIRECT succeeded with code 2
(maximum iterations reached)

Results of EGO iteration:
Final point =
                      5.2567817341e+00 theta
Expected Improvement    =
                      5.9334168197e-08

---------------------
Begin Evaluation   26
---------------------
Parameters for evaluation 26:
                      5.2567817341e+00 theta

blocking fork: sim-allrun-parallel params.in results.out

Active response data for evaluation 26:
Active set vector = { 1 }
                      2.4103043246e+01 ldratio



>>>>> Appending to global_kriging approximations.

<<<<< global_kriging approximation updates completed.

>>>>> Initiating global iteration 17 (acquisition batch 1)
NCSU DIRECT succeeded with code 2
(maximum iterations reached)

Results of EGO iteration:
Final point =
                      5.2567829731e+00 theta
Expected Improvement    =
                      4.2017386542e-08

---------------------
Begin Evaluation   27
---------------------
Parameters for evaluation 27:
                      5.2567829731e+00 theta

blocking fork: sim-allrun-parallel params.in results.out

Active response data for evaluation 27:
Active set vector = { 1 }
                      2.4103043326e+01 ldratio



>>>>> Appending to global_kriging approximations.

<<<<< global_kriging approximation updates completed.

>>>>> Initiating global iteration 18 (acquisition batch 1)
NCSU DIRECT succeeded with code 2
(maximum iterations reached)

Results of EGO iteration:
Final point =
                      5.2569321134e+00 theta
Expected Improvement    =
                      3.3606915465e-08

---------------------
Begin Evaluation   28
---------------------
Parameters for evaluation 28:
                      5.2569321134e+00 theta

blocking fork: sim-allrun-parallel params.in results.out

Active response data for evaluation 28:
Active set vector = { 1 }
                      2.4103043987e+01 ldratio



>>>>> Appending to global_kriging approximations.

<<<<< global_kriging approximation updates completed.

>>>>> Initiating global iteration 19 (acquisition batch 1)
NCSU DIRECT succeeded with code 2
(maximum iterations reached)

Results of EGO iteration:
Final point =
                      5.2567239674e+00 theta
Expected Improvement    =
                      4.1055519409e-08

---------------------
Begin Evaluation   29
---------------------
Parameters for evaluation 29:
                      5.2567239674e+00 theta

blocking fork: sim-allrun-parallel params.in results.out

Active response data for evaluation 29:
Active set vector = { 1 }
                      2.4103042891e+01 ldratio



>>>>> Appending to global_kriging approximations.

<<<<< global_kriging approximation updates completed.

>>>>> Initiating global iteration 20 (acquisition batch 1)
NCSU DIRECT succeeded with code 2
(maximum iterations reached)

Results of EGO iteration:
Final point =
                      5.2569904995e+00 theta
Expected Improvement    =
                      2.6889178174e-08

---------------------
Begin Evaluation   30
---------------------
Parameters for evaluation 30:
                      5.2569904995e+00 theta

blocking fork: sim-allrun-parallel params.in results.out

Active response data for evaluation 30:
Active set vector = { 1 }
                      2.4103044330e+01 ldratio



>>>>> Appending to global_kriging approximations.

<<<<< global_kriging approximation updates completed.

Stopping criteria not met: distConvergenceCntr (0) < distConvergenceLimit (1)
Stopping criteria not met: eifConvergenceCntr (0) < eifConvergenceLimit (2)
Stopping criteria met:     globalIterCount (20) >= maxIterations (20)
<<<<< Function evaluation summary: 30 total (30 new, 0 duplicate)
<<<<< Best parameters          =
                      5.2570840413e+00 theta
<<<<< Best objective function  =
                      2.4103044716e+01
<<<<< Best evaluation ID: 16


<<<<< Iterator efficient_global completed.
<<<<< Environment execution completed.
DAKOTA execution time in seconds:
  Total CPU        =    8.04962 [parent =    8.04962, child =      2e-06]
  Total wall clock =    6433.19
