<?xml version="1.0" encoding="UTF-8"?>
<svg width="856px" height="900px" viewBox="0 0 856 900" version="1.1" xmlns="http://www.w3.org/2000/svg" xmlns:xlink="http://www.w3.org/1999/xlink">
    <!-- Generator: Sketch 51.2 (57519) - http://www.bohemiancoding.com/sketch -->
    <title>hero BG</title>
    <desc>Created with Sketch.</desc>
    <defs>
        <rect id="path-1" x="0" y="0" width="1440" height="900"></rect>
        <linearGradient x1="69.8691716%" y1="91.1191003%" x2="69.8691716%" y2="-36.3333544%" id="linearGradient-3">
            <stop stop-color="#0D96E6" offset="0%"></stop>
            <stop stop-color="#0078BF" offset="100%"></stop>
        </linearGradient>
    </defs>
    <g id="Homepage-Option-1" stroke="none" stroke-width="1" fill="none" fill-rule="evenodd">
        <g id="Invoice-Me-Concept_07" transform="translate(-584.000000, 0.000000)">
            <g id="hero-BG">
                <mask id="mask-2" fill="white">
                    <use xlink:href="#path-1"></use>
                </mask>
                <use id="Rectangle-17" fill-opacity="0" fill="#D8D8D8" fill-rule="nonzero" xlink:href="#path-1"></use>
                <g id="Stripes" mask="url(#mask-2)" fill="url(#linearGradient-3)" fill-rule="nonzero">
                    <g transform="translate(530.000000, -354.000000)">
                        <rect id="Rectangle-10" transform="translate(509.762702, 382.934899) rotate(-30.000000) translate(-509.762702, -382.934899) " x="9.76270189" y="229.434899" width="1000" height="307" rx="150"></rect>
                        <rect id="Rectangle-10-Copy-2" transform="translate(1113.762702, 927.934899) rotate(-30.000000) translate(-1113.762702, -927.934899) " x="613.762702" y="774.434899" width="1000" height="307" rx="150"></rect>
                        <rect id="Rectangle-10-Copy" transform="translate(742.782331, 708.679526) rotate(-30.000000) translate(-742.782331, -708.679526) " x="-10.1197527" y="555.179526" width="1505.80417" height="307" rx="150"></rect>
                    </g>
                </g>
            </g>
        </g>
    </g>
</svg>