<svg width="27" height="28" xmlns="http://www.w3.org/2000/svg">
    <path d="M1.37 20.999A14.018 14.018 0 0 1 0 17.743a4.199 4.199 0 0 0 .003-7.485 13.981 13.981 0 0 1 3.503-6.07 4.205 4.205 0 0 0 4.392.116A4.199 4.199 0 0 0 9.993.444c2.3-.593 4.713-.592 7.013.004a4.199 4.199 0 0 0 2.097 3.857c1.369.79 3.066.744 4.391-.117A13.986 13.986 0 0 1 25.63 7 13.954 13.954 0 0 1 27 10.257a4.199 4.199 0 0 0-.003 7.485 13.981 13.981 0 0 1-3.503 6.07 4.205 4.205 0 0 0-4.392-.116 4.199 4.199 0 0 0-2.095 3.86c-2.3.593-4.713.592-7.013-.004a4.199 4.199 0 0 0-2.097-3.857 4.205 4.205 0 0 0-4.391.117A14.024 14.024 0 0 1 1.37 21zm7.928.274a6.99 6.99 0 0 1 3.151 3.877c.7.066 1.401.068 2.1.002a6.99 6.99 0 0 1 3.153-3.877 6.998 6.998 0 0 1 4.938-.791c.406-.571.756-1.18 1.047-1.817A6.986 6.986 0 0 1 21.904 14c0-1.764.659-3.411 1.783-4.667a11.372 11.372 0 0 0-1.05-1.817 6.998 6.998 0 0 1-4.935-.79 6.99 6.99 0 0 1-3.151-3.876c-.7-.066-1.401-.068-2.1-.002a6.99 6.99 0 0 1-3.153 3.877 6.998 6.998 0 0 1-4.938.791c-.405.572-.756 1.18-1.047 1.817A6.986 6.986 0 0 1 5.096 14a6.983 6.983 0 0 1-1.783 4.667c.293.636.645 1.245 1.05 1.817a6.998 6.998 0 0 1 4.935.79zM13.5 18.2A4.2 4.2 0 0 1 9.298 14 4.2 4.2 0 0 1 13.5 9.8a4.2 4.2 0 0 1 4.202 4.2 4.2 4.2 0 0 1-4.202 4.2zm0-2.8a1.4 1.4 0 1 0 .001-2.8 1.4 1.4 0 0 0-.001 2.8z" fill="#FFF" fill-rule="nonzero"/>
</svg>
