<svg width="30" height="26" xmlns="http://www.w3.org/2000/svg">
    <g fill="none" fill-rule="evenodd" opacity=".6">
        <path stroke="#50CAFF" stroke-linecap="square" d="M3 3v20M27 23H3"/>
        <path fill="#50CAFF" d="M7 17h4v4H7zM21 13h4v8h-4zM14 7h4v14h-4z"/>
    </g>
</svg>
