{
  "language": "Solidity",
  "sources": {
    "flattened/ENSRegistry.sol": {
      "content": "// Sources flattened with hardhat v2.6.7 https://hardhat.org\n\n// File contracts/helpers/interfaces/ENS.sol\n\n// SPDX-License-Identifier: UNLICENSED\n\npragma solidity ^0.8.0;\n\ninterface ENS {\n\n    // Logged when the owner of a node assigns a new owner to a subnode.\n    event NewOwner(bytes32 indexed node, bytes32 indexed label, address _owner);\n\n    // Logged when the owner of a node transfers ownership to a new account.\n    event Transfer(bytes32 indexed node, address _owner);\n\n    // Logged when the resolver for a node changes.\n    event NewResolver(bytes32 indexed node, address _resolver);\n\n    // Logged when the TTL of a node changes\n    event NewTTL(bytes32 indexed node, uint64 _ttl);\n\n    // Logged when an operator is added or removed.\n    event ApprovalForAll(address indexed owner, address indexed operator, bool approved);\n\n    function setRecord(bytes32 node, address _owner, address _resolver, uint64 _ttl) external;\n    function setSubnodeRecord(bytes32 node, bytes32 label, address _owner, address _resolver, uint64 _ttl) external;\n    function setSubnodeOwner(bytes32 node, bytes32 label, address _owner) external returns(bytes32);\n    function setResolver(bytes32 node, address _resolver) external;\n    function setOwner(bytes32 node, address _owner) external;\n    function setTTL(bytes32 node, uint64 _ttl) external;\n    function setApprovalForAll(address operator, bool approved) external;\n    function owner(bytes32 node) external view returns (address);\n    function resolver(bytes32 node) external view returns (address);\n    function ttl(bytes32 node) external view returns (uint64);\n    function recordExists(bytes32 node) external view returns (bool);\n    function isApprovedForAll(address _owner, address operator) external view returns (bool);\n}\n\n\n// File contracts/helpers/ENSRegistry.sol\n\n\npragma solidity ^0.8.0;\n\n/**\n * The ENS registry contract.\n */\ncontract ENSRegistry is ENS {\n\n    struct Record {\n        address owner;\n        address resolver;\n        uint64 ttl;\n    }\n\n    mapping (bytes32 => Record) records;\n    mapping (address => mapping(address => bool)) operators;\n\n    // Permits modifications only by the owner of the specified node.\n    modifier authorised(bytes32 node) {\n        address _owner = records[node].owner;\n        require(_owner == msg.sender || operators[_owner][msg.sender]);\n        _;\n    }\n\n    /**\n     * @dev Constructs a new ENS registrar.\n     */\n    constructor() {\n        records[0x0].owner = msg.sender;\n    }\n\n    /**\n     * @dev Sets the record for a node.\n     * @param node The node to update.\n     * @param _owner The address of the new owner.\n     * @param _resolver The address of the resolver.\n     * @param _ttl The TTL in seconds.\n     */\n    function setRecord(bytes32 node, address _owner, address _resolver, uint64 _ttl) external override {\n        setOwner(node, _owner);\n        _setResolverAndTTL(node, _resolver, _ttl);\n    }\n\n    /**\n     * @dev Sets the record for a subnode.\n     * @param node The parent node.\n     * @param label The hash of the label specifying the subnode.\n     * @param _owner The address of the new owner.\n     * @param _resolver The address of the resolver.\n     * @param _ttl The TTL in seconds.\n     */\n    function setSubnodeRecord(bytes32 node, bytes32 label, address _owner, address _resolver, uint64 _ttl) external override {\n        bytes32 subnode = setSubnodeOwner(node, label, _owner);\n        _setResolverAndTTL(subnode, _resolver, _ttl);\n    }\n\n    /**\n     * @dev Transfers ownership of a node to a new address. May only be called by the current owner of the node.\n     * @param node The node to transfer ownership of.\n     * @param _owner The address of the new owner.\n     */\n    function setOwner(bytes32 node, address _owner) public override authorised(node) {\n        _setOwner(node, _owner);\n        emit Transfer(node, _owner);\n    }\n\n    /**\n     * @dev Transfers ownership of a subnode keccak256(node, label) to a new address. May only be called by the owner of the parent node.\n     * @param node The parent node.\n     * @param label The hash of the label specifying the subnode.\n     * @param _owner The address of the new owner.\n     */\n    function setSubnodeOwner(bytes32 node, bytes32 label, address _owner) public override authorised(node) returns(bytes32) {\n        bytes32 subnode = keccak256(abi.encodePacked(node, label));\n        _setOwner(subnode, _owner);\n        emit NewOwner(node, label, _owner);\n        return subnode;\n    }\n\n    /**\n     * @dev Sets the resolver address for the specified node.\n     * @param node The node to update.\n     * @param _resolver The address of the resolver.\n     */\n    function setResolver(bytes32 node, address _resolver) public override authorised(node) {\n        emit NewResolver(node, _resolver);\n        records[node].resolver = _resolver;\n    }\n\n    /**\n     * @dev Sets the TTL for the specified node.\n     * @param node The node to update.\n     * @param _ttl The TTL in seconds.\n     */\n    function setTTL(bytes32 node, uint64 _ttl) public override authorised(node) {\n        emit NewTTL(node, _ttl);\n        records[node].ttl = _ttl;\n    }\n\n    /**\n     * @dev Enable or disable approval for a third party (\"operator\") to manage\n     *  all of `msg.sender`'s ENS records. Emits the ApprovalForAll event.\n     * @param operator Address to add to the set of authorized operators.\n     * @param approved True if the operator is approved, false to revoke approval.\n     */\n    function setApprovalForAll(address operator, bool approved) external override {\n        operators[msg.sender][operator] = approved;\n        emit ApprovalForAll(msg.sender, operator, approved);\n    }\n\n    /**\n     * @dev Returns the address that owns the specified node.\n     * @param node The specified node.\n     * @return address of the owner.\n     */\n    function owner(bytes32 node) public virtual view override returns (address) {\n        address addr = records[node].owner;\n        if (addr == address(this)) {\n            return address(0x0);\n        }\n\n        return addr;\n    }\n\n    /**\n     * @dev Returns the address of the resolver for the specified node.\n     * @param node The specified node.\n     * @return address of the resolver.\n     */\n    function resolver(bytes32 node) public virtual view override returns (address) {\n        return records[node].resolver;\n    }\n\n    /**\n     * @dev Returns the TTL of a node, and any records associated with it.\n     * @param node The specified node.\n     * @return ttl of the node.\n     */\n    function ttl(bytes32 node) public virtual view override returns (uint64) {\n        return records[node].ttl;\n    }\n\n    /**\n     * @dev Returns whether a record has been imported to the registry.\n     * @param node The specified node.\n     * @return Bool if record exists\n     */\n    function recordExists(bytes32 node) public view override returns (bool) {\n        return records[node].owner != address(0x0);\n    }\n\n    /**\n     * @dev Query if an address is an authorized operator for another address.\n     * @param _owner The address that owns the records.\n     * @param operator The address that acts on behalf of the owner.\n     * @return True if `operator` is an approved operator for `owner`, false otherwise.\n     */\n    function isApprovedForAll(address _owner, address operator) external view override returns (bool) {\n        return operators[_owner][operator];\n    }\n\n    function _setOwner(bytes32 node, address _owner) internal virtual {\n        records[node].owner = _owner;\n    }\n\n    function _setResolverAndTTL(bytes32 node, address _resolver, uint64 _ttl) internal {\n        if(_resolver != records[node].resolver) {\n            records[node].resolver = _resolver;\n            emit NewResolver(node, _resolver);\n        }\n\n        if(_ttl != records[node].ttl) {\n            records[node].ttl = _ttl;\n            emit NewTTL(node, _ttl);\n        }\n    }\n}"
    }
  },
  "settings": {
    "optimizer": {
      "enabled": true,
      "runs": 200
    },
    "outputSelection": {
      "*": {
        "*": [
          "abi",
          "evm.bytecode",
          "evm.deployedBytecode",
          "evm.methodIdentifiers",
          "metadata",
          "devdoc",
          "userdoc",
          "storageLayout",
          "evm.gasEstimates"
        ],
        "": [
          "ast"
        ]
      }
    },
    "metadata": {
      "useLiteralContent": true
    }
  }
}