{
  "language": "Solidity",
  "sources": {
    "flattened/MiningHill.sol": {
      "content": "// Sources flattened with hardhat v2.8.4 https://hardhat.org\n\n// File @openzeppelin/contracts/token/ERC20/IERC20.sol@v4.5.0\n\n// SPDX-License-Identifier: MIT\n// OpenZeppelin Contracts (last updated v4.5.0) (token/ERC20/IERC20.sol)\n\npragma solidity ^0.8.0;\n\n/**\n * @dev Interface of the ERC20 standard as defined in the EIP.\n */\ninterface IERC20 {\n    /**\n     * @dev Returns the amount of tokens in existence.\n     */\n    function totalSupply() external view returns (uint256);\n\n    /**\n     * @dev Returns the amount of tokens owned by `account`.\n     */\n    function balanceOf(address account) external view returns (uint256);\n\n    /**\n     * @dev Moves `amount` tokens from the caller's account to `to`.\n     *\n     * Returns a boolean value indicating whether the operation succeeded.\n     *\n     * Emits a {Transfer} event.\n     */\n    function transfer(address to, uint256 amount) external returns (bool);\n\n    /**\n     * @dev Returns the remaining number of tokens that `spender` will be\n     * allowed to spend on behalf of `owner` through {transferFrom}. This is\n     * zero by default.\n     *\n     * This value changes when {approve} or {transferFrom} are called.\n     */\n    function allowance(address owner, address spender) external view returns (uint256);\n\n    /**\n     * @dev Sets `amount` as the allowance of `spender` over the caller's tokens.\n     *\n     * Returns a boolean value indicating whether the operation succeeded.\n     *\n     * IMPORTANT: Beware that changing an allowance with this method brings the risk\n     * that someone may use both the old and the new allowance by unfortunate\n     * transaction ordering. One possible solution to mitigate this race\n     * condition is to first reduce the spender's allowance to 0 and set the\n     * desired value afterwards:\n     * https://github.com/ethereum/EIPs/issues/20#issuecomment-263524729\n     *\n     * Emits an {Approval} event.\n     */\n    function approve(address spender, uint256 amount) external returns (bool);\n\n    /**\n     * @dev Moves `amount` tokens from `from` to `to` using the\n     * allowance mechanism. `amount` is then deducted from the caller's\n     * allowance.\n     *\n     * Returns a boolean value indicating whether the operation succeeded.\n     *\n     * Emits a {Transfer} event.\n     */\n    function transferFrom(\n        address from,\n        address to,\n        uint256 amount\n    ) external returns (bool);\n\n    /**\n     * @dev Emitted when `value` tokens are moved from one account (`from`) to\n     * another (`to`).\n     *\n     * Note that `value` may be zero.\n     */\n    event Transfer(address indexed from, address indexed to, uint256 value);\n\n    /**\n     * @dev Emitted when the allowance of a `spender` for an `owner` is set by\n     * a call to {approve}. `value` is the new allowance.\n     */\n    event Approval(address indexed owner, address indexed spender, uint256 value);\n}\n\n\n// File @openzeppelin/contracts/utils/Address.sol@v4.5.0\n\n// OpenZeppelin Contracts (last updated v4.5.0) (utils/Address.sol)\n\npragma solidity ^0.8.1;\n\n/**\n * @dev Collection of functions related to the address type\n */\nlibrary Address {\n    /**\n     * @dev Returns true if `account` is a contract.\n     *\n     * [IMPORTANT]\n     * ====\n     * It is unsafe to assume that an address for which this function returns\n     * false is an externally-owned account (EOA) and not a contract.\n     *\n     * Among others, `isContract` will return false for the following\n     * types of addresses:\n     *\n     *  - an externally-owned account\n     *  - a contract in construction\n     *  - an address where a contract will be created\n     *  - an address where a contract lived, but was destroyed\n     * ====\n     *\n     * [IMPORTANT]\n     * ====\n     * You shouldn't rely on `isContract` to protect against flash loan attacks!\n     *\n     * Preventing calls from contracts is highly discouraged. It breaks composability, breaks support for smart wallets\n     * like Gnosis Safe, and does not provide security since it can be circumvented by calling from a contract\n     * constructor.\n     * ====\n     */\n    function isContract(address account) internal view returns (bool) {\n        // This method relies on extcodesize/address.code.length, which returns 0\n        // for contracts in construction, since the code is only stored at the end\n        // of the constructor execution.\n\n        return account.code.length > 0;\n    }\n\n    /**\n     * @dev Replacement for Solidity's `transfer`: sends `amount` wei to\n     * `recipient`, forwarding all available gas and reverting on errors.\n     *\n     * https://eips.ethereum.org/EIPS/eip-1884[EIP1884] increases the gas cost\n     * of certain opcodes, possibly making contracts go over the 2300 gas limit\n     * imposed by `transfer`, making them unable to receive funds via\n     * `transfer`. {sendValue} removes this limitation.\n     *\n     * https://diligence.consensys.net/posts/2019/09/stop-using-soliditys-transfer-now/[Learn more].\n     *\n     * IMPORTANT: because control is transferred to `recipient`, care must be\n     * taken to not create reentrancy vulnerabilities. Consider using\n     * {ReentrancyGuard} or the\n     * https://solidity.readthedocs.io/en/v0.5.11/security-considerations.html#use-the-checks-effects-interactions-pattern[checks-effects-interactions pattern].\n     */\n    function sendValue(address payable recipient, uint256 amount) internal {\n        require(address(this).balance >= amount, \"Address: insufficient balance\");\n\n        (bool success, ) = recipient.call{value: amount}(\"\");\n        require(success, \"Address: unable to send value, recipient may have reverted\");\n    }\n\n    /**\n     * @dev Performs a Solidity function call using a low level `call`. A\n     * plain `call` is an unsafe replacement for a function call: use this\n     * function instead.\n     *\n     * If `target` reverts with a revert reason, it is bubbled up by this\n     * function (like regular Solidity function calls).\n     *\n     * Returns the raw returned data. To convert to the expected return value,\n     * use https://solidity.readthedocs.io/en/latest/units-and-global-variables.html?highlight=abi.decode#abi-encoding-and-decoding-functions[`abi.decode`].\n     *\n     * Requirements:\n     *\n     * - `target` must be a contract.\n     * - calling `target` with `data` must not revert.\n     *\n     * _Available since v3.1._\n     */\n    function functionCall(address target, bytes memory data) internal returns (bytes memory) {\n        return functionCall(target, data, \"Address: low-level call failed\");\n    }\n\n    /**\n     * @dev Same as {xref-Address-functionCall-address-bytes-}[`functionCall`], but with\n     * `errorMessage` as a fallback revert reason when `target` reverts.\n     *\n     * _Available since v3.1._\n     */\n    function functionCall(\n        address target,\n        bytes memory data,\n        string memory errorMessage\n    ) internal returns (bytes memory) {\n        return functionCallWithValue(target, data, 0, errorMessage);\n    }\n\n    /**\n     * @dev Same as {xref-Address-functionCall-address-bytes-}[`functionCall`],\n     * but also transferring `value` wei to `target`.\n     *\n     * Requirements:\n     *\n     * - the calling contract must have an ETH balance of at least `value`.\n     * - the called Solidity function must be `payable`.\n     *\n     * _Available since v3.1._\n     */\n    function functionCallWithValue(\n        address target,\n        bytes memory data,\n        uint256 value\n    ) internal returns (bytes memory) {\n        return functionCallWithValue(target, data, value, \"Address: low-level call with value failed\");\n    }\n\n    /**\n     * @dev Same as {xref-Address-functionCallWithValue-address-bytes-uint256-}[`functionCallWithValue`], but\n     * with `errorMessage` as a fallback revert reason when `target` reverts.\n     *\n     * _Available since v3.1._\n     */\n    function functionCallWithValue(\n        address target,\n        bytes memory data,\n        uint256 value,\n        string memory errorMessage\n    ) internal returns (bytes memory) {\n        require(address(this).balance >= value, \"Address: insufficient balance for call\");\n        require(isContract(target), \"Address: call to non-contract\");\n\n        (bool success, bytes memory returndata) = target.call{value: value}(data);\n        return verifyCallResult(success, returndata, errorMessage);\n    }\n\n    /**\n     * @dev Same as {xref-Address-functionCall-address-bytes-}[`functionCall`],\n     * but performing a static call.\n     *\n     * _Available since v3.3._\n     */\n    function functionStaticCall(address target, bytes memory data) internal view returns (bytes memory) {\n        return functionStaticCall(target, data, \"Address: low-level static call failed\");\n    }\n\n    /**\n     * @dev Same as {xref-Address-functionCall-address-bytes-string-}[`functionCall`],\n     * but performing a static call.\n     *\n     * _Available since v3.3._\n     */\n    function functionStaticCall(\n        address target,\n        bytes memory data,\n        string memory errorMessage\n    ) internal view returns (bytes memory) {\n        require(isContract(target), \"Address: static call to non-contract\");\n\n        (bool success, bytes memory returndata) = target.staticcall(data);\n        return verifyCallResult(success, returndata, errorMessage);\n    }\n\n    /**\n     * @dev Same as {xref-Address-functionCall-address-bytes-}[`functionCall`],\n     * but performing a delegate call.\n     *\n     * _Available since v3.4._\n     */\n    function functionDelegateCall(address target, bytes memory data) internal returns (bytes memory) {\n        return functionDelegateCall(target, data, \"Address: low-level delegate call failed\");\n    }\n\n    /**\n     * @dev Same as {xref-Address-functionCall-address-bytes-string-}[`functionCall`],\n     * but performing a delegate call.\n     *\n     * _Available since v3.4._\n     */\n    function functionDelegateCall(\n        address target,\n        bytes memory data,\n        string memory errorMessage\n    ) internal returns (bytes memory) {\n        require(isContract(target), \"Address: delegate call to non-contract\");\n\n        (bool success, bytes memory returndata) = target.delegatecall(data);\n        return verifyCallResult(success, returndata, errorMessage);\n    }\n\n    /**\n     * @dev Tool to verifies that a low level call was successful, and revert if it wasn't, either by bubbling the\n     * revert reason using the provided one.\n     *\n     * _Available since v4.3._\n     */\n    function verifyCallResult(\n        bool success,\n        bytes memory returndata,\n        string memory errorMessage\n    ) internal pure returns (bytes memory) {\n        if (success) {\n            return returndata;\n        } else {\n            // Look for revert reason and bubble it up if present\n            if (returndata.length > 0) {\n                // The easiest way to bubble the revert reason is using memory via assembly\n\n                assembly {\n                    let returndata_size := mload(returndata)\n                    revert(add(32, returndata), returndata_size)\n                }\n            } else {\n                revert(errorMessage);\n            }\n        }\n    }\n}\n\n\n// File @openzeppelin/contracts/token/ERC20/utils/SafeERC20.sol@v4.5.0\n\n// OpenZeppelin Contracts v4.4.1 (token/ERC20/utils/SafeERC20.sol)\n\npragma solidity ^0.8.0;\n\n\n/**\n * @title SafeERC20\n * @dev Wrappers around ERC20 operations that throw on failure (when the token\n * contract returns false). Tokens that return no value (and instead revert or\n * throw on failure) are also supported, non-reverting calls are assumed to be\n * successful.\n * To use this library you can add a `using SafeERC20 for IERC20;` statement to your contract,\n * which allows you to call the safe operations as `token.safeTransfer(...)`, etc.\n */\nlibrary SafeERC20 {\n    using Address for address;\n\n    function safeTransfer(\n        IERC20 token,\n        address to,\n        uint256 value\n    ) internal {\n        _callOptionalReturn(token, abi.encodeWithSelector(token.transfer.selector, to, value));\n    }\n\n    function safeTransferFrom(\n        IERC20 token,\n        address from,\n        address to,\n        uint256 value\n    ) internal {\n        _callOptionalReturn(token, abi.encodeWithSelector(token.transferFrom.selector, from, to, value));\n    }\n\n    /**\n     * @dev Deprecated. This function has issues similar to the ones found in\n     * {IERC20-approve}, and its usage is discouraged.\n     *\n     * Whenever possible, use {safeIncreaseAllowance} and\n     * {safeDecreaseAllowance} instead.\n     */\n    function safeApprove(\n        IERC20 token,\n        address spender,\n        uint256 value\n    ) internal {\n        // safeApprove should only be called when setting an initial allowance,\n        // or when resetting it to zero. To increase and decrease it, use\n        // 'safeIncreaseAllowance' and 'safeDecreaseAllowance'\n        require(\n            (value == 0) || (token.allowance(address(this), spender) == 0),\n            \"SafeERC20: approve from non-zero to non-zero allowance\"\n        );\n        _callOptionalReturn(token, abi.encodeWithSelector(token.approve.selector, spender, value));\n    }\n\n    function safeIncreaseAllowance(\n        IERC20 token,\n        address spender,\n        uint256 value\n    ) internal {\n        uint256 newAllowance = token.allowance(address(this), spender) + value;\n        _callOptionalReturn(token, abi.encodeWithSelector(token.approve.selector, spender, newAllowance));\n    }\n\n    function safeDecreaseAllowance(\n        IERC20 token,\n        address spender,\n        uint256 value\n    ) internal {\n        unchecked {\n            uint256 oldAllowance = token.allowance(address(this), spender);\n            require(oldAllowance >= value, \"SafeERC20: decreased allowance below zero\");\n            uint256 newAllowance = oldAllowance - value;\n            _callOptionalReturn(token, abi.encodeWithSelector(token.approve.selector, spender, newAllowance));\n        }\n    }\n\n    /**\n     * @dev Imitates a Solidity high-level call (i.e. a regular function call to a contract), relaxing the requirement\n     * on the return value: the return value is optional (but if data is returned, it must not be false).\n     * @param token The token targeted by the call.\n     * @param data The call data (encoded using abi.encode or one of its variants).\n     */\n    function _callOptionalReturn(IERC20 token, bytes memory data) private {\n        // We need to perform a low level call here, to bypass Solidity's return data size checking mechanism, since\n        // we're implementing it ourselves. We use {Address.functionCall} to perform this call, which verifies that\n        // the target address contains contract code and also asserts for success in the low-level call.\n\n        bytes memory returndata = address(token).functionCall(data, \"SafeERC20: low-level call failed\");\n        if (returndata.length > 0) {\n            // Return data is optional\n            require(abi.decode(returndata, (bool)), \"SafeERC20: ERC20 operation did not succeed\");\n        }\n    }\n}\n\n\n// File @openzeppelin/contracts/utils/math/SafeMath.sol@v4.5.0\n\n// OpenZeppelin Contracts v4.4.1 (utils/math/SafeMath.sol)\n\npragma solidity ^0.8.0;\n\n// CAUTION\n// This version of SafeMath should only be used with Solidity 0.8 or later,\n// because it relies on the compiler's built in overflow checks.\n\n/**\n * @dev Wrappers over Solidity's arithmetic operations.\n *\n * NOTE: `SafeMath` is generally not needed starting with Solidity 0.8, since the compiler\n * now has built in overflow checking.\n */\nlibrary SafeMath {\n    /**\n     * @dev Returns the addition of two unsigned integers, with an overflow flag.\n     *\n     * _Available since v3.4._\n     */\n    function tryAdd(uint256 a, uint256 b) internal pure returns (bool, uint256) {\n        unchecked {\n            uint256 c = a + b;\n            if (c < a) return (false, 0);\n            return (true, c);\n        }\n    }\n\n    /**\n     * @dev Returns the substraction of two unsigned integers, with an overflow flag.\n     *\n     * _Available since v3.4._\n     */\n    function trySub(uint256 a, uint256 b) internal pure returns (bool, uint256) {\n        unchecked {\n            if (b > a) return (false, 0);\n            return (true, a - b);\n        }\n    }\n\n    /**\n     * @dev Returns the multiplication of two unsigned integers, with an overflow flag.\n     *\n     * _Available since v3.4._\n     */\n    function tryMul(uint256 a, uint256 b) internal pure returns (bool, uint256) {\n        unchecked {\n            // Gas optimization: this is cheaper than requiring 'a' not being zero, but the\n            // benefit is lost if 'b' is also tested.\n            // See: https://github.com/OpenZeppelin/openzeppelin-contracts/pull/522\n            if (a == 0) return (true, 0);\n            uint256 c = a * b;\n            if (c / a != b) return (false, 0);\n            return (true, c);\n        }\n    }\n\n    /**\n     * @dev Returns the division of two unsigned integers, with a division by zero flag.\n     *\n     * _Available since v3.4._\n     */\n    function tryDiv(uint256 a, uint256 b) internal pure returns (bool, uint256) {\n        unchecked {\n            if (b == 0) return (false, 0);\n            return (true, a / b);\n        }\n    }\n\n    /**\n     * @dev Returns the remainder of dividing two unsigned integers, with a division by zero flag.\n     *\n     * _Available since v3.4._\n     */\n    function tryMod(uint256 a, uint256 b) internal pure returns (bool, uint256) {\n        unchecked {\n            if (b == 0) return (false, 0);\n            return (true, a % b);\n        }\n    }\n\n    /**\n     * @dev Returns the addition of two unsigned integers, reverting on\n     * overflow.\n     *\n     * Counterpart to Solidity's `+` operator.\n     *\n     * Requirements:\n     *\n     * - Addition cannot overflow.\n     */\n    function add(uint256 a, uint256 b) internal pure returns (uint256) {\n        return a + b;\n    }\n\n    /**\n     * @dev Returns the subtraction of two unsigned integers, reverting on\n     * overflow (when the result is negative).\n     *\n     * Counterpart to Solidity's `-` operator.\n     *\n     * Requirements:\n     *\n     * - Subtraction cannot overflow.\n     */\n    function sub(uint256 a, uint256 b) internal pure returns (uint256) {\n        return a - b;\n    }\n\n    /**\n     * @dev Returns the multiplication of two unsigned integers, reverting on\n     * overflow.\n     *\n     * Counterpart to Solidity's `*` operator.\n     *\n     * Requirements:\n     *\n     * - Multiplication cannot overflow.\n     */\n    function mul(uint256 a, uint256 b) internal pure returns (uint256) {\n        return a * b;\n    }\n\n    /**\n     * @dev Returns the integer division of two unsigned integers, reverting on\n     * division by zero. The result is rounded towards zero.\n     *\n     * Counterpart to Solidity's `/` operator.\n     *\n     * Requirements:\n     *\n     * - The divisor cannot be zero.\n     */\n    function div(uint256 a, uint256 b) internal pure returns (uint256) {\n        return a / b;\n    }\n\n    /**\n     * @dev Returns the remainder of dividing two unsigned integers. (unsigned integer modulo),\n     * reverting when dividing by zero.\n     *\n     * Counterpart to Solidity's `%` operator. This function uses a `revert`\n     * opcode (which leaves remaining gas untouched) while Solidity uses an\n     * invalid opcode to revert (consuming all remaining gas).\n     *\n     * Requirements:\n     *\n     * - The divisor cannot be zero.\n     */\n    function mod(uint256 a, uint256 b) internal pure returns (uint256) {\n        return a % b;\n    }\n\n    /**\n     * @dev Returns the subtraction of two unsigned integers, reverting with custom message on\n     * overflow (when the result is negative).\n     *\n     * CAUTION: This function is deprecated because it requires allocating memory for the error\n     * message unnecessarily. For custom revert reasons use {trySub}.\n     *\n     * Counterpart to Solidity's `-` operator.\n     *\n     * Requirements:\n     *\n     * - Subtraction cannot overflow.\n     */\n    function sub(\n        uint256 a,\n        uint256 b,\n        string memory errorMessage\n    ) internal pure returns (uint256) {\n        unchecked {\n            require(b <= a, errorMessage);\n            return a - b;\n        }\n    }\n\n    /**\n     * @dev Returns the integer division of two unsigned integers, reverting with custom message on\n     * division by zero. The result is rounded towards zero.\n     *\n     * Counterpart to Solidity's `/` operator. Note: this function uses a\n     * `revert` opcode (which leaves remaining gas untouched) while Solidity\n     * uses an invalid opcode to revert (consuming all remaining gas).\n     *\n     * Requirements:\n     *\n     * - The divisor cannot be zero.\n     */\n    function div(\n        uint256 a,\n        uint256 b,\n        string memory errorMessage\n    ) internal pure returns (uint256) {\n        unchecked {\n            require(b > 0, errorMessage);\n            return a / b;\n        }\n    }\n\n    /**\n     * @dev Returns the remainder of dividing two unsigned integers. (unsigned integer modulo),\n     * reverting with custom message when dividing by zero.\n     *\n     * CAUTION: This function is deprecated because it requires allocating memory for the error\n     * message unnecessarily. For custom revert reasons use {tryMod}.\n     *\n     * Counterpart to Solidity's `%` operator. This function uses a `revert`\n     * opcode (which leaves remaining gas untouched) while Solidity uses an\n     * invalid opcode to revert (consuming all remaining gas).\n     *\n     * Requirements:\n     *\n     * - The divisor cannot be zero.\n     */\n    function mod(\n        uint256 a,\n        uint256 b,\n        string memory errorMessage\n    ) internal pure returns (uint256) {\n        unchecked {\n            require(b > 0, errorMessage);\n            return a % b;\n        }\n    }\n}\n\n\n// File contracts/stake/interfaces/IMSpace.sol\n\n\npragma solidity ^0.8.0;\n\n// need for import in MiningHill. \n// to pass error: Task flatten and then build will discover multiple MSpaceToken \n// => cause error `cannot find artifact \"MSpaceToken\"`\ninterface IMSpace is IERC20 {\n  function setTeamWallet(address teamWallet) external;\n  function setAirdropWallet(address airdropWallet) external;\n  function airdrop1() external;\n  function airdrop2() external;\n  function teamVesting() external;\n  function mint(address to, uint256 amount) external;\n}\n\n\n// File @openzeppelin/contracts-upgradeable/utils/AddressUpgradeable.sol@v4.5.1\n\n// OpenZeppelin Contracts (last updated v4.5.0) (utils/Address.sol)\n\npragma solidity ^0.8.1;\n\n/**\n * @dev Collection of functions related to the address type\n */\nlibrary AddressUpgradeable {\n    /**\n     * @dev Returns true if `account` is a contract.\n     *\n     * [IMPORTANT]\n     * ====\n     * It is unsafe to assume that an address for which this function returns\n     * false is an externally-owned account (EOA) and not a contract.\n     *\n     * Among others, `isContract` will return false for the following\n     * types of addresses:\n     *\n     *  - an externally-owned account\n     *  - a contract in construction\n     *  - an address where a contract will be created\n     *  - an address where a contract lived, but was destroyed\n     * ====\n     *\n     * [IMPORTANT]\n     * ====\n     * You shouldn't rely on `isContract` to protect against flash loan attacks!\n     *\n     * Preventing calls from contracts is highly discouraged. It breaks composability, breaks support for smart wallets\n     * like Gnosis Safe, and does not provide security since it can be circumvented by calling from a contract\n     * constructor.\n     * ====\n     */\n    function isContract(address account) internal view returns (bool) {\n        // This method relies on extcodesize/address.code.length, which returns 0\n        // for contracts in construction, since the code is only stored at the end\n        // of the constructor execution.\n\n        return account.code.length > 0;\n    }\n\n    /**\n     * @dev Replacement for Solidity's `transfer`: sends `amount` wei to\n     * `recipient`, forwarding all available gas and reverting on errors.\n     *\n     * https://eips.ethereum.org/EIPS/eip-1884[EIP1884] increases the gas cost\n     * of certain opcodes, possibly making contracts go over the 2300 gas limit\n     * imposed by `transfer`, making them unable to receive funds via\n     * `transfer`. {sendValue} removes this limitation.\n     *\n     * https://diligence.consensys.net/posts/2019/09/stop-using-soliditys-transfer-now/[Learn more].\n     *\n     * IMPORTANT: because control is transferred to `recipient`, care must be\n     * taken to not create reentrancy vulnerabilities. Consider using\n     * {ReentrancyGuard} or the\n     * https://solidity.readthedocs.io/en/v0.5.11/security-considerations.html#use-the-checks-effects-interactions-pattern[checks-effects-interactions pattern].\n     */\n    function sendValue(address payable recipient, uint256 amount) internal {\n        require(address(this).balance >= amount, \"Address: insufficient balance\");\n\n        (bool success, ) = recipient.call{value: amount}(\"\");\n        require(success, \"Address: unable to send value, recipient may have reverted\");\n    }\n\n    /**\n     * @dev Performs a Solidity function call using a low level `call`. A\n     * plain `call` is an unsafe replacement for a function call: use this\n     * function instead.\n     *\n     * If `target` reverts with a revert reason, it is bubbled up by this\n     * function (like regular Solidity function calls).\n     *\n     * Returns the raw returned data. To convert to the expected return value,\n     * use https://solidity.readthedocs.io/en/latest/units-and-global-variables.html?highlight=abi.decode#abi-encoding-and-decoding-functions[`abi.decode`].\n     *\n     * Requirements:\n     *\n     * - `target` must be a contract.\n     * - calling `target` with `data` must not revert.\n     *\n     * _Available since v3.1._\n     */\n    function functionCall(address target, bytes memory data) internal returns (bytes memory) {\n        return functionCall(target, data, \"Address: low-level call failed\");\n    }\n\n    /**\n     * @dev Same as {xref-Address-functionCall-address-bytes-}[`functionCall`], but with\n     * `errorMessage` as a fallback revert reason when `target` reverts.\n     *\n     * _Available since v3.1._\n     */\n    function functionCall(\n        address target,\n        bytes memory data,\n        string memory errorMessage\n    ) internal returns (bytes memory) {\n        return functionCallWithValue(target, data, 0, errorMessage);\n    }\n\n    /**\n     * @dev Same as {xref-Address-functionCall-address-bytes-}[`functionCall`],\n     * but also transferring `value` wei to `target`.\n     *\n     * Requirements:\n     *\n     * - the calling contract must have an ETH balance of at least `value`.\n     * - the called Solidity function must be `payable`.\n     *\n     * _Available since v3.1._\n     */\n    function functionCallWithValue(\n        address target,\n        bytes memory data,\n        uint256 value\n    ) internal returns (bytes memory) {\n        return functionCallWithValue(target, data, value, \"Address: low-level call with value failed\");\n    }\n\n    /**\n     * @dev Same as {xref-Address-functionCallWithValue-address-bytes-uint256-}[`functionCallWithValue`], but\n     * with `errorMessage` as a fallback revert reason when `target` reverts.\n     *\n     * _Available since v3.1._\n     */\n    function functionCallWithValue(\n        address target,\n        bytes memory data,\n        uint256 value,\n        string memory errorMessage\n    ) internal returns (bytes memory) {\n        require(address(this).balance >= value, \"Address: insufficient balance for call\");\n        require(isContract(target), \"Address: call to non-contract\");\n\n        (bool success, bytes memory returndata) = target.call{value: value}(data);\n        return verifyCallResult(success, returndata, errorMessage);\n    }\n\n    /**\n     * @dev Same as {xref-Address-functionCall-address-bytes-}[`functionCall`],\n     * but performing a static call.\n     *\n     * _Available since v3.3._\n     */\n    function functionStaticCall(address target, bytes memory data) internal view returns (bytes memory) {\n        return functionStaticCall(target, data, \"Address: low-level static call failed\");\n    }\n\n    /**\n     * @dev Same as {xref-Address-functionCall-address-bytes-string-}[`functionCall`],\n     * but performing a static call.\n     *\n     * _Available since v3.3._\n     */\n    function functionStaticCall(\n        address target,\n        bytes memory data,\n        string memory errorMessage\n    ) internal view returns (bytes memory) {\n        require(isContract(target), \"Address: static call to non-contract\");\n\n        (bool success, bytes memory returndata) = target.staticcall(data);\n        return verifyCallResult(success, returndata, errorMessage);\n    }\n\n    /**\n     * @dev Tool to verifies that a low level call was successful, and revert if it wasn't, either by bubbling the\n     * revert reason using the provided one.\n     *\n     * _Available since v4.3._\n     */\n    function verifyCallResult(\n        bool success,\n        bytes memory returndata,\n        string memory errorMessage\n    ) internal pure returns (bytes memory) {\n        if (success) {\n            return returndata;\n        } else {\n            // Look for revert reason and bubble it up if present\n            if (returndata.length > 0) {\n                // The easiest way to bubble the revert reason is using memory via assembly\n\n                assembly {\n                    let returndata_size := mload(returndata)\n                    revert(add(32, returndata), returndata_size)\n                }\n            } else {\n                revert(errorMessage);\n            }\n        }\n    }\n}\n\n\n// File @openzeppelin/contracts-upgradeable/proxy/utils/Initializable.sol@v4.5.1\n\n// OpenZeppelin Contracts (last updated v4.5.0) (proxy/utils/Initializable.sol)\n\npragma solidity ^0.8.0;\n\n/**\n * @dev This is a base contract to aid in writing upgradeable contracts, or any kind of contract that will be deployed\n * behind a proxy. Since proxied contracts do not make use of a constructor, it's common to move constructor logic to an\n * external initializer function, usually called `initialize`. It then becomes necessary to protect this initializer\n * function so it can only be called once. The {initializer} modifier provided by this contract will have this effect.\n *\n * TIP: To avoid leaving the proxy in an uninitialized state, the initializer function should be called as early as\n * possible by providing the encoded function call as the `_data` argument to {ERC1967Proxy-constructor}.\n *\n * CAUTION: When used with inheritance, manual care must be taken to not invoke a parent initializer twice, or to ensure\n * that all initializers are idempotent. This is not verified automatically as constructors are by Solidity.\n *\n * [CAUTION]\n * ====\n * Avoid leaving a contract uninitialized.\n *\n * An uninitialized contract can be taken over by an attacker. This applies to both a proxy and its implementation\n * contract, which may impact the proxy. To initialize the implementation contract, you can either invoke the\n * initializer manually, or you can include a constructor to automatically mark it as initialized when it is deployed:\n *\n * [.hljs-theme-light.nopadding]\n * ```\n * /// @custom:oz-upgrades-unsafe-allow constructor\n * constructor() initializer {}\n * ```\n * ====\n */\nabstract contract Initializable {\n    /**\n     * @dev Indicates that the contract has been initialized.\n     */\n    bool private _initialized;\n\n    /**\n     * @dev Indicates that the contract is in the process of being initialized.\n     */\n    bool private _initializing;\n\n    /**\n     * @dev Modifier to protect an initializer function from being invoked twice.\n     */\n    modifier initializer() {\n        // If the contract is initializing we ignore whether _initialized is set in order to support multiple\n        // inheritance patterns, but we only do this in the context of a constructor, because in other contexts the\n        // contract may have been reentered.\n        require(_initializing ? _isConstructor() : !_initialized, \"Initializable: contract is already initialized\");\n\n        bool isTopLevelCall = !_initializing;\n        if (isTopLevelCall) {\n            _initializing = true;\n            _initialized = true;\n        }\n\n        _;\n\n        if (isTopLevelCall) {\n            _initializing = false;\n        }\n    }\n\n    /**\n     * @dev Modifier to protect an initialization function so that it can only be invoked by functions with the\n     * {initializer} modifier, directly or indirectly.\n     */\n    modifier onlyInitializing() {\n        require(_initializing, \"Initializable: contract is not initializing\");\n        _;\n    }\n\n    function _isConstructor() private view returns (bool) {\n        return !AddressUpgradeable.isContract(address(this));\n    }\n}\n\n\n// File @openzeppelin/contracts-upgradeable/utils/ContextUpgradeable.sol@v4.5.1\n\n// OpenZeppelin Contracts v4.4.1 (utils/Context.sol)\n\npragma solidity ^0.8.0;\n\n/**\n * @dev Provides information about the current execution context, including the\n * sender of the transaction and its data. While these are generally available\n * via msg.sender and msg.data, they should not be accessed in such a direct\n * manner, since when dealing with meta-transactions the account sending and\n * paying for execution may not be the actual sender (as far as an application\n * is concerned).\n *\n * This contract is only required for intermediate, library-like contracts.\n */\nabstract contract ContextUpgradeable is Initializable {\n    function __Context_init() internal onlyInitializing {\n    }\n\n    function __Context_init_unchained() internal onlyInitializing {\n    }\n    function _msgSender() internal view virtual returns (address) {\n        return msg.sender;\n    }\n\n    function _msgData() internal view virtual returns (bytes calldata) {\n        return msg.data;\n    }\n\n    /**\n     * @dev This empty reserved space is put in place to allow future versions to add new\n     * variables without shifting down storage in the inheritance chain.\n     * See https://docs.openzeppelin.com/contracts/4.x/upgradeable#storage_gaps\n     */\n    uint256[50] private __gap;\n}\n\n\n// File @openzeppelin/contracts-upgradeable/access/OwnableUpgradeable.sol@v4.5.1\n\n// OpenZeppelin Contracts v4.4.1 (access/Ownable.sol)\n\npragma solidity ^0.8.0;\n\n\n/**\n * @dev Contract module which provides a basic access control mechanism, where\n * there is an account (an owner) that can be granted exclusive access to\n * specific functions.\n *\n * By default, the owner account will be the one that deploys the contract. This\n * can later be changed with {transferOwnership}.\n *\n * This module is used through inheritance. It will make available the modifier\n * `onlyOwner`, which can be applied to your functions to restrict their use to\n * the owner.\n */\nabstract contract OwnableUpgradeable is Initializable, ContextUpgradeable {\n    address private _owner;\n\n    event OwnershipTransferred(address indexed previousOwner, address indexed newOwner);\n\n    /**\n     * @dev Initializes the contract setting the deployer as the initial owner.\n     */\n    function __Ownable_init() internal onlyInitializing {\n        __Ownable_init_unchained();\n    }\n\n    function __Ownable_init_unchained() internal onlyInitializing {\n        _transferOwnership(_msgSender());\n    }\n\n    /**\n     * @dev Returns the address of the current owner.\n     */\n    function owner() public view virtual returns (address) {\n        return _owner;\n    }\n\n    /**\n     * @dev Throws if called by any account other than the owner.\n     */\n    modifier onlyOwner() {\n        require(owner() == _msgSender(), \"Ownable: caller is not the owner\");\n        _;\n    }\n\n    /**\n     * @dev Leaves the contract without owner. It will not be possible to call\n     * `onlyOwner` functions anymore. Can only be called by the current owner.\n     *\n     * NOTE: Renouncing ownership will leave the contract without an owner,\n     * thereby removing any functionality that is only available to the owner.\n     */\n    function renounceOwnership() public virtual onlyOwner {\n        _transferOwnership(address(0));\n    }\n\n    /**\n     * @dev Transfers ownership of the contract to a new account (`newOwner`).\n     * Can only be called by the current owner.\n     */\n    function transferOwnership(address newOwner) public virtual onlyOwner {\n        require(newOwner != address(0), \"Ownable: new owner is the zero address\");\n        _transferOwnership(newOwner);\n    }\n\n    /**\n     * @dev Transfers ownership of the contract to a new account (`newOwner`).\n     * Internal function without access restriction.\n     */\n    function _transferOwnership(address newOwner) internal virtual {\n        address oldOwner = _owner;\n        _owner = newOwner;\n        emit OwnershipTransferred(oldOwner, newOwner);\n    }\n\n    /**\n     * @dev This empty reserved space is put in place to allow future versions to add new\n     * variables without shifting down storage in the inheritance chain.\n     * See https://docs.openzeppelin.com/contracts/4.x/upgradeable#storage_gaps\n     */\n    uint256[49] private __gap;\n}\n\n\n// File contracts/stake/EternalStorage.sol\n\n\n// for future upgrade purposes\n// code adopted from https://github.com/poanetwork/tokenbridge-contracts/blob/908a481079/contracts/upgradeability/EternalStorage.sol\n\npragma solidity ^0.8.0;\n\ncontract EternalStorage {\n  mapping(bytes32 => address) internal addressStorage;\n  mapping(bytes32 => uint256) internal uintStorage;\n  mapping(bytes32 => string) internal stringStorage;\n  mapping(bytes32 => bool) internal boolStorage;\n  mapping(bytes32 => bytes) internal bytesStorage;\n  mapping(bytes32 => int256) internal intStorage;\n\n  function setAddress(string memory _key, address _value) internal {\n    addressStorage[keccak256(abi.encodePacked(_key))] = _value;\n  }\n  function getAddress(string memory _key) public view returns(address) {\n    return addressStorage[keccak256(abi.encodePacked(_key))];\n  }\n\n  function setUint(string memory _key, uint256 _value) internal {\n    uintStorage[keccak256(abi.encodePacked(_key))] = _value;\n  }\n  function getUint(string memory _key) public view returns(uint256) {\n    return uintStorage[keccak256(abi.encodePacked(_key))];\n  }\n\n  function setString(string memory _key, string memory _value) internal {\n    stringStorage[keccak256(abi.encodePacked(_key))] = _value;\n  }\n  function getString(string memory _key) public view returns(string memory) {\n    return stringStorage[keccak256(abi.encodePacked(_key))];\n  }\n\n  function setBool(string memory _key, bool _value) internal {\n    boolStorage[keccak256(abi.encodePacked(_key))] = _value;\n  }\n  function getbool(string memory _key) public view returns(bool) {\n    return boolStorage[keccak256(abi.encodePacked(_key))];\n  }\n\n  function setBytes(string memory _key, bytes memory _value) internal {\n    bytesStorage[keccak256(abi.encodePacked(_key))] = _value;\n  }\n  function getBytes(string memory _key) public view returns(bytes memory) {\n    return bytesStorage[keccak256(abi.encodePacked(_key))];\n  }\n\n  function setInt(string memory _key, int256 _value) internal {\n    intStorage[keccak256(abi.encodePacked(_key))] = _value;\n  }\n  function getInt(string memory _key) public view returns(int256) {\n    return intStorage[keccak256(abi.encodePacked(_key))];\n  }\n  \n}\n\n\n// File contracts/stake/MSpaceMintPlan.sol\n\n\npragma solidity ^0.8.0;\n\n\n\ncontract MSpaceMintPlan is EternalStorage, OwnableUpgradeable {\n  using SafeMath for uint256;\n\n  // reward strategy, each point is reward per block of a month\n  uint256[] public rewardStrategy;\n  event UpdateConfig();\n\n  function initPlan(\n    uint256 startReward,\n    uint256 blockStep\n  ) internal {\n    require(startReward >= block.number && blockStep > 0, \"MintPlan: init error\");\n    __Ownable_init();\n    \n    // Block number when start reward\n    setUint(\"startReward\", startReward);\n    // Block range for each formula apply\n    setUint(\"blockStep\", blockStep);\n  }\n\n  function setStrategy(uint256[] calldata points) public onlyOwner {\n    uint256 length = points.length;\n    for (uint256 i = 0; i < length; ++i) {\n      rewardStrategy.push(points[i]);\n    }\n    emit UpdateConfig();\n  }\n\n  function setStrategyPoint(uint256 index, uint256 point) public onlyOwner {\n    require(index < rewardStrategy.length, \"MintPlan: point index invalid\");\n    rewardStrategy[index] = point;\n    emit UpdateConfig();\n  }\n\n  function setBlockStep(uint256 blockStep) public onlyOwner {\n    setUint(\"blockStep\", blockStep);\n    emit UpdateConfig();\n  }\n\n  function strategyLength() external view returns (uint256) {\n    return rewardStrategy.length;\n  }\n\n  function mspacePerBlock() external view returns (uint256) {\n    uint256 startReward = getUint(\"startReward\");\n    if (block.number < startReward) {\n      return 0;\n    }\n    uint256 blockStep = getUint(\"blockStep\");\n    uint256 pos = block.number.sub(startReward).div(blockStep);\n    if (pos >= rewardStrategy.length) {\n      return 0;\n    }\n    return rewardStrategy[pos];\n  }\n\n  function calcReward(uint256 from, uint256 to) public view returns(uint256) {\n    require(to >= from, \"MintPlan: calc reward input error\");\n    uint256 startReward = getUint(\"startReward\");\n    from = from < startReward ? 0:from.sub(startReward);\n    to = to < startReward ? 0:to.sub(startReward);\n\n    uint256 blockStep = getUint(\"blockStep\");\n    uint256 start = from.div(blockStep);\n    uint256 end = to.div(blockStep);\n    if (end >= rewardStrategy.length) {\n      end = rewardStrategy.length;\n    }\n    uint256 reward = 0;\n    if (start >= rewardStrategy.length) {\n      return reward;\n    }\n    for (uint256 i = start; i < end; ++i) {\n      // .    .    .\n      //   [|  ]\n      reward = reward.add(\n        i.add(1).mul(blockStep).sub(from).mul(rewardStrategy[i])\n      );\n      // .   .   .\n      //     |    \n      from = i.add(1).mul(blockStep);\n    }\n    //   .   . | .  \n    //      [  |]\n    if (end >= 0 && end < rewardStrategy.length) {\n      reward = reward.add(\n        to.sub(end.mul(blockStep)).mul(rewardStrategy[end])\n      );\n    }\n    return reward;\n  }\n}\n\n\n// File contracts/stake/MiningHill.sol\n\n\npragma solidity ^0.8.0;\n\n\n\n\n\ninterface IMigrator {\n  function migrate(IERC20 token) external returns (IERC20);\n}\n\ncontract MiningHill is MSpaceMintPlan {\n  // version 0.2.0\n  using SafeMath for uint256;\n  using SafeERC20 for IERC20;\n  // Info of each user.\n  struct UserInfo {\n    uint256 amount; // How many LP tokens the user has provided.\n    uint256 lastUpdate;\n    uint256 poolShare;\n  }\n  // Info of each pool.\n  struct PoolInfo {\n    IERC20 lpToken; // Address of LP token contract.\n    uint256 allocPoint; // How many allocation points assigned to the pool.\n    uint256 lastUpdate; // Last block number that MSPs distribution occurs.\n    uint256 totalShare; // total share of each users when last update\n    uint256 rewardDebt;\n  }\n  // The MSP TOKEN!\n  IMSpace public mspace;\n  // The migrator contract. It has a lot of power. Can only be set through governance (owner).\n  IMigrator public migrator;\n  // Info of each pool.\n  PoolInfo[] public poolInfo;\n  mapping(address => bool) public poolIsExist;\n  // Info of each user that stakes LP tokens.\n  mapping(uint256 => mapping(address => UserInfo)) public userInfo;\n  // Total allocation poitns. Must be the sum of all allocation points in all pools.\n  uint256 public totalAllocPoint = 0;\n\n  event Deposit(address indexed user, uint256 indexed pid, uint256 amount);\n  event Withdraw(address indexed user, uint256 indexed pid, uint256 amount);\n  event EmergencyWithdraw(address indexed user, uint256 indexed pid, uint256 amount);\n  event AddPool(uint256 allocPoint, IERC20 lpToken, bool withUpdate);\n  event SetPoolAllocPoint(uint256 pid, uint256 allocPoint, bool withUpdate);\n  event SetMigrator(IMigrator poolMigrator);\n  event Migrate(uint256 pid);\n  event MassUpdatePools();\n  event UpdatePool(uint256 pid);\n  event UpdateUser(uint256 pid, uint256 userAddress);\n  event Harvest(address indexed user, uint256 indexed pid, uint256 amount);\n\n  function init(\n    address operationWallet,\n    IMSpace mspaceToken,\n    uint256 startReward, \n    uint256 blockStep\n  ) public initializer {\n    require(\n      operationWallet != address(0) \n        && address(mspaceToken) != address(0)\n    , \"Mining: init error\");\n    super.initPlan(startReward, blockStep);\n    setAddress(\"operationWallet\", operationWallet);\n    mspace = mspaceToken;\n  }\n\n  function poolLength() external view returns (uint256) {\n    return poolInfo.length;\n  }\n\n  // Add a new lp to the pool. Can only be called by the owner.\n  // XXX DO NOT add the same LP token more than once. Rewards will be messed up if you do.\n  function add(uint256 allocPoint, IERC20 lpToken, bool withUpdate) public onlyOwner {\n    require(poolIsExist[address(lpToken)] == false, \"Mining: pool existed\");\n    if (withUpdate) {\n      massUpdatePools();\n    }\n    totalAllocPoint = totalAllocPoint.add(allocPoint);\n    PoolInfo memory pool = PoolInfo({\n      lpToken: lpToken, \n      allocPoint: allocPoint, \n      lastUpdate: block.number, \n      totalShare: 0, \n      rewardDebt: 0\n    });\n    poolIsExist[address(lpToken)] = true;\n    poolInfo.push(pool);\n    emit AddPool(allocPoint, lpToken, withUpdate);\n  }\n\n  // Update the given pool's MSP allocation point. Can only be called by the owner.\n  function set(uint256 pid, uint256 allocPoint, bool withUpdate) public onlyOwner {\n    if (withUpdate) {\n      massUpdatePools();\n    } else {\n      updatePool(pid);\n    }\n    totalAllocPoint = totalAllocPoint.sub(poolInfo[pid].allocPoint).add(allocPoint);\n    poolInfo[pid].allocPoint = allocPoint;\n    emit SetPoolAllocPoint(pid, allocPoint, withUpdate);\n  }\n\n  // Set the migrator contract. Can only be called by the owner.\n  function setMigrator(IMigrator poolMigrator) public onlyOwner {\n    migrator = poolMigrator;\n    emit SetMigrator(poolMigrator);\n  }\n\n  // Migrate lp token to another lp contract. Can be called by anyone. We trust that migrator contract is good.\n  function migrate(uint256 pid) public {\n    require(address(migrator) != address(0), \"migrate: no migrator\");\n    PoolInfo storage pool = poolInfo[pid];\n    IERC20 lpToken = pool.lpToken;\n    uint256 bal = lpToken.balanceOf(address(this));\n    lpToken.safeApprove(address(migrator), bal);\n    IERC20 newLpToken = migrator.migrate(lpToken);\n    require(bal == newLpToken.balanceOf(address(this)), \"migrate: bad\");\n    pool.lpToken = newLpToken;\n    emit Migrate(pid);\n  }\n\n  function rewardDebt(uint256 pid) public view returns (uint256) {\n    require(pid < poolInfo.length, \"Mining: pool invalid\");\n    PoolInfo memory pool = poolInfo[pid];\n    uint256 reward = calcReward(pool.lastUpdate, block.number);\n    uint256 mspaceReward = totalAllocPoint==0 ? 0:reward.mul(pool.allocPoint).div(totalAllocPoint);\n    return pool.rewardDebt.add(mspaceReward.mul(90).div(100));\n  }\n\n  function pendingMSpace(uint256 pid, address userAddress) external view returns (uint256) {\n    require(pid < poolInfo.length, \"Mining: pool invalid\");\n    uint256 startReward = getUint(\"startReward\");\n    PoolInfo memory pool = poolInfo[pid];\n    UserInfo memory user = userInfo[pid][userAddress];\n    uint256 lpSupply = pool.lpToken.balanceOf(address(this));\n    if (block.number < startReward) {\n      return 0;\n    }\n    uint256 totalShare = pool.totalShare\n      .add(block.number.sub(pool.lastUpdate > startReward ? pool.lastUpdate:startReward).mul(lpSupply));\n    uint256 userShare = user.poolShare\n      .add(block.number.sub(user.lastUpdate > startReward ? user.lastUpdate:startReward).mul(user.amount));\n\n    return totalShare==0 ? 0:rewardDebt(pid).mul(userShare).div(totalShare);\n  }\n\n  // Update reward vairables for all pools. Be careful of gas spending!\n  function massUpdatePools() public {\n    uint256 length = poolInfo.length;\n    for (uint256 pid = 0; pid < length; ++pid) {\n      updatePool(pid);\n    }\n    emit MassUpdatePools();\n  }\n\n  // Update reward variables of the given pool to be up-to-date.\n  function updatePool(uint256 pid) public {\n    require(pid < poolInfo.length, \"Mining: not valid pool\");\n    PoolInfo storage pool = poolInfo[pid];\n    uint256 lpSupply = pool.lpToken.balanceOf(address(this));\n    uint256 reward = calcReward(pool.lastUpdate, block.number);\n    uint256 mspaceReward = totalAllocPoint==0 ? 0:reward.mul(pool.allocPoint).div(totalAllocPoint);\n    if (mspaceReward > 0) {\n      mspace.mint(address(this), mspaceReward.mul(90).div(100));\n      mspace.mint(getAddress(\"operationWallet\"), mspaceReward.div(10));\n      pool.rewardDebt = pool.rewardDebt.add(mspaceReward.mul(90).div(100));\n    }\n    uint256 startReward = getUint(\"startReward\");\n    if (block.number > startReward) {\n      pool.totalShare = pool.totalShare.add(\n        block.number.sub(pool.lastUpdate > startReward ? pool.lastUpdate:startReward).mul(lpSupply)\n      );\n    }\n    pool.lastUpdate = block.number;\n    emit UpdatePool(pid);\n  }\n\n  function updateUser(uint256 pid, address userAddress) internal {\n    UserInfo storage user = userInfo[pid][userAddress];\n    uint256 startReward = getUint(\"startReward\");\n    if (block.number > startReward) {\n      user.poolShare = user.poolShare\n        .add(block.number.sub(user.lastUpdate > startReward ? user.lastUpdate:startReward).mul(user.amount));\n    }\n    user.lastUpdate = block.number;\n  }\n\n  // Deposit LP tokens to Mining for MSP allocation.\n  function deposit(uint256 pid, uint256 amount) public {\n    require(amount > 0, \"Mining: not valid amount\");\n    updatePool(pid);\n    updateUser(pid, msg.sender);\n    PoolInfo storage pool = poolInfo[pid];\n    UserInfo storage user = userInfo[pid][msg.sender];\n    pool.lpToken.safeTransferFrom(msg.sender, address(this), amount);\n    user.amount = user.amount.add(amount);\n    emit Deposit(msg.sender, pid, amount);\n  }\n\n  function harvest(uint256 pid) public {\n    updatePool(pid);\n    updateUser(pid, msg.sender);\n    PoolInfo storage pool = poolInfo[pid];\n    UserInfo storage user = userInfo[pid][msg.sender];\n    uint256 pending = pool.totalShare == 0 ? 0:pool.rewardDebt.mul(user.poolShare).div(pool.totalShare);\n    if (pending > 0) {\n      // correct rounding error\n      if (pending > pool.rewardDebt) {\n        pending = pool.rewardDebt;\n      }\n      safeMSpaceTransfer(msg.sender, pending);\n      pool.totalShare = pool.totalShare.sub(user.poolShare);\n      pool.rewardDebt = pool.rewardDebt.sub(pending);\n      user.poolShare = 0;\n    }\n    emit Harvest(msg.sender, pid, pending);\n  }\n\n  // Withdraw LP tokens from Mining.\n  function withdraw(uint256 pid, uint256 amount) public {\n    updatePool(pid);\n    updateUser(pid, msg.sender);\n    PoolInfo storage pool = poolInfo[pid];\n    UserInfo storage user = userInfo[pid][msg.sender];\n    require(user.amount >= amount, \"Mining: not enough\");\n    user.amount = user.amount.sub(amount);\n    pool.lpToken.safeTransfer(msg.sender, amount);\n    emit Withdraw(msg.sender, pid, amount);\n  }\n\n  // Withdraw without caring about rewards. EMERGENCY ONLY.\n  function emergencyWithdraw(uint256 pid) public {\n    updatePool(pid);\n    updateUser(pid, msg.sender);\n    PoolInfo storage pool = poolInfo[pid];\n    UserInfo storage user = userInfo[pid][msg.sender];\n    uint256 amount = user.amount;\n    user.amount = 0;\n    pool.lpToken.safeTransfer(msg.sender, amount);\n    emit EmergencyWithdraw(msg.sender, pid, amount);\n  }\n\n  // Safe MSP transfer function, just in case if rounding error causes pool to not have enough MSPs.\n  function safeMSpaceTransfer(address to, uint256 amount) internal {\n    uint256 mspaceBal = mspace.balanceOf(address(this));\n    if (amount > mspaceBal) {\n      mspace.transfer(to, mspaceBal);\n    } else {\n      mspace.transfer(to, amount);\n    }\n  }\n\n  function setTeamWallet(address teamWallet) public onlyOwner {\n    mspace.setTeamWallet(teamWallet);\n  }\n  function setAirdropWallet(address airdropWallet) public onlyOwner {\n    mspace.setAirdropWallet(airdropWallet);\n  }\n  function airdrop1() public onlyOwner {\n    mspace.airdrop1();\n  }\n  function airdrop2() public onlyOwner {\n    mspace.airdrop2();\n  }\n  function teamVesting() public onlyOwner {\n    mspace.teamVesting();\n  }\n}"
    }
  },
  "settings": {
    "optimizer": {
      "enabled": true,
      "runs": 200
    },
    "outputSelection": {
      "*": {
        "*": [
          "abi",
          "evm.bytecode",
          "evm.deployedBytecode",
          "evm.methodIdentifiers",
          "metadata",
          "devdoc",
          "userdoc",
          "storageLayout",
          "evm.gasEstimates"
        ],
        "": [
          "ast"
        ]
      }
    },
    "metadata": {
      "useLiteralContent": true
    }
  }
}