<svg width="32" height="32" viewBox="0 0 32 32" xmlns="http://www.w3.org/2000/svg">
    <defs>
        <filter color-interpolation-filters="auto" id="a">
            <feColorMatrix in="SourceGraphic" values="0 0 0 0 0.654902 0 0 0 0 0.031373 0 0 0 0 0.870588 0 0 0 1.000000 0"/>
        </filter>
    </defs>
    <g transform="translate(-24 -248)" filter="url(#a)" fill="none" fill-rule="evenodd">
        <path d="M24 248h32v32H24z"/>
        <path stroke="#FFF" stroke-width="2.6" stroke-linecap="round" stroke-linejoin="round" d="m43 271-7-7 7-7"/>
    </g>
</svg>
