{
    "antifeatures": {
        "Ads": "Tämä sovellus sisältää mainoksia",
        "DisabledAlgorithm": "Tällä sovelluksella on heikko turvallisuusallekirjoitus",
        "KnownVuln": "Tämä sovellus sisältää tunnetun turvallisuushaavoittovuuden",
        "NoSourceSince": "Lähdekoodi ei ole enää saatavilla, päivitykset eivät ole mahdollista",
        "NonFreeAdd": "Tämä sovellus suosittelee ei-vapaita lisäosia",
        "NonFreeAssets": "Tämä sovellus sisältää ei-vapaita osia",
        "NonFreeDep": "Tämä sovellus on riippuvainen muista, ei-vapaista sovelluksista",
        "NonFreeNet": "Tämä sovellus tukee ei-vapaita verkkopalveluja",
        "Tracking": "Tämä sovellus seuraa ja raportoi toimintaasi",
        "UpstreamNonFree": "Yläjuoksun lähdekoodi ei ole kokonaan vapaata"
    },
    "app_categories": {
        "Connectivity": "Yhteydet",
        "Development": "Kehittäminen",
        "Games": "Pelit",
        "Graphics": "Grafiikka",
        "Internet": "Internet",
        "Money": "Raha",
        "Multimedia": "Multimedia",
        "Navigation": "Navigointi",
        "Phone & SMS": "Puhelin & tekstiviestit",
        "Reading": "Lukeminen",
        "Science & Education": "Tiede & koulutus",
        "Security": "Tietoturva",
        "Sports & Health": "Urheilu & terveys",
        "System": "Järjestelmä",
        "Theming": "Teemat",
        "Time": "Aika",
        "Writing": "Kirjoittaminen",
        "show_all_packages": "Näytä kaikki %d"
    },
    "index": {
        "download_fdroid": "Lataa F-Droid",
        "gpg_signature": "PGP-allekirjoitus",
        "introduction": "F-Droid on asennettava luettelo FOSS (Free and Open Source Software) -sovelluksista Android-alustalle. Tämän sovelluksen avulla on helppo selata, asentaa ja seurata laitteen päivityksiä.",
        "screenshot": "F-Droidin Android-sovelluksen kuvakaappaus",
        "title": "Mikä on F-Droid?"
    },
    "navigation": {
        "about": "Tietoja",
        "apps": "Sovellukset",
        "contribute": "Osallistu",
        "documentation": "Dokumentit",
        "forum": "Foorumi",
        "issues": "Ongelmat",
        "news": "Uutiset",
        "translate_on_weblate": "Käännä Weblatessa"
    },
    "package": {
        "added_on": "Lisätty {{ package_added_date }}",
        "anti_features": "Anti-ominaisuudet",
        "anti_features_warning": "Tässä sovelluksessa on ominaisuuksia, joista et ehkä pidä.",
        "author": "Tekijä",
        "build_metadata": "Metatiedot",
        "changelog": "Muutosloki",
        "donate": "Lahjoita",
        "download": "Lataa {{ file_extension }}",
        "flattr": "Flattr",
        "gpg_signature": "PGP-allekirjoitus",
        "issue_tracker": "Ongelmien seuranta",
        "liberapay": "Liberapay",
        "license": "Lisenssi",
        "minimum_android_version": "Tämä versio vaatii Android {{ android_version }}:n tai uudemman.",
        "new_in_version": "Uutta versiossa {{ latest_version }}",
        "opencollective": "Avoin kollektiivi",
        "package_screenshot_alt": "ruutukaappaus sovelluksesta",
        "packages": "Pakkaukset",
        "permissions": "Käyttöoikeudet",
        "signed_by_developer": "Se on alkuperäisen kehittäjän rakentama ja allekirjoittama.",
        "signed_by_fdroid": "Se on F-Droidin rakentama ja allekirjoittama, ja se on taattu vastaamaan <a href=\"{{ source_code_url }}\">tätä lähdetarjontaa</a>.",
        "source_code": "Lähdekoodi",
        "suggest_downloading_via_fdroid": "Vaikka APK-lataukset ovat saatavilla alla oman valintasi mukaan, sinun tulee tietää, että tätä kautta asentamalla et saa päivityspyyntöjä ja se on vähemmän turvallinen tapa ladata. Suosittelemme asentamaan F-Droid-sovelluksen ja käyttämään sitä.",
        "suggested": "ehdotti",
        "technical_info": "Tekniset tiedot",
        "translation": "Käännös",
        "version_info": "<b>Versio {{ package_version }}</b> ({{ package_version_code }})",
        "website": "Sivusto"
    },
    "permissions": {
        "permdesc_acceptHandovers": "Antaa sovelluksen jatkaa puhelua, joka aloitettiin toisessa sovelluksessa.",
        "permdesc_accessBackgroundLocation": "Jos tämä myönnetään karkean tai tarkan sijainnin käyttöoikeuden lisäksi, sovellus voi käyttää sijaintia toimiessaan taustalla.",
        "permdesc_accessCoarseLocation": "Tämä sovellus voi määrittää sijaintisi matkapuhelinverkon tukiasemien, Wi-Fi-verkkojen ja muiden verkkolähteiden perusteella vain jos sovellus on etualalla. Näiden sijaintipalveluiden tulee olla päällä ja käytettävissä puhelimessa, jotta sovellus voi käyttää niitä.",
        "permdesc_accessDrmCertificates": "Antaa sovelluksen käyttää DRM-varmenteita ja hallita niiden käyttäjiä. Ei tavallisten sovellusten käyttöön.",
        "permdesc_accessFineLocation": "Tämä sovellus saa tarkat sijaintitietosi käyttöönsä vain etualalla. Näiden sijaintipalveluiden tulee olla käytössä ja käytettävissä puhelimellasi, jotta sovellus voi käyttää niitä. Tämä voi lisätä akun kulutusta.",
        "permdesc_accessImsCallService": "Antaa sovelluksen soittaa puheluita pikaviestipalvelun avulla ilman käyttäjän toimia.",
        "permdesc_accessLocationExtraCommands": "Antaa sovelluksen käyttää ylimääräisiä sijaintipalvelukomentoja. Sovellus saattaa tällöin häiritä GPS:n tai muiden sijaintilähteiden toimintaa.",
        "permdesc_accessNetworkConditions": "Antaa sovellukselle luvan kuunnella verkon tilahavaintoja. Ei tavallisten sovellusten käyttöön.",
        "permdesc_accessNetworkState": "Antaa sovelluksen tarkastella verkkoyhteyksiä koskevia tietoja, kuten mitä verkkoja on olemassa ja mihin on muodostettu yhteys.",
        "permdesc_accessNotifications": "Antaa sovelluksen noutaa, tutkia ja tyhjentää ilmoituksia (myös muiden sovelluksien lähettämiä).",
        "permdesc_accessWifiState": "Antaa sovelluksen tarkastella Wi-Fi-verkkoja koskevia tietoja, kuten onko Wi-Fi käytössä ja mihin Wi-Fi-laitteisiin on muodostettu yhteys.",
        "permdesc_accessWimaxState": "Antaa sovelluksen määrittää, onko WiMAX käytössä, sekä saada selville tietoja WiMAX-verkoista, joihin on muodostettu yhteys.",
        "permdesc_access_notification_policy": "Sallii sovelluksen lukea ja muokata Älä häiritse -tilan asetuksia.",
        "permdesc_activityRecognition": "Sovellus voi tunnistaa liikkumisesi.",
        "permdesc_addVoicemail": "Antaa sovelluksen lisätä viestejä saapuneisiin vastaajaviesteihin.",
        "permdesc_answerPhoneCalls": "Sovellus saa luvan vastata saapuvaan puheluun.",
        "permdesc_audioWrite": "Antaa sovelluksen muokata musiikkikokoelmaasi.",
        "permdesc_bindCarrierMessagingService": "Antaa sovelluksen sitoutua operaattorin viestipalvelun ylätason liittymään. Ei tavallisten sovellusten käyttöön.",
        "permdesc_bindCarrierServices": "Antaa sovelluksen luoda sidoksen operaattorin palveluun. Ei tavallisten sovelluksien käyttöön.",
        "permdesc_bindConditionProviderService": "Antaa sovelluksen luoda sidoksen ehtojen toimituspalvelun ylätason rajapintaan. Ei tavallisten sovelluksien käyttöön.",
        "permdesc_bindDreamService": "Antaa sovelluksen sitoutua Unelma-palvelun ylemmän tason käyttöliittymään. Ei tavallisten sovelluksien käyttöön.",
        "permdesc_bindNotificationListenerService": "Antaa sovelluksen sitoutua ilmoituskuuntelijan ylimmän tason käyttöliittymään. Ei tavallisten sovelluksien käyttöön.",
        "permdesc_bind_connection_service": "Sallii sovelluksen olla yhteydessä puhelinpalveluihin soittamista / puhelujen vastaanottamista varten.",
        "permdesc_bind_incall_service": "Antaa sovelluksen määrätä, milloin ja millaisena käyttäjä näkee puhelunäytön.",
        "permdesc_bluetooth": "Antaa sovelluksen tarkastella puhelimen Bluetooth-asetuksia sekä muodostaa ja hyväksyä laitepariyhteyksiä muihin laitteisiin.",
        "permdesc_bluetoothAdmin": "Antaa sovelluksen määrittää paikallisen Bluetooth-puhelimen asetukset sekä tunnistaa muita laitteita ja muodostaa niiden kanssa laitepareja.",
        "permdesc_bodySensors": "Antaa sovelluksen käyttää kehosi tilaa seuraavien anturien tietoja, esimerkiksi sykettä.",
        "permdesc_broadcastSticky": "Antaa sovelluksen lähettää pysyviä lähetyksiä, jotka säilyvät lähetyksen päätyttyä. Liiallinen käyttö voi tehdä puhelimesta hitaan tai epävakaan kasvattamalla sen muistinkäyttöä liikaa.",
        "permdesc_callCompanionApp": "Sallii sovelluksen nähdä laitteella käynnissä olevat puhelut ja päättää niistä. Se näkee esimerkiksi puheluihin liittyvät numerot ja niiden tilat.",
        "permdesc_callPhone": "Antaa sovelluksen soittaa puhelinnumeroihin kysymättä sinulta. Tämä voi aiheuttaa odottamattomia kuluja tai puheluita. Huomaa, että tämä ei anna sovellukselle lupaa soittaa hätänumeroihin. Haitalliset sovellukset voivat aiheuttaa sinulle kuluja soittamalla puheluita ilman lupaa.",
        "permdesc_camera": "Tämä sovellus voi ottaa kameralla kuvia ja videoita koska tahansa.",
        "permdesc_changeNetworkState": "Antaa sovelluksen muuttaa verkkoyhteyden tilaa.",
        "permdesc_changeTetherState": "Antaa sovelluksen muuttaa internetyhteyden jakamisen tilaa.",
        "permdesc_changeWifiMulticastState": "Antaa sovelluksen vastaanottaa kaikille laitteille, ei vain puhelimellesi, Wi-Fi-verkon kautta monilähetystilassa lähetettyjä paketteja. Tämä käyttää enemmän virtaa kuin tavallinen lähetystila.",
        "permdesc_changeWifiState": "Antaa sovelluksen yhdistää Wi-Fi-tukiasemiin tai katkaista yhteyden sekä tehdä muutoksia määritettyihin Wi-Fi-verkkoihin.",
        "permdesc_changeWimaxState": "Antaa sovelluksen muodostaa puhelimella yhteyden WiMAX-verkkoon ja katkaista yhteyden.",
        "permdesc_connection_manager": "Antaa sovelluksen hallita tietoliikenneyhteyksiä.",
        "permdesc_control_incall_experience": "Antaa sovelluksen määrätä puhelukokemuksen.",
        "permdesc_createNetworkSockets": "Antaa sovelluksen luoda verkkovastakkeita ja käyttää muokattuja verkkoprotokollia. Tietoja voidaan lähettää verkkoon selaimen ja muiden sovellusten avulla, joten tätä lupaa ei tarvita tietojen lähettämiseksi.",
        "permdesc_disableKeyguard": "Antaa sovelluksen ottaa näppäinlukon ja siihen liittyvän salasanasuojauksen pois käytöstä. Esimerkki: puhelin poistaa näppäinlukon käytöstä puhelun saapuessa ja asettaa lukon takaisin käyttöön puhelun päättyessä.",
        "permdesc_enableCarMode": "Antaa sovelluksen ottaa autotilan käyttöön.",
        "permdesc_expandStatusBar": "Antaa sovelluksen laajentaa tai tiivistää tilarivin.",
        "permdesc_foregroundService": "Sallii sovelluksen käyttää etualan palveluja.",
        "permdesc_getAccounts": "Antaa sovelluksen tarkastella puhelimeen tallennettuja tilejä. Näihin voivat kuulua myös asentamiesi sovelluksien luomat tilit.",
        "permdesc_getPackageSize": "Antaa sovelluksen noutaa koodin, tietojen ja välimuistin koot",
        "permdesc_getTasks": "Antaa sovelluksen noutaa tietoja käynnissä olevista ja äskettäin suoritetuista tehtävistä. Sovellus voi saada tietoja laitteella käytetyistä sovelluksista.",
        "permdesc_handoverStatus": "Antaa sovelluksen vastaanottaa tietoja nykyisistä Android Beam -siirroista",
        "permdesc_imagesWrite": "Sallii sovelluksen muokata valokuvakokoelmaasi.",
        "permdesc_install_shortcut": "Antaa sovelluksen lisätä aloitusruudun pikakuvakkeita ilman käyttäjän toimia.",
        "permdesc_invokeCarrierSetup": "Antaa luvanhaltijan käynnistää palveluntarjoajan määrityssovelluksen. Ei tavallisten sovelluksien käyttöön.",
        "permdesc_killBackgroundProcesses": "Antaa sovelluksen sulkea muiden sovelluksien taustaprosesseja. Tämä voi sulkea muita sovelluksia.",
        "permdesc_manageFace": "Sallii sovelluksen käyttää menetelmiä, joilla voidaan lisätä tai poistaa kasvomalleja.",
        "permdesc_manageFingerprint": "Sallii sovelluksen käyttää menetelmiä, joilla voidaan lisätä tai poistaa sormenjälkimalleja.",
        "permdesc_manageNetworkPolicy": "Sallii sovelluksen hallinnoida verkkokäytäntöjä ja määritellä sovelluskohtaisia sääntöjä.",
        "permdesc_manageOwnCalls": "Tämä sallii sovelluksen ohjata puhelut järjestelmän kautta, mikä auttaa parantamaan puhelujen laatua.",
        "permdesc_manageProfileAndDeviceOwners": "Sallii sovelluksien määrittää laitteen ja profiilien omistajat.",
        "permdesc_mediaLocation": "Sallii sovelluksen lukea sijainteja mediakokoelmastasi.",
        "permdesc_modifyAudioSettings": "Antaa sovelluksen muokata yleisiä ääniasetuksia, kuten äänenvoimakkuutta ja käytettävää kaiutinta.",
        "permdesc_modifyNetworkAccounting": "Antaa sovelluksen muokata, miten sovellusten verkonkäyttöä lasketaan. Ei tavallisten sovellusten käyttöön.",
        "permdesc_nfc": "Antaa sovelluksen kommunikoida NFC (Near Field Communication) -tagien, -korttien ja -lukijoiden kanssa.",
        "permdesc_persistentActivity": "Antaa sovelluksen lisätä omia osiaan muistiin pysyvästi. Tämä voi rajoittaa muiden sovellusten käytettävissä olevaa muistia ja hidastaa puhelimen toimintaa.",
        "permdesc_processOutgoingCalls": "Sallii sovelluksen nähdä numeron, joka valitaan lähtevää puhelua soitettaessa, ja antaa mahdollisuuden ohjata puhelun eri numeroon tai keskeyttää puhelun kokonaan.",
        "permdesc_readCalendar": "Tämä sovellus voi lukea kaikkia puhelimelle tallennettuja kalenteritapahtumia sekä jakaa tai tallentaa kalenteritietoja.",
        "permdesc_readCallLog": "Tämä sovellus voi lukea puheluhistoriaasi.",
        "permdesc_readCellBroadcasts": "Antaa sovelluksen lukea laitteesi vastaanottamia tiedotteita. Tiedotteiden avulla ilmoitetaan hätätilanteista joissakin paikoissa. Haitalliset sovellukset voivat häiritä laitteen toimintaa laitteen vastaanottaessa hätätiedotteen.",
        "permdesc_readContacts": "Antaa sovelluksen lukea puhelimeesi tallennettuja kontaktitietoja sekä tarkastella, kuinka usein olet soittanut, lähettänyt sähköpostia tai muuten viestinyt tiettyjen kontaktien kanssa. Tämän luvan saaneet sovellukset voivat tallentaa kontaktitietoja. Haitalliset sovellukset voivat jakaa kontaktitietoja ilman lupaasi.",
        "permdesc_readHistoryBookmarks": "Antaa sovelluksen lukea selaimen käyttämien URL-osoitteiden historiaa sekä selaimen kirjanmerkkejä. Huomaa: kolmannen osapuolen selaimet tai muut sovellukset, jotka pystyvät selaamaan verkkoa, eivät saa käyttää tätä lupaa.",
        "permdesc_readInstallSessions": "Sallii sovelluksen lukea asennusistuntoja. Toiminto sallii sovelluksen lukea aktiivisten asennuspakettien tietoja.",
        "permdesc_readNetworkUsageHistory": "Sallii sovelluksen lukea tiettyjen verkkojen ja sovellusten verkonkäyttöhistoriaa.",
        "permdesc_readPhoneNumbers": "Anna sovelluksen käyttää laitteella olevia puhelinnumeroita.",
        "permdesc_readPhoneState": "Antaa sovelluksen käyttää laitteen puhelinominaisuuksia. Sovellus voi määrittää puhelinnumeron ja laitteen tunnuksen, puhelun tilan sekä soitetun numeron.",
        "permdesc_readSms": "Tämä sovellus voi lukea kaikkia puhelimellesi tallennettuja tekstiviestejä.",
        "permdesc_readSyncSettings": "Antaa sovelluksen lukea tilien synkronointiasetuksia. Sovellus voi esimerkiksi määrittää, onko Henkilöt-sovellus synkronoitu tilin kanssa.",
        "permdesc_readSyncStats": "Antaa sovelluksen lukea tilien synkronoinnin tilan sekä synkronoitujen tapahtumien historian ja kuinka paljon tietoja on synkronoitu.",
        "permdesc_receiveBootCompleted": "Antaa sovelluksen käynnistyä heti, kun laite on käynnistynyt. Tämä voi pidentää puhelimen käynnistysaikaa ja hidastaa puhelimen yleistä käyttöä sovelluksen ollessa aina käynnissä.",
        "permdesc_receiveMms": "Antaa sovelluksen vastaanottaa ja käsitellä multimediaviestejä. Sovellus voi valvoa tai poistaa laitteeseesi lähetettyjä viestejä näyttämättä niitä sinulle.",
        "permdesc_receiveSms": "Antaa sovelluksen vastaanottaa ja käsitellä tekstiviestejä. Sovellus voi valvoa tai poistaa laitteeseesi lähetettyjä viestejä näyttämättä niitä sinulle.",
        "permdesc_receiveWapPush": "Antaa sovelluksen vastaanottaa ja käsitellä WAP-viestejä. Sovellus voi valvoa tai poistaa laitteeseesi lähetettyjä viestejä näyttämättä niitä sinulle.",
        "permdesc_recordAudio": "Tämä sovellus voi tallentaa mikrofonilla ääntä koska tahansa.",
        "permdesc_register_call_provider": "Antaa sovelluksen rekisteröidä uusia tietoliikenneyhteyksiä.",
        "permdesc_register_sim_subscription": "Antaa sovelluksen rekisteröidä uusia tietoliikenne-SIM-yhteyksiä.",
        "permdesc_removeDrmCertificates": "Antaa sovelluksen poistaa DRM-varmenteita. Ei tavallisten sovellusten käyttöön.",
        "permdesc_reorderTasks": "Antaa sovelluksen siirtää tehtäviä etualalle ja taustalle. Sovellus ei tarvitse toimiin käyttäjän lupaa.",
        "permdesc_requestDeletePackages": "Antaa sovelluksen pyytää pakettien poistamista.",
        "permdesc_requestIgnoreBatteryOptimizations": "Sallii sovelluksen pyytää lupaa ohittaa tietyn sovelluksen akun optimoinnit.",
        "permdesc_requestInstallPackages": "Antaa sovelluksen pyytää pakettien asennusta.",
        "permdesc_requestPasswordComplexity": "Sovellus saa luvan selvittää näytön lukituksen monimutkaisuuden (korkea, keskitaso tai matala) eli sen pituus luokan ja tyypin. Sovellus voi myös ehdottaa käyttäjille näytön lukituksen vaihtamista tietylle tasolle, mutta he voivat ohittaa tämän ja poistua. Itse näytön lukitusta ei säilytetä tekstimuodossa, joten sovellus ei tiedä sitä tarkalleen.",
        "permdesc_route_media_output": "Antaa sovelluksen reitittää mediaa muihin ulkoisiin laitteisiin.",
        "permdesc_runInBackground": "Tämä sovellus voi toimia taustalla. Tämä saattaa kuluttaa enemmän akkua.",
        "permdesc_sdcardRead": "Antaa sovelluksen lukea jaetun tallennustilan sisällön.",
        "permdesc_sdcardWrite": "Antaa sovelluksen kirjoittaa jaetun tallennustilan sisällön.",
        "permdesc_sendSms": "Antaa sovelluksen lähettää tekstiviestejä. Tästä voi aiheutua odottamattomia kuluja. Haitalliset sovellukset voivat aiheuttaa kuluja lähettämällä viestejä ilman lupaasi.",
        "permdesc_setAlarm": "Antaa sovelluksen asettaa hälytyksen sisäiseen herätyskellosovellukseen. Jotkin herätyskellosovellukset eivät välttämättä käytä tätä ominaisuutta.",
        "permdesc_setInputCalibration": "Antaa sovelluksen muokata kosketusnäytön kalibrointiparametreja. Ei tavallisten sovellusten käyttöön.",
        "permdesc_setTimeZone": "Antaa sovelluksen muuttaa puhelimen aikavyöhykettä.",
        "permdesc_setWallpaper": "Antaa sovelluksen asettaa laitteen taustakuvan.",
        "permdesc_setWallpaperHints": "Antaa sovelluksen asettaa laitteen taustakuvakoon vinkkejä.",
        "permdesc_sim_communication": "Antaa sovelluksen lähettää komentoja SIM-kortille. Tämä ei ole turvallista.",
        "permdesc_startViewPermissionUsage": "Antaa luvanhaltijan käynnistää sovelluksen käyttöoikeuksien käytön. Ei tavallisten sovelluksien käyttöön.",
        "permdesc_statusBar": "Antaa sovelluksen poistaa tilapalkin käytöstä ja lisätä tai poistaa järjestelmäkuvakkeita.",
        "permdesc_statusBarService": "Antaa sovelluksen sijaita tilapalkissa.",
        "permdesc_subscribedFeedsRead": "Antaa sovelluksen saada tietoja tällä hetkellä synkronoitavista syötteistä.",
        "permdesc_systemAlertWindow": "Tämä sovellus voi näkyä muiden sovellusten tai näytön muiden osien päällä. Tämä voi häiritä sovellusten tavallista käyttöä ja muuttaa tapaa, jolla muut sovellukset näkyvät.",
        "permdesc_transmitIr": "Antaa sovelluksen käyttää puhelimen infrapunalähetintä.",
        "permdesc_uninstall_shortcut": "Antaa sovelluksen poistaa aloitusruudun pikakuvakkeita ilman käyttäjän toimia.",
        "permdesc_useBiometric": "Sallii sovelluksen käyttää biometristä laitteistoa todennukseen",
        "permdesc_useDataInBackground": "Tämä sovellus voi käyttää dataa taustalla. Tämä saattaa lisätä datankulutusta.",
        "permdesc_useFaceAuthentication": "Sallii sovelluksen käyttää kasvotunnistuslaitteistoa todennukseen",
        "permdesc_useFingerprint": "Sallii sovelluksen käyttää sormenjälkilaitteistoa todennukseen",
        "permdesc_use_sip": "Sallii sovelluksen soittaa ja vastaanottaa SIP-puheluja.",
        "permdesc_vibrate": "Antaa sovelluksen hallita värinää.",
        "permdesc_videoWrite": "Sallii sovelluksen muokata videokokoelmaasi.",
        "permdesc_wakeLock": "Antaa sovelluksen estää puhelinta siirtymästä virransäästötilaan.",
        "permdesc_writeCalendar": "Tämä sovellus voi lisätä, poistaa tai muuttaa puhelimen kalenteritapahtumia. Sovellus voi lähettää viestejä, jotka näyttävät tulevan kalenterin omistajilta, tai muuttaa kalenteritapahtumia ilmoittamatta omistajille.",
        "permdesc_writeCallLog": "Antaa sovelluksen muokata puhelimesi puhelulokia, kuten tietoja vastatuista ja soitetuista puheluista. Haitalliset sovellukset voivat poistaa puhelulokisi tai muokata sitä.",
        "permdesc_writeContacts": "Antaa sovelluksen muokata puhelimeesi tallennettuja kontaktitietoja sekä tarkastella, kuinka usein olet soittanut, lähettänyt sähköpostia tai muuten viestinyt tiettyjen kontaktien kanssa. Tämän luvan saaneet sovellukset voivat poistaa kontaktitietoja.",
        "permdesc_writeGeolocationPermissions": "Antaa sovelluksen muokata Selaimen maantieteellisen sijainnin lupia. Haitalliset sovellukset voivat sallia tällä sijaintitietojen lähettämisen mielivaltaisiin sivustoihin.",
        "permdesc_writeHistoryBookmarks": "Antaa sovelluksen muokata selaimen historiaa ja puhelimeen tallennettuja kirjanmerkkejä. Sovellus voi poistaa tai muokata selaimen tietoja. Huomaa: kolmannen osapuolen selaimet tai muut sovellukset, jotka pystyvät selaamaan verkkoa, eivät saa käyttää tätä lupaa.",
        "permdesc_writeSettings": "Antaa sovelluksen muokata järjestelmän asetustietoja. Haitalliset sovellukset voivat vahingoittaa järjestelmän määritystä.",
        "permdesc_writeSyncSettings": "Antaa sovelluksen muokata tilin synkronointiasetuksia. Sovellus voi esimerkiksi ottaa Ihmiset-sovelluksen synkronoinnin käyttöön tilissä.",
        "permgroupbackgroundrequest_location": "Saako <b>",
        "permgroupbackgroundrequestdetail_location": "Sovellus voi tällä hetkellä käyttää sijaintia vain, kun käytät \\u2019re-sovellusta",
        "permgroupdesc_activityRecognition": "nähdä liikkumistietosi",
        "permgroupdesc_calendar": "käyttää kalenteria",
        "permgroupdesc_calllog": "lukea puhelulokia ja kirjoittaa siihen",
        "permgroupdesc_camera": "ottaa kuvia ja videoita",
        "permgroupdesc_contacts": "käyttää yhteystietoja",
        "permgroupdesc_location": "käyttää laitteen sijaintia",
        "permgroupdesc_microphone": "tallentaa ääntä",
        "permgroupdesc_phone": "soittaa ja hallinnoida puheluita",
        "permgroupdesc_sensors": "käyttää anturitietoja elintoiminnoistasi",
        "permgroupdesc_sms": "lähettää ja tarkastella tekstiviestejä",
        "permgroupdesc_storage": "käyttää laitteellesi tallennettuja valokuvia, mediatiedostoja ja muita tiedostoja",
        "permgrouplab_activityRecognition": "Fyysinen toiminta",
        "permgrouplab_calendar": "Kalenteri",
        "permgrouplab_calllog": "Puhelulokit",
        "permgrouplab_camera": "Kamera",
        "permgrouplab_contacts": "Yhteystiedot",
        "permgrouplab_location": "Sijainti",
        "permgrouplab_microphone": "Mikrofoni",
        "permgrouplab_phone": "Puhelin",
        "permgrouplab_sensors": "Kehon anturit",
        "permgrouplab_sms": "Tekstiviestit",
        "permgrouplab_storage": "Tallennustila",
        "permgrouprequest_activityRecognition": "Saako <b>",
        "permgrouprequest_calendar": "Saako <b>",
        "permgrouprequest_calllog": "Saako <b>",
        "permgrouprequest_camera": "Saako <b>",
        "permgrouprequest_contacts": "Saako <b>",
        "permgrouprequest_location": "Saako <b>",
        "permgrouprequest_microphone": "Saako <b>",
        "permgrouprequest_phone": "Saako <b>",
        "permgrouprequest_sensors": "Saako <b>",
        "permgrouprequest_sms": "Saako <b>",
        "permgrouprequest_storage": "Saako <b>",
        "permgrouprequestdetail_location": "Sovellus saa sijainnin käyttöoikeuden vain silloin kun käytät \\u2019re-sovellusta",
        "permlab_acceptHandover": "jatkaa toisen sovelluksen puhelua",
        "permlab_accessBackgroundLocation": "käyttää sijaintia taustalla",
        "permlab_accessCoarseLocation": "käyttää summittaista (verkkoon perustuvaa) sijaintia vain etualalla",
        "permlab_accessDrmCertificates": "käyttää DRM-varmenteita",
        "permlab_accessFineLocation": "käyttää tarkkaa sijaintia vain etualalla",
        "permlab_accessImsCallService": "IMS-puhelinpalvelun käyttöoikeus",
        "permlab_accessLocationExtraCommands": "käyttää ylimääräisiä sijaintitoiminnan komentoja",
        "permlab_accessNetworkConditions": "kuunnella verkon tilahavaintoja",
        "permlab_accessNetworkState": "tarkastella verkkoyhteyksiä",
        "permlab_accessNotifications": "käyttää ilmoituksia",
        "permlab_accessWifiState": "tarkastella Wi-Fi-yhteyksiä",
        "permlab_accessWimaxState": "muodostaa ja katkaista yhteyden WiMAXiin",
        "permlab_access_notification_policy": "käyttää Älä häiritse -tilaa",
        "permlab_activityRecognition": "tunnistaa fyysisen aktiivisuuden",
        "permlab_addVoicemail": "lisätä vastaajaviestejä",
        "permlab_answerPhoneCalls": "vastata puheluihin",
        "permlab_audioWrite": "muokata musiikkikokoelmaasi",
        "permlab_bindCarrierMessagingService": "sitoudu operaattorin viestipalveluun",
        "permlab_bindCarrierServices": "sitoutua operaattoripalveluihin",
        "permlab_bindConditionProviderService": "ehtojen toimituspalveluun sitominen",
        "permlab_bindDreamService": "sitoudu dream-palveluun",
        "permlab_bindNotificationListenerService": "sido iilmoitus kuuntelija palveluun",
        "permlab_bind_connection_service": "toimia puhelupalvelujen kanssa",
        "permlab_bind_incall_service": "vuorovaikutteinen puhelunäyttö",
        "permlab_bluetooth": "muodostaa laitepari Bluetooth-laitteiden kanssa",
        "permlab_bluetoothAdmin": "käyttää Bluetooth-asetuksia",
        "permlab_bodySensors": "käyttää kehoantureita (kuten sykemittareita)",
        "permlab_broadcastSticky": "lähetä tärkeä lähetys",
        "permlab_callCompanionApp": "nähdä ja hallita puheluita koko järjestelmässä.",
        "permlab_callPhone": "soittaa suoraan puhelinnumeroihin",
        "permlab_camera": "ottaa kuvia ja videoita",
        "permlab_changeNetworkState": "muuttaa verkkoyhteyksiä",
        "permlab_changeTetherState": "muuttaa jaettuja verkkoyhteyksiä",
        "permlab_changeWifiMulticastState": "sallia Wi-Fi Multicast -vastaanotto",
        "permlab_changeWifiState": "muodostaa ja katkaista Wi-Fi-yhteyden",
        "permlab_changeWimaxState": "vaihtaa WiMAX-verkon tilaa",
        "permlab_connection_manager": "hallita tietoliikenneyhteyksiä",
        "permlab_control_incall_experience": "mahdollistavat puhelukokemuksen",
        "permlab_createNetworkSockets": "saada täydet verkon käyttöoikeudet",
        "permlab_disableKeyguard": "poistaa näytön lukitus käytöstä",
        "permlab_enableCarMode": "ottaa autotila käyttöön",
        "permlab_expandStatusBar": "laajentaa/tiivistää tilarivin",
        "permlab_foregroundService": "suorita etualalla toimiva palvelukomponetti",
        "permlab_getAccounts": "etsiä tilejä laitteelta",
        "permlab_getPackageSize": "mitata sovellusten tallennustilaa",
        "permlab_getTasks": "noutaa käynnissä olevat sovellukset",
        "permlab_handoverStatus": "vastaanottaa Android Beam -siirron tilatietoja",
        "permlab_imagesWrite": "muokata kuvakokoelmaasi",
        "permlab_install_shortcut": "asenna pikakuvakkeita",
        "permlab_invokeCarrierSetup": "käynnistä operaattorin toimittama kokoonpanosovellus",
        "permlab_killBackgroundProcesses": "sulje muut sovellukset",
        "permlab_manageFace": "hallinnoi kasvojentodennuslaitteistoa",
        "permlab_manageFingerprint": "hallinnoi sormenjäljentunnistinta",
        "permlab_manageNetworkPolicy": "hallinnoi verkkokäytäntöjä",
        "permlab_manageOwnCalls": "ohjaa puhelut järjestelmän kautta",
        "permlab_manageProfileAndDeviceOwners": "hallitse laitteen ja profiilien omistajia",
        "permlab_mediaLocation": "lukea mediakokoelmasi sijainteja",
        "permlab_modifyAudioSettings": "muuttaa ääniasetuksia",
        "permlab_modifyNetworkAccounting": "verkon käytön seurannan muokkaaminen",
        "permlab_nfc": "hallita NFC:tä (Near Field Communication)",
        "permlab_persistentActivity": "asettaa sovellus aina käynnissä olevaksi",
        "permlab_processOutgoingCalls": "ohjaa uudelleen lähtevät puhelut",
        "permlab_readCalendar": "Lue kalenterin tapahtumia ja tietoja",
        "permlab_readCallLog": "lue puhelulokia",
        "permlab_readCellBroadcasts": "lue tiedotteita",
        "permlab_readContacts": "lukea yhteystietojasi",
        "permlab_readHistoryBookmarks": "lukea verkkoselailusi kirjanmerkkejä ja historiaa",
        "permlab_readInstallSessions": "lukea asennusistuntoja",
        "permlab_readNetworkUsageHistory": "lukea verkonkäytön historiaa",
        "permlab_readPhoneNumbers": "lukea puhelinnumeroita",
        "permlab_readPhoneState": "lukea puhelimen tila ja identiteetti",
        "permlab_readSms": "lukea tekstiviestejäsi (teksti tai multimedia)",
        "permlab_readSyncSettings": "lukea synkronointiasetuksia",
        "permlab_readSyncStats": "lukea synkronointitilastoja",
        "permlab_receiveBootCompleted": "käynnistyä laitteen käynnistyessä",
        "permlab_receiveMms": "vastaanottaa tekstiviestejä (multimedia)",
        "permlab_receiveSms": "vastaanottaa tekstiviestejä (teksti)",
        "permlab_receiveWapPush": "vastaanottaa tekstiviestejä (WAP)",
        "permlab_recordAudio": "tallentaa ääntä",
        "permlab_register_call_provider": "rekisteröidä uusia tietoliikenneyhteyksiä",
        "permlab_register_sim_subscription": "rekisteröidä uusia tietoliikenne-SIM-yhteyksiä",
        "permlab_removeDrmCertificates": "poistaa DRM-varmenteita",
        "permlab_reorderTasks": "järjestellä käynnissä olevia sovelluksia",
        "permlab_requestDeletePackages": "pyytää pakettien poistamista",
        "permlab_requestIgnoreBatteryOptimizations": "pyytää ohittaa akkuoptimoinnit",
        "permlab_requestInstallPackages": "pyytää asennuspaketteja",
        "permlab_requestPasswordComplexity": "pyytää näytön lukituksen monimutkaisuutta",
        "permlab_route_media_output": "reitittää mediaa",
        "permlab_runInBackground": "toimia taustalla",
        "permlab_sdcardRead": "lukea jaetun tallennustilan sisällön",
        "permlab_sdcardWrite": "muokata tai poistaa jaetun tallennustilan sisältöä",
        "permlab_sendSms": "lähettää ja tarkastella tekstiviestejä",
        "permlab_setAlarm": "asettaa hälytyksen",
        "permlab_setInputCalibration": "muuttaa syöttölaitteiden kalibrointia",
        "permlab_setTimeZone": "asettaa aikavyöhykkeen",
        "permlab_setWallpaper": "asettaa taustakuvan",
        "permlab_setWallpaperHints": "säätää taustakuvan kokoa",
        "permlab_sim_communication": "lähettää komentoja SIM-kortille",
        "permlab_startViewPermissionUsage": "aloita katseluoikeuksien käyttö",
        "permlab_statusBar": "poistaa käytöstä tai muokata tilapalkkia",
        "permlab_statusBarService": "sijaita tilapalkissa",
        "permlab_subscribedFeedsRead": "lukea tilattuja syötteitä",
        "permlab_systemAlertWindow": "Tämä sovellus voi näkyä muiden sovellusten päällä",
        "permlab_transmitIr": "lähettää infrapunaa",
        "permlab_uninstall_shortcut": "poistaa pikakuvakkeita",
        "permlab_useBiometric": "käyttää biometriikkalaitteita",
        "permlab_useDataInBackground": "käyttää dataa taustalla",
        "permlab_useFaceAuthentication": "käyttää kasvojentodennuslaitteistoa",
        "permlab_useFingerprint": "käyttää sormenjäljenlukijaa",
        "permlab_use_sip": "soittaa/vastaanottaa SIP-puheluja",
        "permlab_vibrate": "hallita värinää",
        "permlab_videoWrite": "muokata videokokoelmaasi",
        "permlab_wakeLock": "estää puhelinta menemästä virransäästötilaan",
        "permlab_writeCalendar": "lisätä tai muokkata kalenteritapahtumia ja lähettää sähköpostia vieraille ilman omistajan lupaa",
        "permlab_writeCallLog": "kirjoita puhelulokiin",
        "permlab_writeContacts": "muokata yhteystietoja",
        "permlab_writeGeolocationPermissions": "selaimen maantieteellisen sijainnin lupien muokkaaminen",
        "permlab_writeHistoryBookmarks": "kirjoittaa verkkoselailun kirjanmerkkeihin ja historiaan",
        "permlab_writeSettings": "muokata järjestelmän asetuksia",
        "permlab_writeSyncSettings": "ottaa synkronointi käyttöön ja poistaa se käytöstä"
    },
    "sidebars": {
        "donate": {
            "bank_transfer_name": "Nimi",
            "bitcoin_alt": "Lahjoita Bitcoinin kautta",
            "flattr_alt": "Lahjoita Flattrin kautta",
            "heading": "Lahjoita",
            "hellotux": "👕 T-paidat 👕 myy",
            "hellotux_alt": "HELLOTUX",
            "hellotux_donation": "F-Droid saa 3 € kustakin myydystä paidasta.",
            "liberapay_alt": "Lahjoita Liberapayn kautta",
            "litecoin_alt": "Lahjoita Litecoinin kautta",
            "opencollective_alt": "Lahjoita kollektiivillemme",
            "paypal_alt": "Lahjoita PayPalin kautta",
            "powered_by_donations": "F-Droid saa voimansa lahjoituksistasi!",
            "via_bank_transfer": "Pankkisiirto"
        },
        "lang": {
            "change": "Muuta"
        },
        "last_updated": {
            "heading": "Viimeksi päivitetty"
        },
        "latest_packages": {
            "heading": "Uusimmat sovellukset"
        },
        "news": {
            "heading": "Uutiset"
        },
        "search": {
            "heading": "Löydä sovelluksia",
            "noscript": "Vaatii JavaScriptin ottamisen käyttöön",
            "search": "Hae"
        }
    }
}
