<?xml version="1.0" encoding="utf-8"?>
<!-- Generator: Adobe Illustrator 16.0.0, SVG Export Plug-In . SVG Version: 6.00 Build 0)  -->
<!DOCTYPE svg PUBLIC "-//W3C//DTD SVG 1.1//EN" "http://www.w3.org/Graphics/SVG/1.1/DTD/svg11.dtd">
<svg version="1.1" id="Layer_1" xmlns="http://www.w3.org/2000/svg" xmlns:xlink="http://www.w3.org/1999/xlink" x="0px" y="0px"
	 width="290px" height="81px" viewBox="0 0 290 81" enable-background="new 0 0 290 81" xml:space="preserve">
<g id="Symbols">
	<g id="Trophy-Sponspr---Plexi-craft" transform="translate(0.000000, -1.000000)">
		<g id="Page-1">
			<g id="Group-3" transform="translate(0.000000, 29.065800)">
				<g id="Clip-2">
				</g>
				<defs>
					<filter id="Adobe_OpacityMaskFilter" filterUnits="userSpaceOnUse" x="0.479" y="-1.182" width="32.534" height="52.683">
						<feColorMatrix  type="matrix" values="1 0 0 0 0  0 1 0 0 0  0 0 1 0 0  0 0 0 1 0"/>
					</filter>
				</defs>
				<mask maskUnits="userSpaceOnUse" x="0.479" y="-1.182" width="32.534" height="52.683" id="mask-2_1_">
					<g filter="url(#Adobe_OpacityMaskFilter)">
						<polygon id="path-1_1_" fill="#FFFFFF" points="0.479,-1.182 33.013,-1.182 33.013,51.501 0.479,51.501 						"/>
					</g>
				</mask>
				<path id="Fill-1" mask="url(#mask-2_1_)" fill="#010101" d="M28.873,16.415c0.029-1.543-0.232-3.048-0.682-4.509
					c-0.869-2.816-2.342-5.223-4.794-6.975c-2.9-2.073-6.083-2.592-9.516-1.87c-2.372,0.5-4.482,1.613-5.95,3.503
					C4.29,11.258,3.52,16.518,5.45,22.124c0.646,1.873,1.827,3.45,3.39,4.696c2.787,2.219,5.971,2.982,9.483,2.582
					c3.228-0.37,5.76-1.961,7.72-4.456C27.996,22.462,28.856,19.565,28.873,16.415 M4.671,28.189v23.312H0.628
					c-0.164-0.81-0.208-50.56-0.052-51.884c0.829-0.181,3.056-0.192,4.106,0.001c0.054,1.474,0.046,2.978-0.039,4.585
					c0.722-0.695,1.323-1.337,1.99-1.902c1.995-1.692,4.303-2.746,6.875-3.184c4.562-0.775,8.843-0.096,12.667,2.647
					c2.585,1.854,4.329,4.36,5.504,7.295c1.271,3.178,1.537,6.492,1.199,9.841c-0.354,3.502-1.667,6.673-3.955,9.377
					c-2.091,2.471-4.81,3.954-7.931,4.691c-4.042,0.955-7.972,0.545-11.742-1.187c-1.466-0.675-2.7-1.699-3.823-2.854
					C5.22,28.713,4.998,28.506,4.671,28.189"/>
			</g>
			<path id="Fill-4" fill="#010101" d="M248.184,44.532c-0.025-1.483-0.264-3.133-0.841-4.71c-0.667-1.819-1.607-3.489-3.06-4.809
				c-1.472-1.333-3.177-2.259-5.107-2.754c-4.206-1.077-7.972-0.257-11.164,2.717c-2.887,2.687-4.21,6.113-4.244,10.003
				c-0.014,1.837,0.266,3.664,0.937,5.425c0.911,2.39,2.306,4.397,4.359,5.914c3.129,2.31,6.608,2.782,10.313,1.813
				c2.502-0.653,4.527-2.082,6.012-4.167C247.345,51.219,248.108,48.066,248.184,44.532 M247.974,33.071v-4.464h4.073
				c0.05,0.212,0.143,0.438,0.153,0.667c0.021,0.568,0.006,1.137,0.006,1.706c0,9.847,0,19.692-0.002,29.539
				c0,0.414-0.04,0.828-0.062,1.282h-4.077c-0.209-0.778-0.072-1.557-0.098-2.32c-0.025-0.734-0.006-1.471-0.19-2.305
				c-0.225,0.27-0.437,0.549-0.673,0.805c-2.3,2.478-5.222,3.739-8.486,4.31c-3.349,0.583-6.581,0.105-9.674-1.252
				c-2.465-1.083-4.415-2.797-5.973-4.995c-1.785-2.52-2.813-5.305-3.196-8.356c-0.527-4.204,0.026-8.229,2.115-11.947
				c2.369-4.211,5.96-6.781,10.75-7.585c2.4-0.403,4.794-0.362,7.187,0.183c2.704,0.614,5.058,1.83,7.012,3.806
				c0.273,0.277,0.554,0.548,0.835,0.819C247.696,32.984,247.735,32.987,247.974,33.071"/>
			<path id="Fill-6" fill="#010101" d="M78.169,41.974c-0.619-5.064-5.553-10.593-12.351-10.135
				c-3.358,0.226-6.219,1.671-8.423,4.242c-1.435,1.674-2.48,3.569-2.728,5.894H78.169z M78.143,51.029
				c1.239,0.741,2.327,1.396,3.417,2.051c-0.033,0.169-0.028,0.28-0.074,0.363c-1.498,2.813-3.489,5.18-6.267,6.809
				c-1.824,1.069-3.791,1.739-5.888,2.058c-3.389,0.514-6.662,0.143-9.771-1.304c-0.987-0.459-1.951-1.042-2.795-1.729
				c-2.956-2.404-4.923-5.467-5.81-9.192c-0.53-2.229-0.717-4.496-0.503-6.768c0.55-5.849,3.224-10.438,8.292-13.526
				c1.439-0.876,3.04-1.358,4.695-1.643c2.588-0.445,5.163-0.349,7.701,0.318c2.021,0.53,3.824,1.513,5.419,2.858
				c3.218,2.71,4.942,6.254,5.655,10.329c0.207,1.184,0.263,2.393,0.373,3.592c0.019,0.2-0.042,0.41-0.071,0.663
				c-1.045,0.211-2.071,0.076-3.088,0.1c-1.029,0.024-2.061,0.006-3.091,0.006h-3.092h-3.092h-3.197h-3.092h-3.092h-3.091h-3.057
				c-0.258,4.782,2.513,9.668,7.12,11.535c3.142,1.271,6.342,1.519,9.525,0.179C74.372,56.421,76.56,54.105,78.143,51.029z"/>
			<path id="Fill-8" fill="#010101" d="M138.311,46.818c0.241,0.063,0.341,0.114,0.441,0.114c5.829,0.007,11.657,0.009,17.484,0.009
				c0.142,0,0.282-0.029,0.423-0.051c0.03-0.004,0.06-0.032,0.085-0.053c0.03-0.021,0.054-0.046,0.144-0.122
				c0-1.051,0-2.148,0-3.245c0-0.396-0.223-0.578-0.598-0.598c-0.179-0.007-0.357,0.002-0.533,0.002H139.55
				c-0.213,0-0.427-0.009-0.639,0.002c-0.373,0.022-0.599,0.202-0.6,0.598C138.311,44.572,138.311,45.669,138.311,46.818
				 M159.882,44.495c0.148,7.057-5.675,12.452-12.442,12.438c-6.957-0.016-12.563-5.516-12.502-12.667
				c0.056-6.526,5.285-12.507,12.94-12.313C154.048,32.108,160.1,37.229,159.882,44.495"/>
			<path id="Fill-10" fill="#010101" d="M99.72,47.38c-0.782,0.994-1.462,1.851-2.132,2.715c-2.896,3.73-5.791,7.463-8.675,11.204
				c-0.253,0.328-0.485,0.567-0.946,0.558c-1.315-0.027-2.631-0.012-3.946-0.019c-0.098,0-0.193-0.06-0.415-0.132
				c4.465-5.803,8.896-11.559,13.399-17.411c-4.083-5.179-8.16-10.353-12.315-15.622c0.306-0.057,0.493-0.121,0.681-0.123
				c1.173-0.009,2.348,0.022,3.519-0.016c0.554-0.019,0.932,0.153,1.269,0.593c1.362,1.775,2.745,3.535,4.132,5.291
				c1.758,2.23,3.526,4.452,5.292,6.675c0.019,0.024,0.062,0.028,0.198,0.088c0.419-0.509,0.871-1.039,1.301-1.585
				c1.406-1.785,2.804-3.576,4.205-5.365c1.293-1.648,2.603-3.283,3.874-4.949c0.4-0.523,0.819-0.787,1.514-0.755
				c1.341,0.061,2.687,0.018,4.217,0.018c-4.218,5.343-8.32,10.54-12.438,15.757c4.499,5.829,8.959,11.608,13.538,17.541
				c-1.687,0-3.173,0.023-4.656-0.025c-0.259-0.008-0.565-0.275-0.752-0.503c-0.786-0.962-1.531-1.957-2.296-2.937
				c-2.227-2.856-4.456-5.712-6.684-8.57C101.017,49.057,100.431,48.298,99.72,47.38"/>
			<g id="Group-14" transform="translate(289.000000, 0.065800)">
				<g id="Clip-13">
				</g>
				<defs>
					<filter id="Adobe_OpacityMaskFilter_1_" filterUnits="userSpaceOnUse" x="-30.748" y="2.212" width="15.938" height="59.571">
						<feColorMatrix  type="matrix" values="1 0 0 0 0  0 1 0 0 0  0 0 1 0 0  0 0 0 1 0"/>
					</filter>
				</defs>
				<mask maskUnits="userSpaceOnUse" x="-30.748" y="2.212" width="15.938" height="59.571" id="mask-4_1_">
					<g filter="url(#Adobe_OpacityMaskFilter_1_)">
						<polygon id="path-3_1_" fill="#FFFFFF" points="-30.749,2.212 -14.811,2.212 -14.811,61.784 -30.749,61.784 						"/>
					</g>
				</mask>
				<path id="Fill-12" mask="url(#mask-4_1_)" fill="#010101" d="M-27.267,32.507h-3.271c-0.338-0.675-0.159-1.321-0.188-1.94
					c-0.032-0.635-0.006-1.272-0.006-1.999c1.185-0.208,2.353,0.007,3.599-0.144v-1.083c0-4.764,0.002-9.529-0.002-14.294
					c0-1.604,0.167-3.186,0.579-4.739c0.817-3.073,2.875-4.902,5.854-5.759c1.562-0.449,3.158-0.431,4.742-0.066
					c0.371,0.085,0.724,0.247,1.131,0.39c0.016,1.294,0.035,2.522-0.014,3.849c-0.647-0.125-1.157-0.276-1.673-0.31
					c-0.917-0.061-1.859-0.185-2.754-0.043c-1.802,0.284-2.667,1.614-3.157,3.237c-0.404,1.339-0.485,2.722-0.487,4.109
					c-0.004,4.729-0.002,9.459,0.002,14.188c0,0.14,0.023,0.28,0.047,0.543c0.877,0.011,1.752,0.024,2.629,0.03
					c0.89,0.006,1.778,0.002,2.667,0.002h2.752c-0.006,1.365,0.044,2.623-0.044,3.989c-2.696,0.086-5.312-0.007-8.027,0.058
					c-0.01,0.448-0.025,0.827-0.025,1.206c-0.002,8.888,0,17.779-0.004,26.668c0,0.416-0.028,0.833-0.044,1.362
					c-1.395,0.031-2.696,0.016-3.944,0.011c-0.077-0.077-0.105-0.099-0.127-0.125c-0.024-0.026-0.048-0.053-0.062-0.085
					c-0.014-0.031-0.021-0.068-0.022-0.103c-0.008-0.106-0.014-0.212-0.014-0.319c-0.01-9.458-0.016-18.915-0.025-28.373
					C-27.157,32.739-27.182,32.707-27.267,32.507"/>
			</g>
			<path id="Fill-15" fill="#010101" d="M195.521,37.635c-0.271-0.319-0.531-0.65-0.817-0.954c-2.208-2.331-4.835-3.987-8.006-4.581
				c-5.25-0.984-9.62,0.624-12.912,4.849c-1.813,2.33-2.798,5.062-2.746,8.021c0.093,5.188,2.225,9.354,6.788,12.022
				c2.212,1.294,4.643,1.823,7.264,1.516c4.379-0.513,7.821-2.581,10.52-6.001c0.107-0.135,0.23-0.256,0.367-0.403
				c0.229,0.739,0.285,3.58,0.125,5.725c-2.683,2.53-5.933,3.903-9.56,4.485c-3.542,0.57-6.935,0.01-10.181-1.435
				c-1.802-0.801-3.361-2.001-4.71-3.435c-1.899-2.021-3.313-4.346-4.056-7.037c-1.398-5.066-0.973-9.966,1.783-14.476
				c2.242-3.67,5.469-6.238,9.679-7.39c2.954-0.808,5.937-0.839,8.956-0.259c2.5,0.482,4.701,1.541,6.756,2.992
				c0.709,0.499,1.019,1.062,0.975,1.948c-0.073,1.447-0.02,2.902-0.02,4.352L195.521,37.635z"/>
			<path id="Fill-17" fill="#010101" d="M43.674,61.797H39.64V3.393c0.786-0.244,3.045-0.266,3.997-0.05
				C43.808,4.102,43.854,60.438,43.674,61.797"/>
			<g id="Group-21" transform="translate(309.000000, 17.065800)">
				<g id="Clip-20">
				</g>
				<defs>
					<filter id="Adobe_OpacityMaskFilter_2_" filterUnits="userSpaceOnUse" x="-33.543" y="-0.05" width="13.23" height="44.784">
						<feColorMatrix  type="matrix" values="1 0 0 0 0  0 1 0 0 0  0 0 1 0 0  0 0 0 1 0"/>
					</filter>
				</defs>
				<mask maskUnits="userSpaceOnUse" x="-33.543" y="-0.05" width="13.23" height="44.784" id="mask-6_1_">
					<g filter="url(#Adobe_OpacityMaskFilter_2_)">
						<polygon id="path-5_1_" fill="#FFFFFF" points="-33.543,-0.05 -20.313,-0.05 -20.313,44.734 -33.543,44.734 						"/>
					</g>
				</mask>
				<path id="Fill-19" mask="url(#mask-6_1_)" fill="#010101" d="M-25.846,44.734h-4.197c-0.006-3.266-0.002-6.487-0.002-9.707
					c-0.002-3.233-0.002-6.468-0.002-9.701v-9.79h-3.448c-0.016-0.73-0.037-1.353-0.043-1.976c-0.009-0.637-0.003-1.275-0.003-2.017
					c1.153-0.156,2.284,0.02,3.479-0.116V0.013c1.415-0.11,2.744-0.04,4.192-0.053c0.006,1.01,0.02,1.958,0.024,2.904
					c0.004,0.959,0,1.919,0,2.878c0,0.924,0.002,1.847,0.002,2.771v2.96h5.531v4.013h-5.523c-0.019,1.732-0.008,3.354-0.01,4.978
					c-0.002,1.598,0.002,3.197,0.002,4.798c0,1.633-0.002,3.267-0.002,4.902v4.798v4.902V44.734z"/>
			</g>
			<path id="Fill-22" fill="#010101" d="M207.475,61.803h-3.929c-0.048-0.041-0.078-0.062-0.102-0.088
				c-0.021-0.025-0.052-0.057-0.052-0.086c-0.016-10.697-0.029-21.395-0.045-32.092v-0.953c1.364-0.075,2.662-0.029,3.991-0.035
				c0.298,0.904,0.026,1.801,0.194,2.82c1.396-1.983,3.136-3.226,5.484-3.433c1.794-0.157,3.523,0.038,5.206,1.003
				c-0.728,1.24-1.422,2.423-2.145,3.653c-0.188-0.075-0.361-0.112-0.5-0.203c-1.942-1.289-5.404-0.376-6.65,2.128
				c-0.696,1.398-1.067,2.86-1.225,4.379c-0.148,1.444-0.214,2.903-0.22,4.356c-0.024,5.758-0.01,11.517-0.01,17.273V61.803z"/>
			<path id="Fill-24" fill="#010101" d="M121.302,28.588h3.863c0.067,0.057,0.098,0.076,0.12,0.104
				c0.021,0.026,0.044,0.06,0.044,0.09c0.015,10.759,0.029,21.518,0.04,32.278c0,0.209-0.027,0.42-0.044,0.657
				c-0.665,0.252-1.341,0.096-2.002,0.126c-0.634,0.024-1.27,0.005-1.829,0.005c-0.098-0.099-0.126-0.12-0.148-0.148
				c-0.021-0.027-0.047-0.061-0.047-0.09c-0.014-10.759-0.025-21.518-0.035-32.277C121.263,29.124,121.284,28.915,121.302,28.588"/>
			<path id="Fill-26" fill="#010101" d="M126.782,18.278c0.023,1.866-1.477,3.42-3.334,3.453c-1.857,0.034-3.44-1.49-3.453-3.324
				c-0.014-1.884,1.463-3.414,3.329-3.452C125.176,14.917,126.758,16.437,126.782,18.278"/>
		</g>
	</g>
</g>
</svg>
