<?xml version="1.0" encoding="UTF-8"?>
<svg width="396px" height="184px" viewBox="0 0 396 184" version="1.1" xmlns="http://www.w3.org/2000/svg" xmlns:xlink="http://www.w3.org/1999/xlink">
    <!-- Generator: Sketch 50.2 (55047) - http://www.bohemiancoding.com/sketch -->
    <title>ctc&amp;g-sponsor-gault</title>
    <desc>Created with Sketch.</desc>
    <defs></defs>
    <g id="ctc&amp;g-sponsor-gault" stroke="none" stroke-width="1" fill="none" fill-rule="evenodd">
        <path d="M227.917,73.025 C224.932,73.025 222.483,72.03 220.224,70.012 L221.542,68.452 C223.506,70.228 225.389,71.116 227.998,71.116 C230.526,71.116 232.194,69.77 232.194,67.915 L232.194,67.86 C232.194,66.112 231.253,65.117 227.299,64.283 C222.968,63.341 220.977,61.942 220.977,58.848 L220.977,58.794 C220.977,55.835 223.585,53.657 227.163,53.657 C229.907,53.657 231.871,54.437 233.782,55.97 L232.544,57.611 C230.796,56.185 229.047,55.567 227.11,55.567 C224.662,55.567 223.103,56.912 223.103,58.606 L223.103,58.66 C223.103,60.436 224.07,61.431 228.213,62.319 C232.41,63.233 234.347,64.767 234.347,67.645 L234.347,67.699 C234.347,70.927 231.656,73.025 227.917,73.025" id="Fill-1" fill="#101014"></path>
        <polyline id="Fill-2" fill="#101014" points="245.945 72.756 243.793 72.756 243.793 55.889 237.472 55.889 237.471 53.925 252.267 53.925 252.268 55.889 245.945 55.889 245.945 72.756"></polyline>
        <path d="M264.236,73.08 C258.506,73.08 254.659,68.586 254.659,63.395 L254.659,63.341 C254.659,58.149 258.559,53.603 264.289,53.603 C270.019,53.603 273.867,58.095 273.867,63.288 L273.867,63.341 C273.867,68.533 269.966,73.08 264.236,73.08 M264.236,55.567 C259.932,55.567 256.865,59.01 256.865,63.288 L256.865,63.341 C256.865,67.619 259.985,71.116 264.29,71.116 C268.594,71.116 271.661,67.672 271.661,63.395 L271.661,63.341 C271.661,59.064 268.54,55.567 264.236,55.567" id="Fill-3" fill="#101014"></path>
        <polyline id="Fill-4" fill="#101014" points="294.824 72.756 293.129 72.756 280.97 57.315 280.97 72.756 278.899 72.756 278.898 53.925 280.889 53.925 292.753 69.017 292.752 53.925 294.823 53.925 294.824 72.756"></polyline>
        <polyline id="Fill-5" fill="#101014" points="314.438 72.756 300.69 72.756 300.69 53.925 314.302 53.925 314.303 55.863 302.816 55.863 302.816 62.292 313.092 62.292 313.092 64.229 302.816 64.229 302.816 70.82 314.438 70.82 314.438 72.756"></polyline>
        <path d="M341.446,73.133 L338.487,70.093 C336.766,71.95 334.775,73.025 332.327,73.025 C328.938,73.025 326.409,70.9 326.409,67.753 L326.409,67.699 C326.409,65.197 328.077,63.395 330.955,62.265 C329.664,60.758 329.072,59.602 329.072,58.122 L329.072,58.068 C329.072,55.593 331.062,53.603 334.048,53.603 C336.685,53.603 338.622,55.512 338.622,57.853 L338.622,57.907 C338.622,60.301 336.927,61.835 334.184,62.803 L338.487,67.188 C339.321,65.977 340.074,64.551 340.747,62.991 L342.496,63.798 C341.662,65.574 340.801,67.188 339.778,68.533 L343.061,71.895 L341.446,73.133 M332.166,63.583 C329.664,64.498 328.561,66.031 328.561,67.619 L328.561,67.672 C328.561,69.69 330.175,71.223 332.488,71.223 C334.264,71.223 335.824,70.282 337.196,68.775 L332.166,63.583 M333.968,55.351 C332.274,55.351 331.116,56.535 331.116,58.068 L331.116,58.122 C331.116,59.225 331.574,60.059 333,61.592 C335.394,60.786 336.631,59.629 336.631,58.014 L336.631,57.961 C336.631,56.455 335.501,55.351 333.968,55.351" id="Fill-6" fill="#101014"></path>
        <polyline id="Fill-7" fill="#101014" points="234.186 105.041 221.461 105.041 221.461 86.209 223.586 86.209 223.586 103.077 234.186 103.077 234.186 105.041"></polyline>
        <path d="M256.191,105.041 L253.904,105.041 L251.698,100.064 L241.449,100.064 L239.217,105.041 L237.037,105.041 L245.619,86.075 L247.609,86.075 L256.191,105.041 M246.587,88.55 L242.283,98.154 L250.864,98.154 L246.587,88.55" id="Fill-8" fill="#101014"></path>
        <polyline id="Fill-9" fill="#101014" points="276.369 105.041 274.674 105.041 262.515 89.599 262.515 105.041 260.443 105.041 260.443 86.209 262.435 86.209 274.298 101.301 274.298 86.209 276.369 86.209 276.369 105.041"></polyline>
        <path d="M288.772,105.041 L282.234,105.041 L282.234,86.209 L288.772,86.209 C294.69,86.209 298.778,90.272 298.778,95.571 L298.778,95.626 C298.778,100.924 294.69,105.041 288.772,105.041 M284.359,88.173 L284.359,103.077 L288.772,103.077 C293.533,103.077 296.573,99.848 296.573,95.679 L296.573,95.626 C296.573,91.456 293.533,88.173 288.772,88.173 L284.359,88.173" id="Fill-10" fill="#101014"></path>
        <path d="M309.997,105.309 C307.012,105.309 304.564,104.314 302.304,102.296 L303.622,100.737 C305.586,102.512 307.469,103.4 310.078,103.4 C312.607,103.4 314.275,102.054 314.275,100.199 L314.275,100.144 C314.275,98.396 313.333,97.401 309.379,96.567 C305.048,95.626 303.057,94.226 303.057,91.132 L303.057,91.079 C303.057,88.12 305.666,85.941 309.244,85.941 C311.988,85.941 313.952,86.721 315.862,88.254 L314.624,89.895 C312.876,88.469 311.127,87.851 309.19,87.851 C306.742,87.851 305.183,89.196 305.183,90.89 L305.183,90.944 C305.183,92.72 306.15,93.715 310.293,94.603 C314.49,95.517 316.427,97.051 316.427,99.929 L316.427,99.983 C316.427,103.212 313.736,105.309 309.997,105.309" id="Fill-11" fill="#101014"></path>
        <path d="M329.905,105.364 C324.472,105.364 320.463,101.086 320.463,95.679 L320.463,95.626 C320.463,90.298 324.444,85.887 329.986,85.887 C333.402,85.887 335.447,87.097 337.33,88.873 L335.878,90.433 C334.29,88.926 332.515,87.851 329.959,87.851 C325.789,87.851 322.669,91.24 322.669,95.571 L322.669,95.626 C322.669,99.983 325.817,103.4 329.959,103.4 C332.542,103.4 334.236,102.404 336.039,100.682 L337.438,102.054 C335.474,104.045 333.322,105.364 329.905,105.364" id="Fill-12" fill="#101014"></path>
        <path d="M359.23,105.041 L356.942,105.041 L354.736,100.064 L344.487,100.064 L342.255,105.041 L340.075,105.041 L348.657,86.075 L350.647,86.075 L359.23,105.041 M349.625,88.55 L345.321,98.154 L353.902,98.154 L349.625,88.55" id="Fill-13" fill="#101014"></path>
        <path d="M365.606,105.041 L363.481,105.041 L363.481,86.209 L370.528,86.209 C374.779,86.209 377.577,88.469 377.577,92.182 L377.577,92.236 C377.577,96.297 374.188,98.396 370.179,98.396 L365.606,98.396 L365.606,105.041 M365.606,88.173 L365.606,96.46 L370.26,96.46 C373.38,96.46 375.425,94.792 375.425,92.316 L375.425,92.262 C375.425,89.573 373.407,88.173 370.367,88.173 L365.606,88.173" id="Fill-14" fill="#101014"></path>
        <polyline id="Fill-15" fill="#101014" points="395.737 105.041 381.99 105.041 381.99 86.209 395.603 86.209 395.603 88.147 384.115 88.147 384.115 94.576 394.392 94.576 394.392 96.513 384.115 96.513 384.115 103.104 395.737 103.104 395.737 105.041"></polyline>
        <path d="M227.917,137.593 C224.932,137.593 222.483,136.598 220.224,134.581 L221.542,133.02 C223.506,134.796 225.389,135.684 227.998,135.684 C230.526,135.684 232.194,134.338 232.194,132.483 L232.194,132.428 C232.194,130.68 231.253,129.685 227.299,128.851 C222.968,127.91 220.977,126.51 220.977,123.417 L220.977,123.363 C220.977,120.404 223.586,118.225 227.164,118.225 C229.908,118.225 231.872,119.005 233.782,120.539 L232.544,122.179 C230.796,120.754 229.047,120.135 227.11,120.135 C224.662,120.135 223.103,121.48 223.103,123.174 L223.103,123.228 C223.103,125.004 224.07,126 228.213,126.887 C232.41,127.801 234.347,129.336 234.347,132.213 L234.347,132.267 C234.347,135.496 231.656,137.593 227.917,137.593" id="Fill-16" fill="#101014"></path>
        <path d="M246.749,137.621 C242.096,137.621 238.921,134.769 238.921,129.443 L238.921,118.494 L241.046,118.494 L241.046,129.308 C241.046,133.371 243.198,135.657 246.803,135.657 C250.274,135.657 252.48,133.558 252.48,129.443 L252.48,118.494 L254.605,118.494 L254.605,129.281 C254.605,134.769 251.457,137.621 246.749,137.621" id="Fill-17" fill="#101014"></path>
        <path d="M262.299,137.325 L260.174,137.325 L260.174,118.494 L267.222,118.494 C271.473,118.494 274.271,120.754 274.271,124.466 L274.271,124.52 C274.271,128.582 270.881,130.68 266.872,130.68 L262.299,130.68 L262.299,137.325 M262.299,120.458 L262.299,128.744 L266.953,128.744 C270.073,128.744 272.118,127.076 272.118,124.6 L272.118,124.546 C272.118,121.857 270.101,120.458 267.061,120.458 L262.299,120.458" id="Fill-18" fill="#101014"></path>
        <path d="M280.809,137.325 L278.684,137.325 L278.684,118.494 L285.732,118.494 C289.982,118.494 292.78,120.754 292.78,124.466 L292.78,124.52 C292.78,128.582 289.391,130.68 285.382,130.68 L280.809,130.68 L280.809,137.325 M280.809,120.458 L280.809,128.744 L285.463,128.744 C288.583,128.744 290.628,127.076 290.628,124.6 L290.628,124.546 C290.628,121.857 288.61,120.458 285.57,120.458 L280.809,120.458" id="Fill-19" fill="#101014"></path>
        <polyline id="Fill-20" fill="#101014" points="309.917 137.325 297.192 137.325 297.192 118.494 299.317 118.494 299.317 135.361 309.917 135.361 309.917 137.325"></polyline>
        <polygon id="Fill-21" fill="#101014" points="314.572 137.325 316.697 137.325 316.697 118.494 314.572 118.494"></polygon>
        <polyline id="Fill-22" fill="#101014" points="336.497 137.325 322.75 137.325 322.75 118.494 336.362 118.494 336.362 120.431 324.875 120.431 324.875 126.86 335.151 126.86 335.151 128.797 324.875 128.797 324.875 135.388 336.497 135.388 336.497 137.325"></polyline>
        <path d="M347.769,137.593 C344.783,137.593 342.335,136.598 340.075,134.581 L341.394,133.02 C343.358,134.796 345.24,135.684 347.85,135.684 C350.378,135.684 352.046,134.338 352.046,132.483 L352.046,132.428 C352.046,130.68 351.105,129.685 347.15,128.851 C342.819,127.91 340.828,126.51 340.828,123.417 L340.828,123.363 C340.828,120.404 343.438,118.225 347.016,118.225 C349.76,118.225 351.724,119.005 353.634,120.539 L352.396,122.179 C350.647,120.754 348.899,120.135 346.962,120.135 C344.514,120.135 342.954,121.48 342.954,123.174 L342.954,123.228 C342.954,125.004 343.922,126 348.065,126.887 C352.262,127.801 354.198,129.336 354.198,132.213 L354.198,132.267 C354.198,135.496 351.508,137.593 347.769,137.593" id="Fill-23" fill="#101014"></path>
        <polygon id="Fill-24" fill="#101014" points="172.592 183.889 174.108 183.889 174.108 0.44 172.592 0.44"></polygon>
        <polyline id="Fill-25" fill="#101014" points="0.003 183.82 0.003 170.846 6.221 170.846 6.221 172.787 2.232 172.787 2.232 176.129 5.214 176.129 5.214 178.07 2.232 178.07 2.232 183.82 0.003 183.82"></polyline>
        <path d="M9.329,179.004 L11.126,179.004 L10.245,173.434 L10.209,173.434 L9.329,179.004 Z M8.61,183.82 L6.454,183.82 L8.844,170.846 L11.611,170.846 L14.001,183.82 L11.845,183.82 L11.449,180.945 L9.006,180.945 L8.61,183.82 Z" id="Fill-26" fill="#101014"></path>
        <polyline id="Fill-27" fill="#101014" points="24.584 170.846 24.584 183.82 22.644 183.82 22.644 173.685 22.608 173.685 20.595 183.82 19.517 183.82 17.504 173.685 17.468 173.685 17.468 183.82 15.527 183.82 15.527 170.846 18.456 170.846 20.038 178.429 20.074 178.429 21.655 170.846 24.584 170.846"></polyline>
        <polygon id="Fill-28" fill="#101014" points="27.298 183.82 29.526 183.82 29.526 170.846 27.298 170.846"></polygon>
        <polyline id="Fill-29" fill="#101014" points="32.239 183.82 32.239 170.846 34.467 170.846 34.467 181.879 37.971 181.879 37.971 183.82 32.239 183.82"></polyline>
        <polyline id="Fill-30" fill="#101014" points="43.093 183.82 40.864 183.82 40.864 178.429 38.169 170.846 40.433 170.846 41.996 175.788 42.032 175.788 43.523 170.846 45.788 170.846 43.093 178.429 43.093 183.82"></polyline>
        <path d="M56.964,175.176 L56.964,174.17 C56.964,173.62 56.857,173.221 56.641,172.975 C56.425,172.73 56.174,172.607 55.886,172.607 C55.431,172.607 55.119,172.724 54.951,172.958 C54.783,173.191 54.7,173.553 54.7,174.044 L54.7,180.622 C54.7,181.113 54.783,181.475 54.951,181.709 C55.119,181.942 55.431,182.059 55.886,182.059 C56.293,182.059 56.574,181.945 56.731,181.717 C56.886,181.49 56.964,181.167 56.964,180.748 L56.964,179.184 L59.193,179.184 L59.193,180.675 C59.193,181.13 59.123,181.562 58.985,181.969 C58.848,182.377 58.645,182.73 58.375,183.029 C58.105,183.329 57.761,183.566 57.342,183.739 C56.922,183.913 56.437,184 55.886,184 C55.299,184 54.793,183.913 54.367,183.739 C53.943,183.566 53.589,183.329 53.308,183.029 C53.026,182.73 52.816,182.377 52.679,181.969 C52.54,181.562 52.472,181.13 52.472,180.675 L52.472,173.991 C52.472,173.536 52.54,173.104 52.679,172.697 C52.816,172.29 53.026,171.936 53.308,171.637 C53.589,171.337 53.943,171.101 54.367,170.927 C54.793,170.753 55.299,170.667 55.886,170.667 C56.437,170.667 56.922,170.762 57.342,170.954 C57.761,171.146 58.105,171.403 58.375,171.727 C58.645,172.05 58.848,172.427 58.985,172.859 C59.123,173.29 59.193,173.746 59.193,174.224 L59.193,175.176 L56.964,175.176" id="Fill-31" fill="#101014"></path>
        <path d="M63.685,180.622 C63.685,181.113 63.768,181.475 63.936,181.709 C64.104,181.942 64.415,182.059 64.87,182.059 C65.325,182.059 65.637,181.942 65.805,181.709 C65.973,181.475 66.057,181.113 66.057,180.622 L66.057,174.044 C66.057,173.553 65.973,173.191 65.805,172.958 C65.637,172.724 65.325,172.607 64.87,172.607 C64.415,172.607 64.104,172.724 63.936,172.958 C63.768,173.191 63.685,173.553 63.685,174.044 L63.685,180.622 Z M61.456,173.991 C61.456,173.536 61.525,173.104 61.663,172.697 C61.801,172.29 62.01,171.936 62.292,171.637 C62.573,171.337 62.927,171.101 63.352,170.927 C63.777,170.753 64.283,170.667 64.87,170.667 C65.457,170.667 65.963,170.753 66.389,170.927 C66.814,171.101 67.167,171.337 67.449,171.637 C67.731,171.936 67.94,172.29 68.078,172.697 C68.215,173.104 68.284,173.536 68.284,173.991 L68.284,180.675 C68.284,181.13 68.215,181.562 68.078,181.969 C67.94,182.377 67.731,182.73 67.449,183.029 C67.167,183.329 66.814,183.566 66.389,183.739 C65.963,183.913 65.457,184 64.87,184 C64.283,184 63.777,183.913 63.352,183.739 C62.927,183.566 62.573,183.329 62.292,183.029 C62.01,182.73 61.801,182.377 61.663,181.969 C61.525,181.562 61.456,181.13 61.456,180.675 L61.456,173.991 Z" id="Fill-32" fill="#101014"></path>
        <polyline id="Fill-33" fill="#101014" points="79.371 170.846 79.371 183.82 77.431 183.82 77.431 173.685 77.395 173.685 75.382 183.82 74.304 183.82 72.291 173.685 72.255 173.685 72.255 183.82 70.314 183.82 70.314 170.846 73.243 170.846 74.825 178.429 74.861 178.429 76.443 170.846 79.371 170.846"></polyline>
        <path d="M84.008,176.669 L84.87,176.669 C85.23,176.669 85.532,176.638 85.777,176.579 C86.023,176.518 86.221,176.411 86.37,176.254 C86.521,176.099 86.625,175.893 86.685,175.635 C86.745,175.378 86.775,175.057 86.775,174.673 C86.775,174.291 86.745,173.97 86.685,173.712 C86.625,173.455 86.521,173.252 86.37,173.101 C86.221,172.952 86.023,172.844 85.777,172.778 C85.532,172.712 85.23,172.679 84.87,172.679 L84.008,172.679 L84.008,176.669 Z M81.779,183.82 L81.779,170.846 L84.978,170.846 C86.356,170.846 87.37,171.14 88.024,171.727 C88.677,172.314 89.003,173.296 89.003,174.673 C89.003,175.369 88.922,175.959 88.761,176.444 C88.599,176.928 88.353,177.324 88.024,177.629 C87.694,177.935 87.275,178.157 86.766,178.294 C86.257,178.432 85.661,178.501 84.978,178.501 L84.008,178.501 L84.008,183.82 L81.779,183.82 Z" id="Fill-34" fill="#101014"></path>
        <path d="M92.417,179.004 L94.214,179.004 L93.333,173.434 L93.297,173.434 L92.417,179.004 Z M91.698,183.82 L89.542,183.82 L91.932,170.846 L94.699,170.846 L97.089,183.82 L94.933,183.82 L94.537,180.945 L92.094,180.945 L91.698,183.82 Z" id="Fill-35" fill="#101014"></path>
        <polyline id="Fill-36" fill="#101014" points="98.383 183.82 98.383 170.846 100.449 170.846 103.163 178.267 103.198 178.267 103.198 170.846 105.211 170.846 105.211 183.82 103.271 183.82 100.432 175.715 100.396 175.715 100.396 183.82 98.383 183.82"></polyline>
        <polygon id="Fill-37" fill="#101014" points="107.673 183.82 109.9 183.82 109.9 170.846 107.673 170.846"></polygon>
        <polyline id="Fill-38" fill="#101014" points="112.003 183.82 112.003 170.846 117.969 170.846 117.969 172.787 114.232 172.787 114.232 176.129 117.107 176.129 117.107 178.07 114.232 178.07 114.232 181.879 118.221 181.879 118.221 183.82 112.003 183.82"></polyline>
        <path d="M123.684,174.044 C123.659,173.769 123.608,173.539 123.53,173.353 C123.452,173.168 123.357,173.02 123.243,172.913 C123.129,172.805 123.006,172.727 122.875,172.679 C122.742,172.631 122.617,172.607 122.497,172.607 C122.138,172.607 121.862,172.718 121.671,172.94 C121.479,173.162 121.383,173.476 121.383,173.883 C121.383,174.254 121.494,174.596 121.716,174.907 C121.938,175.219 122.216,175.53 122.551,175.841 C122.887,176.153 123.252,176.467 123.648,176.785 C124.043,177.102 124.408,177.453 124.743,177.836 C125.078,178.219 125.358,178.642 125.579,179.103 C125.801,179.564 125.911,180.088 125.911,180.675 C125.911,181.214 125.824,181.691 125.65,182.104 C125.477,182.517 125.237,182.865 124.932,183.146 C124.627,183.427 124.255,183.64 123.818,183.784 C123.381,183.927 122.904,184 122.39,184 C121.874,184 121.413,183.904 121.006,183.712 C120.599,183.521 120.254,183.26 119.973,182.93 C119.691,182.601 119.472,182.22 119.316,181.79 C119.161,181.358 119.071,180.897 119.047,180.406 L121.167,180.1 C121.215,180.759 121.359,181.251 121.599,181.574 C121.838,181.897 122.138,182.059 122.497,182.059 C122.881,182.059 123.191,181.958 123.432,181.753 C123.671,181.55 123.791,181.256 123.791,180.873 C123.791,180.442 123.68,180.058 123.459,179.723 C123.236,179.387 122.958,179.064 122.623,178.753 C122.287,178.441 121.922,178.129 121.526,177.818 C121.132,177.506 120.766,177.166 120.431,176.794 C120.095,176.422 119.816,176.003 119.595,175.536 C119.373,175.069 119.263,174.524 119.263,173.901 C119.263,172.859 119.562,172.059 120.161,171.503 C120.76,170.945 121.61,170.667 122.713,170.667 C123.168,170.667 123.575,170.745 123.935,170.9 C124.294,171.056 124.603,171.275 124.86,171.556 C125.117,171.837 125.327,172.169 125.489,172.553 C125.65,172.937 125.756,173.356 125.804,173.811 L123.684,174.044" id="Fill-39" fill="#101014"></path>
        <path d="M12.734,135.322 L27.85,135.322 L27.85,162.576 L23.382,162.576 L21.67,158.554 C20.229,160.293 18.84,161.521 17.499,162.241 C16.159,162.96 14.446,163.321 12.361,163.321 C8.638,163.321 5.647,162.08 3.388,159.597 C1.129,157.116 0,153.764 0,149.544 L0,121.843 C0,117.822 1.166,114.521 3.5,111.94 C5.833,109.359 9.184,108.067 13.553,108.067 C17.971,108.067 21.383,109.458 23.791,112.237 C26.198,115.018 27.403,118.543 27.403,122.811 L27.403,126.237 L18.616,126.237 C18.616,122.364 18.207,119.71 17.388,118.269 C16.568,116.83 15.215,116.109 13.329,116.109 C12.088,116.109 11.096,116.556 10.351,117.45 C9.606,118.343 9.233,119.859 9.233,121.992 L9.233,149.619 C9.233,151.406 9.568,152.796 10.239,153.789 C10.909,154.783 12.014,155.278 13.553,155.278 C15.389,155.278 16.692,154.708 17.462,153.565 C18.232,152.423 18.616,150.512 18.616,147.832 L18.616,142.619 L12.734,142.619 L12.734,135.322" id="Fill-40" fill="#101014"></path>
        <path d="M50.646,142.247 C46.971,144.332 44.477,146.156 43.161,147.72 C41.846,149.284 41.189,150.985 41.189,152.821 C41.189,155.253 42.479,156.469 45.061,156.469 C46.151,156.469 47.157,156.134 48.076,155.464 C48.994,154.794 49.851,153.889 50.646,152.746 L50.646,142.247 Z M33.443,135.339 C33.642,131.319 34.934,128.228 37.317,126.069 C39.699,123.91 42.875,122.83 46.848,122.83 C50.769,122.83 53.773,123.736 55.857,125.547 C57.943,127.36 58.985,130.078 58.985,133.701 L58.985,158.331 C58.985,159.076 59.135,160.368 59.432,162.204 L59.507,162.576 L51.539,162.576 C51.539,162.179 51.465,161.607 51.316,160.863 C51.216,160.267 51.141,159.796 51.092,159.449 C49.403,160.789 47.84,161.769 46.401,162.389 C44.96,163.01 43.274,163.321 41.337,163.321 C38.607,163.321 36.509,162.49 35.045,160.826 C33.58,159.164 32.848,156.991 32.848,154.31 C32.848,150.042 34.263,146.528 37.093,143.773 C39.923,141.018 44.439,138.474 50.646,136.14 L50.646,134.818 C50.646,131.393 49.279,129.68 46.55,129.68 C44.763,129.68 43.546,130.153 42.901,131.095 C42.256,132.039 41.883,133.454 41.784,135.339 L33.443,135.339 Z" id="Fill-41" fill="#101014"></path>
        <path d="M90.5,123.574 L90.5,162.576 L82.608,162.576 L82.608,158.554 L82.012,159.076 C80.175,160.665 78.648,161.769 77.432,162.389 C76.215,163.01 74.566,163.321 72.481,163.321 C70.295,163.321 68.582,162.576 67.342,161.086 C66.101,159.597 65.481,157.538 65.481,154.906 L65.481,123.574 L73.82,123.574 L73.82,153.565 C73.82,155.502 74.814,156.469 76.799,156.469 C77.593,156.469 78.387,156.259 79.182,155.836 C79.976,155.416 80.969,154.783 82.161,153.938 L82.161,123.574 L90.5,123.574" id="Fill-42" fill="#101014"></path>
        <polygon id="Fill-43" fill="#101014" points="96.698 162.576 105.039 162.576 105.039 112.84 96.698 112.84"></polygon>
        <path d="M125.771,129.364 L120.186,129.364" id="Fill-44" fill="#101014"></path>
        <path d="M125.771,122.513 L125.771,129.364" id="Fill-45" fill="#101014"></path>
        <path d="M120.186,122.513 L125.771,122.513" id="Fill-46" fill="#101014"></path>
        <path d="M106.261,129.364 L106.261,122.513 L111.846,122.513 L111.846,108.067 L120.186,108.067 L120.186,122.513 L125.771,122.513 L125.771,129.364 L120.186,129.364 L120.186,152.449 C120.186,154.633 121.129,155.725 123.016,155.725 L125.771,155.725 L125.771,162.874 C125.175,163.022 124.579,163.134 123.983,163.209 C123.388,163.283 122.594,163.321 121.601,163.321 C118.423,163.321 116.003,162.576 114.34,161.086 C112.677,159.597 111.846,157.338 111.846,154.31 L111.846,129.364 L106.261,129.364" id="Fill-47" fill="#101014"></path>
        <path d="M93.272,70.049 C87.435,81.9 75.241,90.057 61.139,90.057 C41.364,90.057 25.334,74.027 25.334,54.253 C25.334,34.478 41.364,18.448 61.139,18.448 C76.03,18.448 88.796,27.542 94.194,40.478 L113.089,40.478 C107.005,17.475 86.054,0.517 61.139,0.517 C31.461,0.517 7.402,24.576 7.402,54.253 C7.402,83.93 31.461,107.988 61.139,107.988 C84.587,107.988 104.525,92.967 111.861,72.024 L93.272,70.049" id="Fill-48" fill="#101014"></path>
        <polyline id="Fill-49" fill="#101014" points="116.759 64.858 57.849 60.105 125.686 60.105 116.759 64.858"></polyline>
        <polyline id="Fill-50" fill="#101014" points="120.871 57.356 54.742 53.224 129.798 53.224 120.871 57.356"></polyline>
        <path d="M107.562,81.332 L107.559,81.331 C107.616,81.233 107.673,81.134 107.73,81.035 C107.674,81.135 107.618,81.233 107.562,81.332 M109.925,76.799 C110.551,75.446 111.123,74.063 111.637,72.652 L111.641,72.653 C111.144,74.052 110.562,75.441 109.925,76.799 M91.929,72.524 C92.518,71.507 93.024,70.487 93.731,69.087 L104.619,71.255 L93.272,70.049 C92.856,70.893 92.408,71.719 91.929,72.524" id="Fill-51" fill="#101014"></path>
        <path d="M107.559,81.331 L90.033,75.395 C90.85,74.278 91.421,73.402 91.929,72.524 C92.408,71.719 92.856,70.893 93.272,70.049 L104.619,71.255 L111.637,72.652 C111.123,74.063 110.551,75.446 109.925,76.799 C109.243,78.255 108.499,79.675 107.73,81.035 C107.673,81.134 107.616,81.233 107.559,81.331" id="Fill-52" fill="#101014"></path>
        <polyline id="Fill-53" fill="#101014" points="111.546 72.982 60.955 66.985 120.474 66.985 111.546 72.982"></polyline>
        <path d="M111.846,129.364 L106.261,129.364" id="Fill-54" fill="#101014"></path>
        <path d="M111.846,122.513 L111.846,129.364" id="Fill-55" fill="#101014"></path>
    </g>
</svg>