<?xml version="1.0" encoding="UTF-8"?>
<svg width="1427px" height="378px" viewBox="0 0 1427 378" version="1.1" xmlns="http://www.w3.org/2000/svg" xmlns:xlink="http://www.w3.org/1999/xlink">
    <!-- Generator: Sketch 50.2 (55047) - http://www.bohemiancoding.com/sketch -->
    <title>nyc&amp;g-sponsor-eggersmann</title>
    <desc>Created with Sketch.</desc>
    <defs></defs>
    <g id="nyc&amp;g-sponsor-eggersmann" stroke="none" stroke-width="1" fill="none" fill-rule="evenodd">
        <path d="M88.499,54.36 C88.766,42.366 83.435,22.639 61.576,22.639 C41.317,22.639 32.786,41.034 31.454,54.36 L88.499,54.36 Z M31.454,77.285 C32.254,100.744 50.379,110.873 71.44,110.873 C86.634,110.873 97.295,108.475 107.425,105.007 L112.224,127.399 C101.027,132.197 85.566,135.664 66.906,135.664 C24.791,135.664 0,109.806 0,70.088 C0,34.103 21.858,0.248 63.442,0.248 C105.56,0.248 119.42,34.9 119.42,63.425 C119.42,69.555 118.885,74.354 118.354,77.285 L31.454,77.285 Z" id="Fill-1" fill="#101014"></path>
        <path d="M230.582,55.16 C230.582,51.96 230.315,49.029 229.516,46.365 C226.051,34.369 216.72,25.306 202.86,25.306 C184.465,25.306 170.871,41.299 170.871,67.688 C170.871,89.814 182.067,107.674 202.593,107.674 C214.854,107.674 225.517,99.677 229.248,87.68 C230.315,84.483 230.582,79.95 230.582,76.218 L230.582,55.16 Z M263.368,114.069 C263.368,141.259 257.771,160.719 244.176,172.979 C230.847,184.977 211.922,188.707 194.062,188.707 C177.536,188.707 159.943,184.977 148.746,178.313 L155.943,153.523 C164.208,158.319 178.069,163.385 193.797,163.385 C215.121,163.385 231.116,152.188 231.116,124.2 L231.116,113.005 L230.582,113.005 C223.117,124.466 210.056,132.197 192.729,132.197 C160.475,132.197 137.552,105.54 137.552,68.756 C137.552,26.106 165.273,0.248 196.461,0.248 C216.453,0.248 227.917,9.846 234.046,20.508 L234.581,20.508 L235.912,3.18 L264.435,3.18 C263.902,11.977 263.368,22.639 263.368,40.499 L263.368,114.069 Z" id="Fill-2" fill="#101014"></path>
        <path d="M383.332,55.16 C383.332,51.96 383.066,49.029 382.267,46.365 C378.8,34.369 369.472,25.306 355.607,25.306 C337.217,25.306 323.622,41.299 323.622,67.688 C323.622,89.814 334.816,107.674 355.342,107.674 C367.606,107.674 378.267,99.677 381.998,87.68 C383.066,84.483 383.332,79.95 383.332,76.218 L383.332,55.16 Z M416.119,114.069 C416.119,141.259 410.521,160.719 396.927,172.979 C383.599,184.977 364.672,188.707 346.813,188.707 C330.286,188.707 312.693,184.977 301.498,178.313 L308.695,153.523 C316.958,158.319 330.818,163.385 346.546,163.385 C367.872,163.385 383.865,152.188 383.865,124.2 L383.865,113.005 L383.332,113.005 C375.868,124.466 362.808,132.197 345.481,132.197 C313.227,132.197 290.301,105.54 290.301,68.756 C290.301,26.106 318.024,0.248 349.211,0.248 C369.202,0.248 380.666,9.846 386.798,20.508 L387.33,20.508 L388.664,3.18 L417.187,3.18 C416.652,11.977 416.119,22.639 416.119,40.499 L416.119,114.069 Z" id="Fill-3" fill="#101014"></path>
        <path d="M531.551,54.36 C531.817,42.366 526.485,22.639 504.625,22.639 C484.368,22.639 475.838,41.034 474.506,54.36 L531.551,54.36 Z M474.506,77.285 C475.305,100.744 493.43,110.873 514.489,110.873 C529.684,110.873 540.346,108.475 550.475,105.007 L555.272,127.399 C544.077,132.197 528.616,135.664 509.958,135.664 C467.84,135.664 443.051,109.806 443.051,70.088 C443.051,34.103 464.911,0.248 506.493,0.248 C548.608,0.248 562.471,34.9 562.471,63.425 C562.471,69.555 561.936,74.354 561.405,77.285 L474.506,77.285 Z" id="Fill-4" fill="#101014"></path>
        <path d="M588.866,45.03 C588.866,27.438 588.6,14.644 587.799,3.18 L616.053,3.18 L617.389,27.705 L618.188,27.705 C624.583,9.578 639.782,0.248 653.905,0.248 C657.104,0.248 658.973,0.516 661.635,1.048 L661.635,31.704 C658.704,31.169 655.774,30.904 651.772,30.904 C636.313,30.904 625.385,40.767 622.452,55.694 C621.92,58.626 621.653,62.09 621.653,65.557 L621.653,132.997 L588.866,132.997 L588.866,45.03" id="Fill-5" fill="#101014"></path>
        <path d="M682.434,102.608 C689.631,107.14 703.758,112.205 715.487,112.205 C729.883,112.205 736.28,106.075 736.28,97.545 C736.28,88.747 730.946,84.483 714.954,78.618 C689.631,70.088 679.235,56.227 679.235,40.767 C679.235,17.84 698.161,0.248 728.282,0.248 C742.676,0.248 755.204,3.715 762.934,7.978 L756.272,30.904 C750.94,27.705 740.276,23.439 728.815,23.439 C717.084,23.439 710.69,29.305 710.69,37.3 C710.69,45.565 716.821,49.297 733.344,55.428 C757.071,63.689 767.735,75.685 768,94.878 C768,118.604 749.606,135.664 715.221,135.664 C699.493,135.664 685.364,131.93 675.77,126.599 L682.434,102.608" id="Fill-6" fill="#101014"></path>
        <path d="M794.924,41.833 C794.924,26.905 794.393,14.377 793.862,3.18 L821.85,3.18 L823.45,22.374 L824.249,22.374 C830.381,12.245 842.106,0.248 864.231,0.248 C881.292,0.248 894.62,9.846 900.219,24.238 L900.752,24.238 C905.282,17.044 910.614,11.71 916.479,7.978 C923.942,2.915 932.206,0.248 943.133,0.248 C964.459,0.248 986.315,14.909 986.315,56.495 L986.315,132.997 L954.331,132.997 L954.331,61.29 C954.331,39.699 946.864,26.905 931.141,26.905 C919.944,26.905 911.682,34.9 908.215,44.23 C907.151,47.164 906.616,51.428 906.616,55.16 L906.616,132.997 L874.629,132.997 L874.629,57.826 C874.629,39.699 867.43,26.905 852.235,26.905 C839.975,26.905 831.711,36.499 828.514,45.297 C827.446,48.764 826.915,52.496 826.915,56.227 L826.915,132.997 L794.924,132.997 L794.924,41.833" id="Fill-7" fill="#101014"></path>
        <path d="M1089.76,69.555 C1066.57,69.288 1044.44,74.086 1044.44,93.813 C1044.44,106.606 1052.7,112.471 1063.1,112.471 C1076.43,112.471 1085.76,103.94 1088.96,94.614 C1089.76,92.214 1089.76,89.814 1089.76,87.415 L1089.76,69.555 Z M1121.74,101.809 C1121.74,113.538 1122.28,124.999 1123.88,132.997 L1094.29,132.997 L1091.89,118.604 L1091.09,118.604 C1083.36,128.733 1069.76,135.929 1052.7,135.929 C1026.58,135.929 1011.92,117.004 1011.92,97.277 C1011.92,64.757 1040.98,47.964 1088.96,48.229 L1088.96,46.098 C1088.96,37.568 1085.49,23.439 1062.57,23.439 C1049.77,23.439 1036.44,27.438 1027.65,33.036 L1021.25,11.71 C1030.85,5.847 1047.64,0.248 1068.16,0.248 C1109.75,0.248 1121.74,26.638 1121.74,55.16 L1121.74,101.809 Z" id="Fill-8" fill="#101014"></path>
        <path d="M1156.4,41.833 C1156.4,26.905 1155.87,14.377 1155.34,3.18 L1183.86,3.18 L1185.46,22.639 L1186.26,22.639 C1192.12,12.509 1206.25,0.248 1227.84,0.248 C1250.5,0.248 1273.96,14.909 1273.96,55.959 L1273.96,132.997 L1241.17,132.997 L1241.17,59.694 C1241.17,41.034 1234.24,26.905 1216.38,26.905 C1203.32,26.905 1194.25,36.235 1190.79,46.098 C1189.72,48.764 1189.19,52.76 1189.19,56.495 L1189.19,132.997 L1156.4,132.997 L1156.4,41.833" id="Fill-9" fill="#101014"></path>
        <path d="M1308.88,41.833 C1308.88,26.905 1308.35,14.377 1307.82,3.18 L1336.34,3.18 L1337.94,22.639 L1338.74,22.639 C1344.6,12.509 1358.73,0.248 1380.32,0.248 C1402.98,0.248 1426.44,14.909 1426.44,55.959 L1426.44,132.997 L1393.65,132.997 L1393.65,59.694 C1393.65,41.034 1386.72,26.905 1368.86,26.905 C1355.8,26.905 1346.73,36.235 1343.27,46.098 C1342.2,48.764 1341.67,52.76 1341.67,56.495 L1341.67,132.997 L1308.88,132.997 L1308.88,41.833" id="Fill-10" fill="#101014"></path>
        <path d="M0,237.574 L13.221,237.574 L13.221,286.967 L13.677,286.967 C16.413,283.012 19.149,279.368 21.731,276.026 L53.039,237.574 L69.454,237.574 L32.372,281.038 L72.343,340.006 L56.688,340.006 L23.1,289.7 L13.221,300.948 L13.221,340.006 L0,340.006 L0,237.574" id="Fill-11" fill="#101014"></path>
        <path d="M83.435,340.006 L96.807,340.006 L96.807,266.448 L83.435,266.448 L83.435,340.006 Z M98.329,245.782 C98.329,250.336 95.137,253.987 89.819,253.987 C84.956,253.987 81.763,250.336 81.763,245.782 C81.763,241.219 85.106,237.421 90.123,237.421 C94.986,237.421 98.329,241.067 98.329,245.782 Z" id="Fill-12" fill="#101014"></path>
        <path d="M135.107,248.821 L135.107,266.448 L154.255,266.448 L154.255,276.629 L135.107,276.629 L135.107,316.299 C135.107,325.416 137.691,330.584 145.138,330.584 C148.785,330.584 150.913,330.28 152.888,329.67 L153.496,339.854 C150.913,340.766 146.809,341.678 141.641,341.678 C135.411,341.678 130.396,339.551 127.205,336.055 C123.558,331.952 122.037,325.416 122.037,316.752 L122.037,276.629 L110.637,276.629 L110.637,266.448 L122.037,266.448 L122.037,252.769 L135.107,248.821" id="Fill-13" fill="#101014"></path>
        <path d="M220.825,337.424 C217.328,339.096 209.578,341.678 199.699,341.678 C177.51,341.678 163.07,326.635 163.07,304.141 C163.07,281.495 178.574,264.928 202.586,264.928 C210.488,264.928 217.481,266.905 221.127,268.879 L218.087,279.061 C214.897,277.392 209.882,275.567 202.586,275.567 C185.717,275.567 176.598,288.182 176.598,303.377 C176.598,320.401 187.541,330.889 202.131,330.889 C209.729,330.889 214.745,329.063 218.544,327.393 L220.825,337.424" id="Fill-14" fill="#101014"></path>
        <path d="M236.477,232.102 L249.851,232.102 L249.851,278.151 L250.155,278.151 C252.283,274.35 255.629,270.857 259.731,268.578 C263.683,266.299 268.393,264.928 273.41,264.928 C283.289,264.928 299.093,271.008 299.093,296.237 L299.093,340.006 L285.719,340.006 L285.719,297.756 C285.719,285.901 281.312,276.026 268.697,276.026 C260.033,276.026 253.347,282.104 250.766,289.245 C250.004,291.221 249.851,293.198 249.851,295.629 L249.851,340.006 L236.477,340.006 L236.477,232.102" id="Fill-15" fill="#101014"></path>
        <path d="M367.483,296.082 C367.636,287.727 363.988,274.505 348.942,274.505 C335.264,274.505 329.49,286.813 328.425,296.082 L367.483,296.082 Z M328.274,305.661 C328.577,323.743 339.976,331.192 353.502,331.192 C363.079,331.192 369.003,329.524 373.867,327.393 L376.299,336.967 C371.587,339.096 363.38,341.678 351.678,341.678 C329.033,341.678 315.507,326.635 315.507,304.444 C315.507,282.256 328.577,264.928 350.006,264.928 C374.172,264.928 380.402,285.901 380.402,299.428 C380.402,302.166 380.25,304.141 379.946,305.661 L328.274,305.661 Z" id="Fill-16" fill="#101014"></path>
        <path d="M396.967,286.358 C396.967,278.607 396.816,272.529 396.359,266.448 L408.213,266.448 L408.974,278.607 L409.278,278.607 C412.926,271.766 421.435,264.928 433.594,264.928 C443.776,264.928 459.583,271.008 459.583,296.237 L459.583,340.006 L446.208,340.006 L446.208,297.604 C446.208,285.75 441.802,275.872 429.187,275.872 C420.526,275.872 413.685,282.104 411.252,289.551 C410.646,291.221 410.342,293.504 410.342,295.782 L410.342,340.006 L396.967,340.006 L396.967,286.358" id="Fill-17" fill="#101014"></path>
        <path d="M479.493,326.479 C483.594,328.913 490.586,331.645 497.274,331.645 C506.848,331.645 511.409,326.938 511.409,320.707 C511.409,314.321 507.608,310.979 497.881,307.332 C484.506,302.469 478.276,295.325 478.276,286.51 C478.276,274.655 488.004,264.928 503.657,264.928 C511.104,264.928 517.639,266.905 521.592,269.489 L518.399,279.215 C515.51,277.392 510.194,274.808 503.354,274.808 C495.45,274.808 491.194,279.368 491.194,284.836 C491.194,290.918 495.45,293.651 505.024,297.454 C517.639,302.166 524.325,308.547 524.325,319.491 C524.325,332.559 514.143,341.678 496.969,341.678 C488.917,341.678 481.467,339.551 476.299,336.508 L479.493,326.479" id="Fill-18" fill="#101014"></path>
        <polygon id="Fill-20" fill="#101014" points="575.694 377.94 585.875 377.94 585.875 226.021 575.694 226.021"></polygon>
        <polyline id="Fill-22" fill="#101014" points="655.938 237.574 655.938 280.428 705.481 280.428 705.481 237.574 718.858 237.574 718.858 340.006 705.481 340.006 705.481 291.981 655.938 291.981 655.938 340.006 642.565 340.006 642.565 237.574 655.938 237.574"></polyline>
        <path d="M749.709,303.377 C749.709,319.491 758.827,331.645 771.897,331.645 C784.665,331.645 794.239,319.641 794.239,303.077 C794.239,290.614 788.006,274.959 772.202,274.959 C756.547,274.959 749.709,289.551 749.709,303.377 Z M807.915,302.62 C807.915,329.825 788.918,341.678 771.29,341.678 C751.532,341.678 736.03,327.092 736.03,303.836 C736.03,279.368 752.293,264.928 772.504,264.928 C793.631,264.928 807.915,280.28 807.915,302.62 Z" id="Fill-23" fill="#101014"></path>
        <path d="M824.786,286.358 C824.786,278.607 824.483,272.529 824.176,266.448 L835.877,266.448 L836.487,278.456 L836.944,278.456 C841.047,271.463 847.887,264.928 860.194,264.928 C870.075,264.928 877.674,271.008 880.866,279.671 L881.168,279.671 C883.452,275.416 886.489,272.375 889.53,270.096 C893.934,266.753 898.647,264.928 905.639,264.928 C915.518,264.928 929.956,271.311 929.956,296.846 L929.956,340.006 L916.885,340.006 L916.885,298.514 C916.885,284.231 911.567,275.872 900.928,275.872 C893.178,275.872 887.399,281.495 884.967,287.875 C884.364,289.854 883.905,292.133 883.905,294.565 L883.905,340.006 L870.836,340.006 L870.836,295.936 C870.836,284.231 865.667,275.872 855.487,275.872 C847.278,275.872 841.047,282.559 838.918,289.245 C838.161,291.071 837.856,293.504 837.856,295.782 L837.856,340.006 L824.786,340.006 L824.786,286.358" id="Fill-24" fill="#101014"></path>
        <path d="M998.196,296.082 C998.348,287.727 994.7,274.505 979.653,274.505 C965.975,274.505 960.2,286.813 959.137,296.082 L998.196,296.082 Z M958.985,305.661 C959.288,323.743 970.688,331.192 984.215,331.192 C993.788,331.192 999.715,329.524 1004.58,327.393 L1007.01,336.967 C1002.3,339.096 994.092,341.678 982.391,341.678 C959.745,341.678 946.219,326.635 946.219,304.444 C946.219,282.256 959.288,264.928 980.717,264.928 C1004.88,264.928 1011.12,285.901 1011.12,299.428 C1011.12,302.166 1010.96,304.141 1010.66,305.661 L958.985,305.661 Z" id="Fill-25" fill="#101014"></path>
        <polyline id="Fill-26" fill="#101014" points="1060.2 237.574 1073.57 237.574 1073.57 328.913 1117.35 328.913 1117.35 340.006 1060.2 340.006 1060.2 237.574"></polyline>
        <path d="M1131.63,340.006 L1145,340.006 L1145,266.448 L1131.63,266.448 L1131.63,340.006 Z M1146.53,245.782 C1146.53,250.336 1143.33,253.987 1138.01,253.987 C1133.15,253.987 1129.96,250.336 1129.96,245.782 C1129.96,241.219 1133.3,237.421 1138.32,237.421 C1143.18,237.421 1146.53,241.067 1146.53,245.782 Z" id="Fill-27" fill="#101014"></path>
        <path d="M1172.36,266.448 L1186.8,307.637 C1189.23,314.473 1191.21,320.553 1192.73,326.635 L1193.18,326.635 C1194.85,320.553 1196.98,314.473 1199.41,307.637 L1213.7,266.448 L1227.68,266.448 L1198.81,340.006 L1186.04,340.006 L1158.07,266.448 L1172.36,266.448" id="Fill-28" fill="#101014"></path>
        <path d="M1240.29,340.006 L1253.67,340.006 L1253.67,266.448 L1240.29,266.448 L1240.29,340.006 Z M1255.19,245.782 C1255.19,250.336 1252,253.987 1246.68,253.987 C1241.81,253.987 1238.62,250.336 1238.62,245.782 C1238.62,241.219 1241.97,237.421 1246.98,237.421 C1251.84,237.421 1255.19,241.067 1255.19,245.782 Z" id="Fill-29" fill="#101014"></path>
        <path d="M1275.86,286.358 C1275.86,278.607 1275.71,272.529 1275.25,266.448 L1287.1,266.448 L1287.86,278.607 L1288.17,278.607 C1291.81,271.766 1300.33,264.928 1312.48,264.928 C1322.67,264.928 1338.47,271.008 1338.47,296.237 L1338.47,340.006 L1325.1,340.006 L1325.1,297.604 C1325.1,285.75 1320.69,275.872 1308.08,275.872 C1299.41,275.872 1292.58,282.104 1290.14,289.551 C1289.54,291.221 1289.23,293.504 1289.23,295.782 L1289.23,340.006 L1275.86,340.006 L1275.86,286.358" id="Fill-30" fill="#101014"></path>
        <path d="M1409.75,295.479 C1409.75,293.198 1409.6,291.221 1408.99,289.551 C1406.56,281.647 1400.17,275.262 1390.3,275.262 C1377.53,275.262 1368.41,286.055 1368.41,303.077 C1368.41,317.512 1375.86,329.524 1390.15,329.524 C1398.5,329.524 1405.95,324.354 1408.69,315.842 C1409.45,313.563 1409.75,310.979 1409.75,308.7 L1409.75,295.479 Z M1423.12,329.215 C1423.12,346.237 1419.63,356.42 1412.64,362.956 C1405.34,369.489 1395.01,371.77 1385.74,371.77 C1376.92,371.77 1367.2,369.643 1361.27,365.692 L1364.61,355.356 C1369.48,358.551 1377.07,361.284 1386.19,361.284 C1399.87,361.284 1409.9,354.141 1409.9,335.446 L1409.9,327.393 L1409.6,327.393 C1405.65,334.233 1397.59,339.704 1386.19,339.704 C1367.96,339.704 1354.88,324.2 1354.88,303.836 C1354.88,278.913 1371.15,264.928 1388.17,264.928 C1400.93,264.928 1407.77,271.463 1411.12,277.541 L1411.42,277.541 L1411.88,266.448 L1423.73,266.448 C1423.28,271.617 1423.12,277.695 1423.12,286.51 L1423.12,329.215 Z" id="Fill-31" fill="#101014"></path>
    </g>
</svg>