{
  "aya": [
    {
      "index": "1",
      "text": "الر ۚ كِتـٰبٌ أُحكِمَت ءايـٰتُهُ ثُمَّ فُصِّلَت مِن لَدُن حَكيمٍ خَبيرٍ",
      "bismillah": "بِسمِ اللَّهِ الرَّحمـٰنِ الرَّحيمِ"
    },
    {
      "index": "2",
      "text": "أَلّا تَعبُدوا إِلَّا اللَّهَ ۚ إِنَّنى لَكُم مِنهُ نَذيرٌ وَبَشيرٌ"
    },
    {
      "index": "3",
      "text": "وَأَنِ استَغفِروا رَبَّكُم ثُمَّ توبوا إِلَيهِ يُمَتِّعكُم مَتـٰعًا حَسَنًا إِلىٰ أَجَلٍ مُسَمًّى وَيُؤتِ كُلَّ ذى فَضلٍ فَضلَهُ ۖ وَإِن تَوَلَّوا فَإِنّى أَخافُ عَلَيكُم عَذابَ يَومٍ كَبيرٍ"
    },
    {
      "index": "4",
      "text": "إِلَى اللَّهِ مَرجِعُكُم ۖ وَهُوَ عَلىٰ كُلِّ شَىءٍ قَديرٌ"
    },
    {
      "index": "5",
      "text": "أَلا إِنَّهُم يَثنونَ صُدورَهُم لِيَستَخفوا مِنهُ ۚ أَلا حينَ يَستَغشونَ ثِيابَهُم يَعلَمُ ما يُسِرّونَ وَما يُعلِنونَ ۚ إِنَّهُ عَليمٌ بِذاتِ الصُّدورِ"
    },
    {
      "index": "6",
      "text": "۞ وَما مِن دابَّةٍ فِى الأَرضِ إِلّا عَلَى اللَّهِ رِزقُها وَيَعلَمُ مُستَقَرَّها وَمُستَودَعَها ۚ كُلٌّ فى كِتـٰبٍ مُبينٍ"
    },
    {
      "index": "7",
      "text": "وَهُوَ الَّذى خَلَقَ السَّمـٰوٰتِ وَالأَرضَ فى سِتَّةِ أَيّامٍ وَكانَ عَرشُهُ عَلَى الماءِ لِيَبلُوَكُم أَيُّكُم أَحسَنُ عَمَلًا ۗ وَلَئِن قُلتَ إِنَّكُم مَبعوثونَ مِن بَعدِ المَوتِ لَيَقولَنَّ الَّذينَ كَفَروا إِن هـٰذا إِلّا سِحرٌ مُبينٌ"
    },
    {
      "index": "8",
      "text": "وَلَئِن أَخَّرنا عَنهُمُ العَذابَ إِلىٰ أُمَّةٍ مَعدودَةٍ لَيَقولُنَّ ما يَحبِسُهُ ۗ أَلا يَومَ يَأتيهِم لَيسَ مَصروفًا عَنهُم وَحاقَ بِهِم ما كانوا بِهِ يَستَهزِءونَ"
    },
    {
      "index": "9",
      "text": "وَلَئِن أَذَقنَا الإِنسـٰنَ مِنّا رَحمَةً ثُمَّ نَزَعنـٰها مِنهُ إِنَّهُ لَيَـٔوسٌ كَفورٌ"
    },
    {
      "index": "10",
      "text": "وَلَئِن أَذَقنـٰهُ نَعماءَ بَعدَ ضَرّاءَ مَسَّتهُ لَيَقولَنَّ ذَهَبَ السَّيِّـٔاتُ عَنّى ۚ إِنَّهُ لَفَرِحٌ فَخورٌ"
    },
    {
      "index": "11",
      "text": "إِلَّا الَّذينَ صَبَروا وَعَمِلُوا الصّـٰلِحـٰتِ أُولـٰئِكَ لَهُم مَغفِرَةٌ وَأَجرٌ كَبيرٌ"
    },
    {
      "index": "12",
      "text": "فَلَعَلَّكَ تارِكٌ بَعضَ ما يوحىٰ إِلَيكَ وَضائِقٌ بِهِ صَدرُكَ أَن يَقولوا لَولا أُنزِلَ عَلَيهِ كَنزٌ أَو جاءَ مَعَهُ مَلَكٌ ۚ إِنَّما أَنتَ نَذيرٌ ۚ وَاللَّهُ عَلىٰ كُلِّ شَىءٍ وَكيلٌ"
    },
    {
      "index": "13",
      "text": "أَم يَقولونَ افتَرىٰهُ ۖ قُل فَأتوا بِعَشرِ سُوَرٍ مِثلِهِ مُفتَرَيـٰتٍ وَادعوا مَنِ استَطَعتُم مِن دونِ اللَّهِ إِن كُنتُم صـٰدِقينَ"
    },
    {
      "index": "14",
      "text": "فَإِلَّم يَستَجيبوا لَكُم فَاعلَموا أَنَّما أُنزِلَ بِعِلمِ اللَّهِ وَأَن لا إِلـٰهَ إِلّا هُوَ ۖ فَهَل أَنتُم مُسلِمونَ"
    },
    {
      "index": "15",
      "text": "مَن كانَ يُريدُ الحَيوٰةَ الدُّنيا وَزينَتَها نُوَفِّ إِلَيهِم أَعمـٰلَهُم فيها وَهُم فيها لا يُبخَسونَ"
    },
    {
      "index": "16",
      "text": "أُولـٰئِكَ الَّذينَ لَيسَ لَهُم فِى الـٔاخِرَةِ إِلَّا النّارُ ۖ وَحَبِطَ ما صَنَعوا فيها وَبـٰطِلٌ ما كانوا يَعمَلونَ"
    },
    {
      "index": "17",
      "text": "أَفَمَن كانَ عَلىٰ بَيِّنَةٍ مِن رَبِّهِ وَيَتلوهُ شاهِدٌ مِنهُ وَمِن قَبلِهِ كِتـٰبُ موسىٰ إِمامًا وَرَحمَةً ۚ أُولـٰئِكَ يُؤمِنونَ بِهِ ۚ وَمَن يَكفُر بِهِ مِنَ الأَحزابِ فَالنّارُ مَوعِدُهُ ۚ فَلا تَكُ فى مِريَةٍ مِنهُ ۚ إِنَّهُ الحَقُّ مِن رَبِّكَ وَلـٰكِنَّ أَكثَرَ النّاسِ لا يُؤمِنونَ"
    },
    {
      "index": "18",
      "text": "وَمَن أَظلَمُ مِمَّنِ افتَرىٰ عَلَى اللَّهِ كَذِبًا ۚ أُولـٰئِكَ يُعرَضونَ عَلىٰ رَبِّهِم وَيَقولُ الأَشهـٰدُ هـٰؤُلاءِ الَّذينَ كَذَبوا عَلىٰ رَبِّهِم ۚ أَلا لَعنَةُ اللَّهِ عَلَى الظّـٰلِمينَ"
    },
    {
      "index": "19",
      "text": "الَّذينَ يَصُدّونَ عَن سَبيلِ اللَّهِ وَيَبغونَها عِوَجًا وَهُم بِالـٔاخِرَةِ هُم كـٰفِرونَ"
    },
    {
      "index": "20",
      "text": "أُولـٰئِكَ لَم يَكونوا مُعجِزينَ فِى الأَرضِ وَما كانَ لَهُم مِن دونِ اللَّهِ مِن أَولِياءَ ۘ يُضـٰعَفُ لَهُمُ العَذابُ ۚ ما كانوا يَستَطيعونَ السَّمعَ وَما كانوا يُبصِرونَ"
    },
    {
      "index": "21",
      "text": "أُولـٰئِكَ الَّذينَ خَسِروا أَنفُسَهُم وَضَلَّ عَنهُم ما كانوا يَفتَرونَ"
    },
    {
      "index": "22",
      "text": "لا جَرَمَ أَنَّهُم فِى الـٔاخِرَةِ هُمُ الأَخسَرونَ"
    },
    {
      "index": "23",
      "text": "إِنَّ الَّذينَ ءامَنوا وَعَمِلُوا الصّـٰلِحـٰتِ وَأَخبَتوا إِلىٰ رَبِّهِم أُولـٰئِكَ أَصحـٰبُ الجَنَّةِ ۖ هُم فيها خـٰلِدونَ"
    },
    {
      "index": "24",
      "text": "۞ مَثَلُ الفَريقَينِ كَالأَعمىٰ وَالأَصَمِّ وَالبَصيرِ وَالسَّميعِ ۚ هَل يَستَوِيانِ مَثَلًا ۚ أَفَلا تَذَكَّرونَ"
    },
    {
      "index": "25",
      "text": "وَلَقَد أَرسَلنا نوحًا إِلىٰ قَومِهِ إِنّى لَكُم نَذيرٌ مُبينٌ"
    },
    {
      "index": "26",
      "text": "أَن لا تَعبُدوا إِلَّا اللَّهَ ۖ إِنّى أَخافُ عَلَيكُم عَذابَ يَومٍ أَليمٍ"
    },
    {
      "index": "27",
      "text": "فَقالَ المَلَأُ الَّذينَ كَفَروا مِن قَومِهِ ما نَرىٰكَ إِلّا بَشَرًا مِثلَنا وَما نَرىٰكَ اتَّبَعَكَ إِلَّا الَّذينَ هُم أَراذِلُنا بادِىَ الرَّأىِ وَما نَرىٰ لَكُم عَلَينا مِن فَضلٍ بَل نَظُنُّكُم كـٰذِبينَ"
    },
    {
      "index": "28",
      "text": "قالَ يـٰقَومِ أَرَءَيتُم إِن كُنتُ عَلىٰ بَيِّنَةٍ مِن رَبّى وَءاتىٰنى رَحمَةً مِن عِندِهِ فَعُمِّيَت عَلَيكُم أَنُلزِمُكُموها وَأَنتُم لَها كـٰرِهونَ"
    },
    {
      "index": "29",
      "text": "وَيـٰقَومِ لا أَسـَٔلُكُم عَلَيهِ مالًا ۖ إِن أَجرِىَ إِلّا عَلَى اللَّهِ ۚ وَما أَنا۠ بِطارِدِ الَّذينَ ءامَنوا ۚ إِنَّهُم مُلـٰقوا رَبِّهِم وَلـٰكِنّى أَرىٰكُم قَومًا تَجهَلونَ"
    },
    {
      "index": "30",
      "text": "وَيـٰقَومِ مَن يَنصُرُنى مِنَ اللَّهِ إِن طَرَدتُهُم ۚ أَفَلا تَذَكَّرونَ"
    },
    {
      "index": "31",
      "text": "وَلا أَقولُ لَكُم عِندى خَزائِنُ اللَّهِ وَلا أَعلَمُ الغَيبَ وَلا أَقولُ إِنّى مَلَكٌ وَلا أَقولُ لِلَّذينَ تَزدَرى أَعيُنُكُم لَن يُؤتِيَهُمُ اللَّهُ خَيرًا ۖ اللَّهُ أَعلَمُ بِما فى أَنفُسِهِم ۖ إِنّى إِذًا لَمِنَ الظّـٰلِمينَ"
    },
    {
      "index": "32",
      "text": "قالوا يـٰنوحُ قَد جـٰدَلتَنا فَأَكثَرتَ جِدٰلَنا فَأتِنا بِما تَعِدُنا إِن كُنتَ مِنَ الصّـٰدِقينَ"
    },
    {
      "index": "33",
      "text": "قالَ إِنَّما يَأتيكُم بِهِ اللَّهُ إِن شاءَ وَما أَنتُم بِمُعجِزينَ"
    },
    {
      "index": "34",
      "text": "وَلا يَنفَعُكُم نُصحى إِن أَرَدتُ أَن أَنصَحَ لَكُم إِن كانَ اللَّهُ يُريدُ أَن يُغوِيَكُم ۚ هُوَ رَبُّكُم وَإِلَيهِ تُرجَعونَ"
    },
    {
      "index": "35",
      "text": "أَم يَقولونَ افتَرىٰهُ ۖ قُل إِنِ افتَرَيتُهُ فَعَلَىَّ إِجرامى وَأَنا۠ بَرىءٌ مِمّا تُجرِمونَ"
    },
    {
      "index": "36",
      "text": "وَأوحِىَ إِلىٰ نوحٍ أَنَّهُ لَن يُؤمِنَ مِن قَومِكَ إِلّا مَن قَد ءامَنَ فَلا تَبتَئِس بِما كانوا يَفعَلونَ"
    },
    {
      "index": "37",
      "text": "وَاصنَعِ الفُلكَ بِأَعيُنِنا وَوَحيِنا وَلا تُخـٰطِبنى فِى الَّذينَ ظَلَموا ۚ إِنَّهُم مُغرَقونَ"
    },
    {
      "index": "38",
      "text": "وَيَصنَعُ الفُلكَ وَكُلَّما مَرَّ عَلَيهِ مَلَأٌ مِن قَومِهِ سَخِروا مِنهُ ۚ قالَ إِن تَسخَروا مِنّا فَإِنّا نَسخَرُ مِنكُم كَما تَسخَرونَ"
    },
    {
      "index": "39",
      "text": "فَسَوفَ تَعلَمونَ مَن يَأتيهِ عَذابٌ يُخزيهِ وَيَحِلُّ عَلَيهِ عَذابٌ مُقيمٌ"
    },
    {
      "index": "40",
      "text": "حَتّىٰ إِذا جاءَ أَمرُنا وَفارَ التَّنّورُ قُلنَا احمِل فيها مِن كُلٍّ زَوجَينِ اثنَينِ وَأَهلَكَ إِلّا مَن سَبَقَ عَلَيهِ القَولُ وَمَن ءامَنَ ۚ وَما ءامَنَ مَعَهُ إِلّا قَليلٌ"
    },
    {
      "index": "41",
      "text": "۞ وَقالَ اركَبوا فيها بِسمِ اللَّهِ مَجر۪ىٰها وَمُرسىٰها ۚ إِنَّ رَبّى لَغَفورٌ رَحيمٌ"
    },
    {
      "index": "42",
      "text": "وَهِىَ تَجرى بِهِم فى مَوجٍ كَالجِبالِ وَنادىٰ نوحٌ ابنَهُ وَكانَ فى مَعزِلٍ يـٰبُنَىَّ اركَب مَعَنا وَلا تَكُن مَعَ الكـٰفِرينَ"
    },
    {
      "index": "43",
      "text": "قالَ سَـٔاوى إِلىٰ جَبَلٍ يَعصِمُنى مِنَ الماءِ ۚ قالَ لا عاصِمَ اليَومَ مِن أَمرِ اللَّهِ إِلّا مَن رَحِمَ ۚ وَحالَ بَينَهُمَا المَوجُ فَكانَ مِنَ المُغرَقينَ"
    },
    {
      "index": "44",
      "text": "وَقيلَ يـٰأَرضُ ابلَعى ماءَكِ وَيـٰسَماءُ أَقلِعى وَغيضَ الماءُ وَقُضِىَ الأَمرُ وَاستَوَت عَلَى الجودِىِّ ۖ وَقيلَ بُعدًا لِلقَومِ الظّـٰلِمينَ"
    },
    {
      "index": "45",
      "text": "وَنادىٰ نوحٌ رَبَّهُ فَقالَ رَبِّ إِنَّ ابنى مِن أَهلى وَإِنَّ وَعدَكَ الحَقُّ وَأَنتَ أَحكَمُ الحـٰكِمينَ"
    },
    {
      "index": "46",
      "text": "قالَ يـٰنوحُ إِنَّهُ لَيسَ مِن أَهلِكَ ۖ إِنَّهُ عَمَلٌ غَيرُ صـٰلِحٍ ۖ فَلا تَسـَٔلنِ ما لَيسَ لَكَ بِهِ عِلمٌ ۖ إِنّى أَعِظُكَ أَن تَكونَ مِنَ الجـٰهِلينَ"
    },
    {
      "index": "47",
      "text": "قالَ رَبِّ إِنّى أَعوذُ بِكَ أَن أَسـَٔلَكَ ما لَيسَ لى بِهِ عِلمٌ ۖ وَإِلّا تَغفِر لى وَتَرحَمنى أَكُن مِنَ الخـٰسِرينَ"
    },
    {
      "index": "48",
      "text": "قيلَ يـٰنوحُ اهبِط بِسَلـٰمٍ مِنّا وَبَرَكـٰتٍ عَلَيكَ وَعَلىٰ أُمَمٍ مِمَّن مَعَكَ ۚ وَأُمَمٌ سَنُمَتِّعُهُم ثُمَّ يَمَسُّهُم مِنّا عَذابٌ أَليمٌ"
    },
    {
      "index": "49",
      "text": "تِلكَ مِن أَنباءِ الغَيبِ نوحيها إِلَيكَ ۖ ما كُنتَ تَعلَمُها أَنتَ وَلا قَومُكَ مِن قَبلِ هـٰذا ۖ فَاصبِر ۖ إِنَّ العـٰقِبَةَ لِلمُتَّقينَ"
    },
    {
      "index": "50",
      "text": "وَإِلىٰ عادٍ أَخاهُم هودًا ۚ قالَ يـٰقَومِ اعبُدُوا اللَّهَ ما لَكُم مِن إِلـٰهٍ غَيرُهُ ۖ إِن أَنتُم إِلّا مُفتَرونَ"
    },
    {
      "index": "51",
      "text": "يـٰقَومِ لا أَسـَٔلُكُم عَلَيهِ أَجرًا ۖ إِن أَجرِىَ إِلّا عَلَى الَّذى فَطَرَنى ۚ أَفَلا تَعقِلونَ"
    },
    {
      "index": "52",
      "text": "وَيـٰقَومِ استَغفِروا رَبَّكُم ثُمَّ توبوا إِلَيهِ يُرسِلِ السَّماءَ عَلَيكُم مِدرارًا وَيَزِدكُم قُوَّةً إِلىٰ قُوَّتِكُم وَلا تَتَوَلَّوا مُجرِمينَ"
    },
    {
      "index": "53",
      "text": "قالوا يـٰهودُ ما جِئتَنا بِبَيِّنَةٍ وَما نَحنُ بِتارِكى ءالِهَتِنا عَن قَولِكَ وَما نَحنُ لَكَ بِمُؤمِنينَ"
    },
    {
      "index": "54",
      "text": "إِن نَقولُ إِلَّا اعتَرىٰكَ بَعضُ ءالِهَتِنا بِسوءٍ ۗ قالَ إِنّى أُشهِدُ اللَّهَ وَاشهَدوا أَنّى بَرىءٌ مِمّا تُشرِكونَ"
    },
    {
      "index": "55",
      "text": "مِن دونِهِ ۖ فَكيدونى جَميعًا ثُمَّ لا تُنظِرونِ"
    },
    {
      "index": "56",
      "text": "إِنّى تَوَكَّلتُ عَلَى اللَّهِ رَبّى وَرَبِّكُم ۚ ما مِن دابَّةٍ إِلّا هُوَ ءاخِذٌ بِناصِيَتِها ۚ إِنَّ رَبّى عَلىٰ صِرٰطٍ مُستَقيمٍ"
    },
    {
      "index": "57",
      "text": "فَإِن تَوَلَّوا فَقَد أَبلَغتُكُم ما أُرسِلتُ بِهِ إِلَيكُم ۚ وَيَستَخلِفُ رَبّى قَومًا غَيرَكُم وَلا تَضُرّونَهُ شَيـًٔا ۚ إِنَّ رَبّى عَلىٰ كُلِّ شَىءٍ حَفيظٌ"
    },
    {
      "index": "58",
      "text": "وَلَمّا جاءَ أَمرُنا نَجَّينا هودًا وَالَّذينَ ءامَنوا مَعَهُ بِرَحمَةٍ مِنّا وَنَجَّينـٰهُم مِن عَذابٍ غَليظٍ"
    },
    {
      "index": "59",
      "text": "وَتِلكَ عادٌ ۖ جَحَدوا بِـٔايـٰتِ رَبِّهِم وَعَصَوا رُسُلَهُ وَاتَّبَعوا أَمرَ كُلِّ جَبّارٍ عَنيدٍ"
    },
    {
      "index": "60",
      "text": "وَأُتبِعوا فى هـٰذِهِ الدُّنيا لَعنَةً وَيَومَ القِيـٰمَةِ ۗ أَلا إِنَّ عادًا كَفَروا رَبَّهُم ۗ أَلا بُعدًا لِعادٍ قَومِ هودٍ"
    },
    {
      "index": "61",
      "text": "۞ وَإِلىٰ ثَمودَ أَخاهُم صـٰلِحًا ۚ قالَ يـٰقَومِ اعبُدُوا اللَّهَ ما لَكُم مِن إِلـٰهٍ غَيرُهُ ۖ هُوَ أَنشَأَكُم مِنَ الأَرضِ وَاستَعمَرَكُم فيها فَاستَغفِروهُ ثُمَّ توبوا إِلَيهِ ۚ إِنَّ رَبّى قَريبٌ مُجيبٌ"
    },
    {
      "index": "62",
      "text": "قالوا يـٰصـٰلِحُ قَد كُنتَ فينا مَرجُوًّا قَبلَ هـٰذا ۖ أَتَنهىٰنا أَن نَعبُدَ ما يَعبُدُ ءاباؤُنا وَإِنَّنا لَفى شَكٍّ مِمّا تَدعونا إِلَيهِ مُريبٍ"
    },
    {
      "index": "63",
      "text": "قالَ يـٰقَومِ أَرَءَيتُم إِن كُنتُ عَلىٰ بَيِّنَةٍ مِن رَبّى وَءاتىٰنى مِنهُ رَحمَةً فَمَن يَنصُرُنى مِنَ اللَّهِ إِن عَصَيتُهُ ۖ فَما تَزيدونَنى غَيرَ تَخسيرٍ"
    },
    {
      "index": "64",
      "text": "وَيـٰقَومِ هـٰذِهِ ناقَةُ اللَّهِ لَكُم ءايَةً فَذَروها تَأكُل فى أَرضِ اللَّهِ وَلا تَمَسّوها بِسوءٍ فَيَأخُذَكُم عَذابٌ قَريبٌ"
    },
    {
      "index": "65",
      "text": "فَعَقَروها فَقالَ تَمَتَّعوا فى دارِكُم ثَلـٰثَةَ أَيّامٍ ۖ ذٰلِكَ وَعدٌ غَيرُ مَكذوبٍ"
    },
    {
      "index": "66",
      "text": "فَلَمّا جاءَ أَمرُنا نَجَّينا صـٰلِحًا وَالَّذينَ ءامَنوا مَعَهُ بِرَحمَةٍ مِنّا وَمِن خِزىِ يَومِئِذٍ ۗ إِنَّ رَبَّكَ هُوَ القَوِىُّ العَزيزُ"
    },
    {
      "index": "67",
      "text": "وَأَخَذَ الَّذينَ ظَلَمُوا الصَّيحَةُ فَأَصبَحوا فى دِيـٰرِهِم جـٰثِمينَ"
    },
    {
      "index": "68",
      "text": "كَأَن لَم يَغنَوا فيها ۗ أَلا إِنَّ ثَمودَا۟ كَفَروا رَبَّهُم ۗ أَلا بُعدًا لِثَمودَ"
    },
    {
      "index": "69",
      "text": "وَلَقَد جاءَت رُسُلُنا إِبرٰهيمَ بِالبُشرىٰ قالوا سَلـٰمًا ۖ قالَ سَلـٰمٌ ۖ فَما لَبِثَ أَن جاءَ بِعِجلٍ حَنيذٍ"
    },
    {
      "index": "70",
      "text": "فَلَمّا رَءا أَيدِيَهُم لا تَصِلُ إِلَيهِ نَكِرَهُم وَأَوجَسَ مِنهُم خيفَةً ۚ قالوا لا تَخَف إِنّا أُرسِلنا إِلىٰ قَومِ لوطٍ"
    },
    {
      "index": "71",
      "text": "وَامرَأَتُهُ قائِمَةٌ فَضَحِكَت فَبَشَّرنـٰها بِإِسحـٰقَ وَمِن وَراءِ إِسحـٰقَ يَعقوبَ"
    },
    {
      "index": "72",
      "text": "قالَت يـٰوَيلَتىٰ ءَأَلِدُ وَأَنا۠ عَجوزٌ وَهـٰذا بَعلى شَيخًا ۖ إِنَّ هـٰذا لَشَىءٌ عَجيبٌ"
    },
    {
      "index": "73",
      "text": "قالوا أَتَعجَبينَ مِن أَمرِ اللَّهِ ۖ رَحمَتُ اللَّهِ وَبَرَكـٰتُهُ عَلَيكُم أَهلَ البَيتِ ۚ إِنَّهُ حَميدٌ مَجيدٌ"
    },
    {
      "index": "74",
      "text": "فَلَمّا ذَهَبَ عَن إِبرٰهيمَ الرَّوعُ وَجاءَتهُ البُشرىٰ يُجـٰدِلُنا فى قَومِ لوطٍ"
    },
    {
      "index": "75",
      "text": "إِنَّ إِبرٰهيمَ لَحَليمٌ أَوّٰهٌ مُنيبٌ"
    },
    {
      "index": "76",
      "text": "يـٰإِبرٰهيمُ أَعرِض عَن هـٰذا ۖ إِنَّهُ قَد جاءَ أَمرُ رَبِّكَ ۖ وَإِنَّهُم ءاتيهِم عَذابٌ غَيرُ مَردودٍ"
    },
    {
      "index": "77",
      "text": "وَلَمّا جاءَت رُسُلُنا لوطًا سىءَ بِهِم وَضاقَ بِهِم ذَرعًا وَقالَ هـٰذا يَومٌ عَصيبٌ"
    },
    {
      "index": "78",
      "text": "وَجاءَهُ قَومُهُ يُهرَعونَ إِلَيهِ وَمِن قَبلُ كانوا يَعمَلونَ السَّيِّـٔاتِ ۚ قالَ يـٰقَومِ هـٰؤُلاءِ بَناتى هُنَّ أَطهَرُ لَكُم ۖ فَاتَّقُوا اللَّهَ وَلا تُخزونِ فى ضَيفى ۖ أَلَيسَ مِنكُم رَجُلٌ رَشيدٌ"
    },
    {
      "index": "79",
      "text": "قالوا لَقَد عَلِمتَ ما لَنا فى بَناتِكَ مِن حَقٍّ وَإِنَّكَ لَتَعلَمُ ما نُريدُ"
    },
    {
      "index": "80",
      "text": "قالَ لَو أَنَّ لى بِكُم قُوَّةً أَو ءاوى إِلىٰ رُكنٍ شَديدٍ"
    },
    {
      "index": "81",
      "text": "قالوا يـٰلوطُ إِنّا رُسُلُ رَبِّكَ لَن يَصِلوا إِلَيكَ ۖ فَأَسرِ بِأَهلِكَ بِقِطعٍ مِنَ الَّيلِ وَلا يَلتَفِت مِنكُم أَحَدٌ إِلَّا امرَأَتَكَ ۖ إِنَّهُ مُصيبُها ما أَصابَهُم ۚ إِنَّ مَوعِدَهُمُ الصُّبحُ ۚ أَلَيسَ الصُّبحُ بِقَريبٍ"
    },
    {
      "index": "82",
      "text": "فَلَمّا جاءَ أَمرُنا جَعَلنا عـٰلِيَها سافِلَها وَأَمطَرنا عَلَيها حِجارَةً مِن سِجّيلٍ مَنضودٍ"
    },
    {
      "index": "83",
      "text": "مُسَوَّمَةً عِندَ رَبِّكَ ۖ وَما هِىَ مِنَ الظّـٰلِمينَ بِبَعيدٍ"
    },
    {
      "index": "84",
      "text": "۞ وَإِلىٰ مَديَنَ أَخاهُم شُعَيبًا ۚ قالَ يـٰقَومِ اعبُدُوا اللَّهَ ما لَكُم مِن إِلـٰهٍ غَيرُهُ ۖ وَلا تَنقُصُوا المِكيالَ وَالميزانَ ۚ إِنّى أَرىٰكُم بِخَيرٍ وَإِنّى أَخافُ عَلَيكُم عَذابَ يَومٍ مُحيطٍ"
    },
    {
      "index": "85",
      "text": "وَيـٰقَومِ أَوفُوا المِكيالَ وَالميزانَ بِالقِسطِ ۖ وَلا تَبخَسُوا النّاسَ أَشياءَهُم وَلا تَعثَوا فِى الأَرضِ مُفسِدينَ"
    },
    {
      "index": "86",
      "text": "بَقِيَّتُ اللَّهِ خَيرٌ لَكُم إِن كُنتُم مُؤمِنينَ ۚ وَما أَنا۠ عَلَيكُم بِحَفيظٍ"
    },
    {
      "index": "87",
      "text": "قالوا يـٰشُعَيبُ أَصَلوٰتُكَ تَأمُرُكَ أَن نَترُكَ ما يَعبُدُ ءاباؤُنا أَو أَن نَفعَلَ فى أَموٰلِنا ما نَشـٰؤُا۟ ۖ إِنَّكَ لَأَنتَ الحَليمُ الرَّشيدُ"
    },
    {
      "index": "88",
      "text": "قالَ يـٰقَومِ أَرَءَيتُم إِن كُنتُ عَلىٰ بَيِّنَةٍ مِن رَبّى وَرَزَقَنى مِنهُ رِزقًا حَسَنًا ۚ وَما أُريدُ أَن أُخالِفَكُم إِلىٰ ما أَنهىٰكُم عَنهُ ۚ إِن أُريدُ إِلَّا الإِصلـٰحَ مَا استَطَعتُ ۚ وَما تَوفيقى إِلّا بِاللَّهِ ۚ عَلَيهِ تَوَكَّلتُ وَإِلَيهِ أُنيبُ"
    },
    {
      "index": "89",
      "text": "وَيـٰقَومِ لا يَجرِمَنَّكُم شِقاقى أَن يُصيبَكُم مِثلُ ما أَصابَ قَومَ نوحٍ أَو قَومَ هودٍ أَو قَومَ صـٰلِحٍ ۚ وَما قَومُ لوطٍ مِنكُم بِبَعيدٍ"
    },
    {
      "index": "90",
      "text": "وَاستَغفِروا رَبَّكُم ثُمَّ توبوا إِلَيهِ ۚ إِنَّ رَبّى رَحيمٌ وَدودٌ"
    },
    {
      "index": "91",
      "text": "قالوا يـٰشُعَيبُ ما نَفقَهُ كَثيرًا مِمّا تَقولُ وَإِنّا لَنَرىٰكَ فينا ضَعيفًا ۖ وَلَولا رَهطُكَ لَرَجَمنـٰكَ ۖ وَما أَنتَ عَلَينا بِعَزيزٍ"
    },
    {
      "index": "92",
      "text": "قالَ يـٰقَومِ أَرَهطى أَعَزُّ عَلَيكُم مِنَ اللَّهِ وَاتَّخَذتُموهُ وَراءَكُم ظِهرِيًّا ۖ إِنَّ رَبّى بِما تَعمَلونَ مُحيطٌ"
    },
    {
      "index": "93",
      "text": "وَيـٰقَومِ اعمَلوا عَلىٰ مَكانَتِكُم إِنّى عـٰمِلٌ ۖ سَوفَ تَعلَمونَ مَن يَأتيهِ عَذابٌ يُخزيهِ وَمَن هُوَ كـٰذِبٌ ۖ وَارتَقِبوا إِنّى مَعَكُم رَقيبٌ"
    },
    {
      "index": "94",
      "text": "وَلَمّا جاءَ أَمرُنا نَجَّينا شُعَيبًا وَالَّذينَ ءامَنوا مَعَهُ بِرَحمَةٍ مِنّا وَأَخَذَتِ الَّذينَ ظَلَمُوا الصَّيحَةُ فَأَصبَحوا فى دِيـٰرِهِم جـٰثِمينَ"
    },
    {
      "index": "95",
      "text": "كَأَن لَم يَغنَوا فيها ۗ أَلا بُعدًا لِمَديَنَ كَما بَعِدَت ثَمودُ"
    },
    {
      "index": "96",
      "text": "وَلَقَد أَرسَلنا موسىٰ بِـٔايـٰتِنا وَسُلطـٰنٍ مُبينٍ"
    },
    {
      "index": "97",
      "text": "إِلىٰ فِرعَونَ وَمَلَإِي۟هِ فَاتَّبَعوا أَمرَ فِرعَونَ ۖ وَما أَمرُ فِرعَونَ بِرَشيدٍ"
    },
    {
      "index": "98",
      "text": "يَقدُمُ قَومَهُ يَومَ القِيـٰمَةِ فَأَورَدَهُمُ النّارَ ۖ وَبِئسَ الوِردُ المَورودُ"
    },
    {
      "index": "99",
      "text": "وَأُتبِعوا فى هـٰذِهِ لَعنَةً وَيَومَ القِيـٰمَةِ ۚ بِئسَ الرِّفدُ المَرفودُ"
    },
    {
      "index": "100",
      "text": "ذٰلِكَ مِن أَنباءِ القُرىٰ نَقُصُّهُ عَلَيكَ ۖ مِنها قائِمٌ وَحَصيدٌ"
    },
    {
      "index": "101",
      "text": "وَما ظَلَمنـٰهُم وَلـٰكِن ظَلَموا أَنفُسَهُم ۖ فَما أَغنَت عَنهُم ءالِهَتُهُمُ الَّتى يَدعونَ مِن دونِ اللَّهِ مِن شَىءٍ لَمّا جاءَ أَمرُ رَبِّكَ ۖ وَما زادوهُم غَيرَ تَتبيبٍ"
    },
    {
      "index": "102",
      "text": "وَكَذٰلِكَ أَخذُ رَبِّكَ إِذا أَخَذَ القُرىٰ وَهِىَ ظـٰلِمَةٌ ۚ إِنَّ أَخذَهُ أَليمٌ شَديدٌ"
    },
    {
      "index": "103",
      "text": "إِنَّ فى ذٰلِكَ لَـٔايَةً لِمَن خافَ عَذابَ الـٔاخِرَةِ ۚ ذٰلِكَ يَومٌ مَجموعٌ لَهُ النّاسُ وَذٰلِكَ يَومٌ مَشهودٌ"
    },
    {
      "index": "104",
      "text": "وَما نُؤَخِّرُهُ إِلّا لِأَجَلٍ مَعدودٍ"
    },
    {
      "index": "105",
      "text": "يَومَ يَأتِ لا تَكَلَّمُ نَفسٌ إِلّا بِإِذنِهِ ۚ فَمِنهُم شَقِىٌّ وَسَعيدٌ"
    },
    {
      "index": "106",
      "text": "فَأَمَّا الَّذينَ شَقوا فَفِى النّارِ لَهُم فيها زَفيرٌ وَشَهيقٌ"
    },
    {
      "index": "107",
      "text": "خـٰلِدينَ فيها ما دامَتِ السَّمـٰوٰتُ وَالأَرضُ إِلّا ما شاءَ رَبُّكَ ۚ إِنَّ رَبَّكَ فَعّالٌ لِما يُريدُ"
    },
    {
      "index": "108",
      "text": "۞ وَأَمَّا الَّذينَ سُعِدوا فَفِى الجَنَّةِ خـٰلِدينَ فيها ما دامَتِ السَّمـٰوٰتُ وَالأَرضُ إِلّا ما شاءَ رَبُّكَ ۖ عَطاءً غَيرَ مَجذوذٍ"
    },
    {
      "index": "109",
      "text": "فَلا تَكُ فى مِريَةٍ مِمّا يَعبُدُ هـٰؤُلاءِ ۚ ما يَعبُدونَ إِلّا كَما يَعبُدُ ءاباؤُهُم مِن قَبلُ ۚ وَإِنّا لَمُوَفّوهُم نَصيبَهُم غَيرَ مَنقوصٍ"
    },
    {
      "index": "110",
      "text": "وَلَقَد ءاتَينا موسَى الكِتـٰبَ فَاختُلِفَ فيهِ ۚ وَلَولا كَلِمَةٌ سَبَقَت مِن رَبِّكَ لَقُضِىَ بَينَهُم ۚ وَإِنَّهُم لَفى شَكٍّ مِنهُ مُريبٍ"
    },
    {
      "index": "111",
      "text": "وَإِنَّ كُلًّا لَمّا لَيُوَفِّيَنَّهُم رَبُّكَ أَعمـٰلَهُم ۚ إِنَّهُ بِما يَعمَلونَ خَبيرٌ"
    },
    {
      "index": "112",
      "text": "فَاستَقِم كَما أُمِرتَ وَمَن تابَ مَعَكَ وَلا تَطغَوا ۚ إِنَّهُ بِما تَعمَلونَ بَصيرٌ"
    },
    {
      "index": "113",
      "text": "وَلا تَركَنوا إِلَى الَّذينَ ظَلَموا فَتَمَسَّكُمُ النّارُ وَما لَكُم مِن دونِ اللَّهِ مِن أَولِياءَ ثُمَّ لا تُنصَرونَ"
    },
    {
      "index": "114",
      "text": "وَأَقِمِ الصَّلوٰةَ طَرَفَىِ النَّهارِ وَزُلَفًا مِنَ الَّيلِ ۚ إِنَّ الحَسَنـٰتِ يُذهِبنَ السَّيِّـٔاتِ ۚ ذٰلِكَ ذِكرىٰ لِلذّٰكِرينَ"
    },
    {
      "index": "115",
      "text": "وَاصبِر فَإِنَّ اللَّهَ لا يُضيعُ أَجرَ المُحسِنينَ"
    },
    {
      "index": "116",
      "text": "فَلَولا كانَ مِنَ القُرونِ مِن قَبلِكُم أُولوا بَقِيَّةٍ يَنهَونَ عَنِ الفَسادِ فِى الأَرضِ إِلّا قَليلًا مِمَّن أَنجَينا مِنهُم ۗ وَاتَّبَعَ الَّذينَ ظَلَموا ما أُترِفوا فيهِ وَكانوا مُجرِمينَ"
    },
    {
      "index": "117",
      "text": "وَما كانَ رَبُّكَ لِيُهلِكَ القُرىٰ بِظُلمٍ وَأَهلُها مُصلِحونَ"
    },
    {
      "index": "118",
      "text": "وَلَو شاءَ رَبُّكَ لَجَعَلَ النّاسَ أُمَّةً وٰحِدَةً ۖ وَلا يَزالونَ مُختَلِفينَ"
    },
    {
      "index": "119",
      "text": "إِلّا مَن رَحِمَ رَبُّكَ ۚ وَلِذٰلِكَ خَلَقَهُم ۗ وَتَمَّت كَلِمَةُ رَبِّكَ لَأَملَأَنَّ جَهَنَّمَ مِنَ الجِنَّةِ وَالنّاسِ أَجمَعينَ"
    },
    {
      "index": "120",
      "text": "وَكُلًّا نَقُصُّ عَلَيكَ مِن أَنباءِ الرُّسُلِ ما نُثَبِّتُ بِهِ فُؤادَكَ ۚ وَجاءَكَ فى هـٰذِهِ الحَقُّ وَمَوعِظَةٌ وَذِكرىٰ لِلمُؤمِنينَ"
    },
    {
      "index": "121",
      "text": "وَقُل لِلَّذينَ لا يُؤمِنونَ اعمَلوا عَلىٰ مَكانَتِكُم إِنّا عـٰمِلونَ"
    },
    {
      "index": "122",
      "text": "وَانتَظِروا إِنّا مُنتَظِرونَ"
    },
    {
      "index": "123",
      "text": "وَلِلَّهِ غَيبُ السَّمـٰوٰتِ وَالأَرضِ وَإِلَيهِ يُرجَعُ الأَمرُ كُلُّهُ فَاعبُدهُ وَتَوَكَّل عَلَيهِ ۚ وَما رَبُّكَ بِغـٰفِلٍ عَمّا تَعمَلونَ"
    }
  ],
  "index": "11",
  "name": "هود",
  "copyright": "# PLEASE DO NOT REMOVE OR CHANGE THIS COPYRIGHT BLOCK \n#==================================================================== \n#\n#  Tanzil Quran Text (Uthmani Minimal, Version 1.1)\n#  Copyright (C) 2007-2022 Tanzil Project\n#  License: Creative Commons Attribution 3.0\n#\n#  This copy of the Quran text is carefully produced, highly \n#  verified and continuously monitored by a group of specialists \n#  at Tanzil Project.\n#\n#  TERMS OF USE:\n#\n#  - Permission is granted to copy and distribute verbatim copies \n#    of this text, but CHANGING IT IS NOT ALLOWED.\n#\n#  - This Quran text can be used in any website or application, \n#    provided that its source (Tanzil Project) is clearly indicated, \n#    and a link is made to tanzil.net to enable users to keep\n#    track of changes.\n#\n#  - This copyright notice shall be included in all verbatim copies \n#    of the text, and shall be reproduced appropriately in all files \n#    derived from or containing substantial portion of this text.\n#\n#  Please check updates at: http://tanzil.net/updates/\n#\n#====================================================================\n",
  "type": "uthmani-min",
  "version": "1.1"
}