{
  "aya": [
    {
      "index": "1",
      "text": "يا أيها النبي اتق الله ولا تطع الكافرين والمنافقين ۗ إن الله كان عليما حكيما",
      "bismillah": "بسم الله الرحمن الرحيم"
    },
    {
      "index": "2",
      "text": "واتبع ما يوحى إليك من ربك ۚ إن الله كان بما تعملون خبيرا"
    },
    {
      "index": "3",
      "text": "وتوكل على الله ۚ وكفى بالله وكيلا"
    },
    {
      "index": "4",
      "text": "ما جعل الله لرجل من قلبين في جوفه ۚ وما جعل أزواجكم اللائي تظاهرون منهن أمهاتكم ۚ وما جعل أدعياءكم أبناءكم ۚ ذلكم قولكم بأفواهكم ۖ والله يقول الحق وهو يهدي السبيل"
    },
    {
      "index": "5",
      "text": "ادعوهم لآبائهم هو أقسط عند الله ۚ فإن لم تعلموا آباءهم فإخوانكم في الدين ومواليكم ۚ وليس عليكم جناح فيما أخطأتم به ولكن ما تعمدت قلوبكم ۚ وكان الله غفورا رحيما"
    },
    {
      "index": "6",
      "text": "النبي أولى بالمؤمنين من أنفسهم ۖ وأزواجه أمهاتهم ۗ وأولو الأرحام بعضهم أولى ببعض في كتاب الله من المؤمنين والمهاجرين إلا أن تفعلوا إلى أوليائكم معروفا ۚ كان ذلك في الكتاب مسطورا"
    },
    {
      "index": "7",
      "text": "وإذ أخذنا من النبيين ميثاقهم ومنك ومن نوح وإبراهيم وموسى وعيسى ابن مريم ۖ وأخذنا منهم ميثاقا غليظا"
    },
    {
      "index": "8",
      "text": "ليسأل الصادقين عن صدقهم ۚ وأعد للكافرين عذابا أليما"
    },
    {
      "index": "9",
      "text": "يا أيها الذين آمنوا اذكروا نعمة الله عليكم إذ جاءتكم جنود فأرسلنا عليهم ريحا وجنودا لم تروها ۚ وكان الله بما تعملون بصيرا"
    },
    {
      "index": "10",
      "text": "إذ جاءوكم من فوقكم ومن أسفل منكم وإذ زاغت الأبصار وبلغت القلوب الحناجر وتظنون بالله الظنونا"
    },
    {
      "index": "11",
      "text": "هنالك ابتلي المؤمنون وزلزلوا زلزالا شديدا"
    },
    {
      "index": "12",
      "text": "وإذ يقول المنافقون والذين في قلوبهم مرض ما وعدنا الله ورسوله إلا غرورا"
    },
    {
      "index": "13",
      "text": "وإذ قالت طائفة منهم يا أهل يثرب لا مقام لكم فارجعوا ۚ ويستأذن فريق منهم النبي يقولون إن بيوتنا عورة وما هي بعورة ۖ إن يريدون إلا فرارا"
    },
    {
      "index": "14",
      "text": "ولو دخلت عليهم من أقطارها ثم سئلوا الفتنة لآتوها وما تلبثوا بها إلا يسيرا"
    },
    {
      "index": "15",
      "text": "ولقد كانوا عاهدوا الله من قبل لا يولون الأدبار ۚ وكان عهد الله مسئولا"
    },
    {
      "index": "16",
      "text": "قل لن ينفعكم الفرار إن فررتم من الموت أو القتل وإذا لا تمتعون إلا قليلا"
    },
    {
      "index": "17",
      "text": "قل من ذا الذي يعصمكم من الله إن أراد بكم سوءا أو أراد بكم رحمة ۚ ولا يجدون لهم من دون الله وليا ولا نصيرا"
    },
    {
      "index": "18",
      "text": "۞ قد يعلم الله المعوقين منكم والقائلين لإخوانهم هلم إلينا ۖ ولا يأتون البأس إلا قليلا"
    },
    {
      "index": "19",
      "text": "أشحة عليكم ۖ فإذا جاء الخوف رأيتهم ينظرون إليك تدور أعينهم كالذي يغشى عليه من الموت ۖ فإذا ذهب الخوف سلقوكم بألسنة حداد أشحة على الخير ۚ أولئك لم يؤمنوا فأحبط الله أعمالهم ۚ وكان ذلك على الله يسيرا"
    },
    {
      "index": "20",
      "text": "يحسبون الأحزاب لم يذهبوا ۖ وإن يأت الأحزاب يودوا لو أنهم بادون في الأعراب يسألون عن أنبائكم ۖ ولو كانوا فيكم ما قاتلوا إلا قليلا"
    },
    {
      "index": "21",
      "text": "لقد كان لكم في رسول الله أسوة حسنة لمن كان يرجو الله واليوم الآخر وذكر الله كثيرا"
    },
    {
      "index": "22",
      "text": "ولما رأى المؤمنون الأحزاب قالوا هذا ما وعدنا الله ورسوله وصدق الله ورسوله ۚ وما زادهم إلا إيمانا وتسليما"
    },
    {
      "index": "23",
      "text": "من المؤمنين رجال صدقوا ما عاهدوا الله عليه ۖ فمنهم من قضى نحبه ومنهم من ينتظر ۖ وما بدلوا تبديلا"
    },
    {
      "index": "24",
      "text": "ليجزي الله الصادقين بصدقهم ويعذب المنافقين إن شاء أو يتوب عليهم ۚ إن الله كان غفورا رحيما"
    },
    {
      "index": "25",
      "text": "ورد الله الذين كفروا بغيظهم لم ينالوا خيرا ۚ وكفى الله المؤمنين القتال ۚ وكان الله قويا عزيزا"
    },
    {
      "index": "26",
      "text": "وأنزل الذين ظاهروهم من أهل الكتاب من صياصيهم وقذف في قلوبهم الرعب فريقا تقتلون وتأسرون فريقا"
    },
    {
      "index": "27",
      "text": "وأورثكم أرضهم وديارهم وأموالهم وأرضا لم تطئوها ۚ وكان الله على كل شيء قديرا"
    },
    {
      "index": "28",
      "text": "يا أيها النبي قل لأزواجك إن كنتن تردن الحياة الدنيا وزينتها فتعالين أمتعكن وأسرحكن سراحا جميلا"
    },
    {
      "index": "29",
      "text": "وإن كنتن تردن الله ورسوله والدار الآخرة فإن الله أعد للمحسنات منكن أجرا عظيما"
    },
    {
      "index": "30",
      "text": "يا نساء النبي من يأت منكن بفاحشة مبينة يضاعف لها العذاب ضعفين ۚ وكان ذلك على الله يسيرا"
    },
    {
      "index": "31",
      "text": "۞ ومن يقنت منكن لله ورسوله وتعمل صالحا نؤتها أجرها مرتين وأعتدنا لها رزقا كريما"
    },
    {
      "index": "32",
      "text": "يا نساء النبي لستن كأحد من النساء ۚ إن اتقيتن فلا تخضعن بالقول فيطمع الذي في قلبه مرض وقلن قولا معروفا"
    },
    {
      "index": "33",
      "text": "وقرن في بيوتكن ولا تبرجن تبرج الجاهلية الأولى ۖ وأقمن الصلاة وآتين الزكاة وأطعن الله ورسوله ۚ إنما يريد الله ليذهب عنكم الرجس أهل البيت ويطهركم تطهيرا"
    },
    {
      "index": "34",
      "text": "واذكرن ما يتلى في بيوتكن من آيات الله والحكمة ۚ إن الله كان لطيفا خبيرا"
    },
    {
      "index": "35",
      "text": "إن المسلمين والمسلمات والمؤمنين والمؤمنات والقانتين والقانتات والصادقين والصادقات والصابرين والصابرات والخاشعين والخاشعات والمتصدقين والمتصدقات والصائمين والصائمات والحافظين فروجهم والحافظات والذاكرين الله كثيرا والذاكرات أعد الله لهم مغفرة وأجرا عظيما"
    },
    {
      "index": "36",
      "text": "وما كان لمؤمن ولا مؤمنة إذا قضى الله ورسوله أمرا أن يكون لهم الخيرة من أمرهم ۗ ومن يعص الله ورسوله فقد ضل ضلالا مبينا"
    },
    {
      "index": "37",
      "text": "وإذ تقول للذي أنعم الله عليه وأنعمت عليه أمسك عليك زوجك واتق الله وتخفي في نفسك ما الله مبديه وتخشى الناس والله أحق أن تخشاه ۖ فلما قضى زيد منها وطرا زوجناكها لكي لا يكون على المؤمنين حرج في أزواج أدعيائهم إذا قضوا منهن وطرا ۚ وكان أمر الله مفعولا"
    },
    {
      "index": "38",
      "text": "ما كان على النبي من حرج فيما فرض الله له ۖ سنة الله في الذين خلوا من قبل ۚ وكان أمر الله قدرا مقدورا"
    },
    {
      "index": "39",
      "text": "الذين يبلغون رسالات الله ويخشونه ولا يخشون أحدا إلا الله ۗ وكفى بالله حسيبا"
    },
    {
      "index": "40",
      "text": "ما كان محمد أبا أحد من رجالكم ولكن رسول الله وخاتم النبيين ۗ وكان الله بكل شيء عليما"
    },
    {
      "index": "41",
      "text": "يا أيها الذين آمنوا اذكروا الله ذكرا كثيرا"
    },
    {
      "index": "42",
      "text": "وسبحوه بكرة وأصيلا"
    },
    {
      "index": "43",
      "text": "هو الذي يصلي عليكم وملائكته ليخرجكم من الظلمات إلى النور ۚ وكان بالمؤمنين رحيما"
    },
    {
      "index": "44",
      "text": "تحيتهم يوم يلقونه سلام ۚ وأعد لهم أجرا كريما"
    },
    {
      "index": "45",
      "text": "يا أيها النبي إنا أرسلناك شاهدا ومبشرا ونذيرا"
    },
    {
      "index": "46",
      "text": "وداعيا إلى الله بإذنه وسراجا منيرا"
    },
    {
      "index": "47",
      "text": "وبشر المؤمنين بأن لهم من الله فضلا كبيرا"
    },
    {
      "index": "48",
      "text": "ولا تطع الكافرين والمنافقين ودع أذاهم وتوكل على الله ۚ وكفى بالله وكيلا"
    },
    {
      "index": "49",
      "text": "يا أيها الذين آمنوا إذا نكحتم المؤمنات ثم طلقتموهن من قبل أن تمسوهن فما لكم عليهن من عدة تعتدونها ۖ فمتعوهن وسرحوهن سراحا جميلا"
    },
    {
      "index": "50",
      "text": "يا أيها النبي إنا أحللنا لك أزواجك اللاتي آتيت أجورهن وما ملكت يمينك مما أفاء الله عليك وبنات عمك وبنات عماتك وبنات خالك وبنات خالاتك اللاتي هاجرن معك وامرأة مؤمنة إن وهبت نفسها للنبي إن أراد النبي أن يستنكحها خالصة لك من دون المؤمنين ۗ قد علمنا ما فرضنا عليهم في أزواجهم وما ملكت أيمانهم لكيلا يكون عليك حرج ۗ وكان الله غفورا رحيما"
    },
    {
      "index": "51",
      "text": "۞ ترجي من تشاء منهن وتؤوي إليك من تشاء ۖ ومن ابتغيت ممن عزلت فلا جناح عليك ۚ ذلك أدنى أن تقر أعينهن ولا يحزن ويرضين بما آتيتهن كلهن ۚ والله يعلم ما في قلوبكم ۚ وكان الله عليما حليما"
    },
    {
      "index": "52",
      "text": "لا يحل لك النساء من بعد ولا أن تبدل بهن من أزواج ولو أعجبك حسنهن إلا ما ملكت يمينك ۗ وكان الله على كل شيء رقيبا"
    },
    {
      "index": "53",
      "text": "يا أيها الذين آمنوا لا تدخلوا بيوت النبي إلا أن يؤذن لكم إلى طعام غير ناظرين إناه ولكن إذا دعيتم فادخلوا فإذا طعمتم فانتشروا ولا مستأنسين لحديث ۚ إن ذلكم كان يؤذي النبي فيستحيي منكم ۖ والله لا يستحيي من الحق ۚ وإذا سألتموهن متاعا فاسألوهن من وراء حجاب ۚ ذلكم أطهر لقلوبكم وقلوبهن ۚ وما كان لكم أن تؤذوا رسول الله ولا أن تنكحوا أزواجه من بعده أبدا ۚ إن ذلكم كان عند الله عظيما"
    },
    {
      "index": "54",
      "text": "إن تبدوا شيئا أو تخفوه فإن الله كان بكل شيء عليما"
    },
    {
      "index": "55",
      "text": "لا جناح عليهن في آبائهن ولا أبنائهن ولا إخوانهن ولا أبناء إخوانهن ولا أبناء أخواتهن ولا نسائهن ولا ما ملكت أيمانهن ۗ واتقين الله ۚ إن الله كان على كل شيء شهيدا"
    },
    {
      "index": "56",
      "text": "إن الله وملائكته يصلون على النبي ۚ يا أيها الذين آمنوا صلوا عليه وسلموا تسليما"
    },
    {
      "index": "57",
      "text": "إن الذين يؤذون الله ورسوله لعنهم الله في الدنيا والآخرة وأعد لهم عذابا مهينا"
    },
    {
      "index": "58",
      "text": "والذين يؤذون المؤمنين والمؤمنات بغير ما اكتسبوا فقد احتملوا بهتانا وإثما مبينا"
    },
    {
      "index": "59",
      "text": "يا أيها النبي قل لأزواجك وبناتك ونساء المؤمنين يدنين عليهن من جلابيبهن ۚ ذلك أدنى أن يعرفن فلا يؤذين ۗ وكان الله غفورا رحيما"
    },
    {
      "index": "60",
      "text": "۞ لئن لم ينته المنافقون والذين في قلوبهم مرض والمرجفون في المدينة لنغرينك بهم ثم لا يجاورونك فيها إلا قليلا"
    },
    {
      "index": "61",
      "text": "ملعونين ۖ أينما ثقفوا أخذوا وقتلوا تقتيلا"
    },
    {
      "index": "62",
      "text": "سنة الله في الذين خلوا من قبل ۖ ولن تجد لسنة الله تبديلا"
    },
    {
      "index": "63",
      "text": "يسألك الناس عن الساعة ۖ قل إنما علمها عند الله ۚ وما يدريك لعل الساعة تكون قريبا"
    },
    {
      "index": "64",
      "text": "إن الله لعن الكافرين وأعد لهم سعيرا"
    },
    {
      "index": "65",
      "text": "خالدين فيها أبدا ۖ لا يجدون وليا ولا نصيرا"
    },
    {
      "index": "66",
      "text": "يوم تقلب وجوههم في النار يقولون يا ليتنا أطعنا الله وأطعنا الرسولا"
    },
    {
      "index": "67",
      "text": "وقالوا ربنا إنا أطعنا سادتنا وكبراءنا فأضلونا السبيلا"
    },
    {
      "index": "68",
      "text": "ربنا آتهم ضعفين من العذاب والعنهم لعنا كبيرا"
    },
    {
      "index": "69",
      "text": "يا أيها الذين آمنوا لا تكونوا كالذين آذوا موسى فبرأه الله مما قالوا ۚ وكان عند الله وجيها"
    },
    {
      "index": "70",
      "text": "يا أيها الذين آمنوا اتقوا الله وقولوا قولا سديدا"
    },
    {
      "index": "71",
      "text": "يصلح لكم أعمالكم ويغفر لكم ذنوبكم ۗ ومن يطع الله ورسوله فقد فاز فوزا عظيما"
    },
    {
      "index": "72",
      "text": "إنا عرضنا الأمانة على السماوات والأرض والجبال فأبين أن يحملنها وأشفقن منها وحملها الإنسان ۖ إنه كان ظلوما جهولا"
    },
    {
      "index": "73",
      "text": "ليعذب الله المنافقين والمنافقات والمشركين والمشركات ويتوب الله على المؤمنين والمؤمنات ۗ وكان الله غفورا رحيما"
    }
  ],
  "index": "33",
  "name": "الأحزاب",
  "copyright": "# PLEASE DO NOT REMOVE OR CHANGE THIS COPYRIGHT BLOCK \n#==================================================================== \n#\n#  Tanzil Quran Text (Simple Clean, Version 1.1)\n#  Copyright (C) 2007-2022 Tanzil Project\n#  License: Creative Commons Attribution 3.0\n#\n#  This copy of the Quran text is carefully produced, highly \n#  verified and continuously monitored by a group of specialists \n#  at Tanzil Project.\n#\n#  TERMS OF USE:\n#\n#  - Permission is granted to copy and distribute verbatim copies \n#    of this text, but CHANGING IT IS NOT ALLOWED.\n#\n#  - This Quran text can be used in any website or application, \n#    provided that its source (Tanzil Project) is clearly indicated, \n#    and a link is made to tanzil.net to enable users to keep\n#    track of changes.\n#\n#  - This copyright notice shall be included in all verbatim copies \n#    of the text, and shall be reproduced appropriately in all files \n#    derived from or containing substantial portion of this text.\n#\n#  Please check updates at: http://tanzil.net/updates/\n#\n#====================================================================\n",
  "type": "simple-clean",
  "version": "1.1"
}