{
  "aya": [
    {
      "index": "1",
      "text": "قَد سَمِعَ اللَّهُ قَولَ الَّتي تُجادِلُكَ في زَوجِها وَتَشتَكي إِلَى اللَّهِ وَاللَّهُ يَسمَعُ تَحاوُرَكُما ۚ إِنَّ اللَّهَ سَميعٌ بَصيرٌ",
      "bismillah": "بِسمِ اللَّهِ الرَّحمـٰنِ الرَّحيمِ"
    },
    {
      "index": "2",
      "text": "الَّذينَ يُظاهِرونَ مِنكُم مِن نِسائِهِم ما هُنَّ أُمَّهاتِهِم ۖ إِن أُمَّهاتُهُم إِلَّا اللّائي وَلَدنَهُم ۚ وَإِنَّهُم لَيَقولونَ مُنكَرًا مِنَ القَولِ وَزورًا ۚ وَإِنَّ اللَّهَ لَعَفُوٌّ غَفورٌ"
    },
    {
      "index": "3",
      "text": "وَالَّذينَ يُظاهِرونَ مِن نِسائِهِم ثُمَّ يَعودونَ لِما قالوا فَتَحريرُ رَقَبَةٍ مِن قَبلِ أَن يَتَماسّا ۚ ذٰلِكُم توعَظونَ بِهِ ۚ وَاللَّهُ بِما تَعمَلونَ خَبيرٌ"
    },
    {
      "index": "4",
      "text": "فَمَن لَم يَجِد فَصِيامُ شَهرَينِ مُتَتابِعَينِ مِن قَبلِ أَن يَتَماسّا ۖ فَمَن لَم يَستَطِع فَإِطعامُ سِتّينَ مِسكينًا ۚ ذٰلِكَ لِتُؤمِنوا بِاللَّهِ وَرَسولِهِ ۚ وَتِلكَ حُدودُ اللَّهِ ۗ وَلِلكافِرينَ عَذابٌ أَليمٌ"
    },
    {
      "index": "5",
      "text": "إِنَّ الَّذينَ يُحادّونَ اللَّهَ وَرَسولَهُ كُبِتوا كَما كُبِتَ الَّذينَ مِن قَبلِهِم ۚ وَقَد أَنزَلنا آياتٍ بَيِّناتٍ ۚ وَلِلكافِرينَ عَذابٌ مُهينٌ"
    },
    {
      "index": "6",
      "text": "يَومَ يَبعَثُهُمُ اللَّهُ جَميعًا فَيُنَبِّئُهُم بِما عَمِلوا ۚ أَحصاهُ اللَّهُ وَنَسوهُ ۚ وَاللَّهُ عَلىٰ كُلِّ شَيءٍ شَهيدٌ"
    },
    {
      "index": "7",
      "text": "أَلَم تَرَ أَنَّ اللَّهَ يَعلَمُ ما فِي السَّماواتِ وَما فِي الأَرضِ ۖ ما يَكونُ مِن نَجوىٰ ثَلاثَةٍ إِلّا هُوَ رابِعُهُم وَلا خَمسَةٍ إِلّا هُوَ سادِسُهُم وَلا أَدنىٰ مِن ذٰلِكَ وَلا أَكثَرَ إِلّا هُوَ مَعَهُم أَينَ ما كانوا ۖ ثُمَّ يُنَبِّئُهُم بِما عَمِلوا يَومَ القِيامَةِ ۚ إِنَّ اللَّهَ بِكُلِّ شَيءٍ عَليمٌ"
    },
    {
      "index": "8",
      "text": "أَلَم تَرَ إِلَى الَّذينَ نُهوا عَنِ النَّجوىٰ ثُمَّ يَعودونَ لِما نُهوا عَنهُ وَيَتَناجَونَ بِالإِثمِ وَالعُدوانِ وَمَعصِيَتِ الرَّسولِ وَإِذا جاءوكَ حَيَّوكَ بِما لَم يُحَيِّكَ بِهِ اللَّهُ وَيَقولونَ في أَنفُسِهِم لَولا يُعَذِّبُنَا اللَّهُ بِما نَقولُ ۚ حَسبُهُم جَهَنَّمُ يَصلَونَها ۖ فَبِئسَ المَصيرُ"
    },
    {
      "index": "9",
      "text": "يا أَيُّهَا الَّذينَ آمَنوا إِذا تَناجَيتُم فَلا تَتَناجَوا بِالإِثمِ وَالعُدوانِ وَمَعصِيَتِ الرَّسولِ وَتَناجَوا بِالبِرِّ وَالتَّقوىٰ ۖ وَاتَّقُوا اللَّهَ الَّذي إِلَيهِ تُحشَرونَ"
    },
    {
      "index": "10",
      "text": "إِنَّمَا النَّجوىٰ مِنَ الشَّيطانِ لِيَحزُنَ الَّذينَ آمَنوا وَلَيسَ بِضارِّهِم شَيئًا إِلّا بِإِذنِ اللَّهِ ۚ وَعَلَى اللَّهِ فَليَتَوَكَّلِ المُؤمِنونَ"
    },
    {
      "index": "11",
      "text": "يا أَيُّهَا الَّذينَ آمَنوا إِذا قيلَ لَكُم تَفَسَّحوا فِي المَجالِسِ فَافسَحوا يَفسَحِ اللَّهُ لَكُم ۖ وَإِذا قيلَ انشُزوا فَانشُزوا يَرفَعِ اللَّهُ الَّذينَ آمَنوا مِنكُم وَالَّذينَ أوتُوا العِلمَ دَرَجاتٍ ۚ وَاللَّهُ بِما تَعمَلونَ خَبيرٌ"
    },
    {
      "index": "12",
      "text": "يا أَيُّهَا الَّذينَ آمَنوا إِذا ناجَيتُمُ الرَّسولَ فَقَدِّموا بَينَ يَدَي نَجواكُم صَدَقَةً ۚ ذٰلِكَ خَيرٌ لَكُم وَأَطهَرُ ۚ فَإِن لَم تَجِدوا فَإِنَّ اللَّهَ غَفورٌ رَحيمٌ"
    },
    {
      "index": "13",
      "text": "أَأَشفَقتُم أَن تُقَدِّموا بَينَ يَدَي نَجواكُم صَدَقاتٍ ۚ فَإِذ لَم تَفعَلوا وَتابَ اللَّهُ عَلَيكُم فَأَقيمُوا الصَّلاةَ وَآتُوا الزَّكاةَ وَأَطيعُوا اللَّهَ وَرَسولَهُ ۚ وَاللَّهُ خَبيرٌ بِما تَعمَلونَ"
    },
    {
      "index": "14",
      "text": "۞ أَلَم تَرَ إِلَى الَّذينَ تَوَلَّوا قَومًا غَضِبَ اللَّهُ عَلَيهِم ما هُم مِنكُم وَلا مِنهُم وَيَحلِفونَ عَلَى الكَذِبِ وَهُم يَعلَمونَ"
    },
    {
      "index": "15",
      "text": "أَعَدَّ اللَّهُ لَهُم عَذابًا شَديدًا ۖ إِنَّهُم ساءَ ما كانوا يَعمَلونَ"
    },
    {
      "index": "16",
      "text": "اتَّخَذوا أَيمانَهُم جُنَّةً فَصَدّوا عَن سَبيلِ اللَّهِ فَلَهُم عَذابٌ مُهينٌ"
    },
    {
      "index": "17",
      "text": "لَن تُغنِيَ عَنهُم أَموالُهُم وَلا أَولادُهُم مِنَ اللَّهِ شَيئًا ۚ أُولـٰئِكَ أَصحابُ النّارِ ۖ هُم فيها خالِدونَ"
    },
    {
      "index": "18",
      "text": "يَومَ يَبعَثُهُمُ اللَّهُ جَميعًا فَيَحلِفونَ لَهُ كَما يَحلِفونَ لَكُم ۖ وَيَحسَبونَ أَنَّهُم عَلىٰ شَيءٍ ۚ أَلا إِنَّهُم هُمُ الكاذِبونَ"
    },
    {
      "index": "19",
      "text": "استَحوَذَ عَلَيهِمُ الشَّيطانُ فَأَنساهُم ذِكرَ اللَّهِ ۚ أُولـٰئِكَ حِزبُ الشَّيطانِ ۚ أَلا إِنَّ حِزبَ الشَّيطانِ هُمُ الخاسِرونَ"
    },
    {
      "index": "20",
      "text": "إِنَّ الَّذينَ يُحادّونَ اللَّهَ وَرَسولَهُ أُولـٰئِكَ فِي الأَذَلّينَ"
    },
    {
      "index": "21",
      "text": "كَتَبَ اللَّهُ لَأَغلِبَنَّ أَنا وَرُسُلي ۚ إِنَّ اللَّهَ قَوِيٌّ عَزيزٌ"
    },
    {
      "index": "22",
      "text": "لا تَجِدُ قَومًا يُؤمِنونَ بِاللَّهِ وَاليَومِ الآخِرِ يُوادّونَ مَن حادَّ اللَّهَ وَرَسولَهُ وَلَو كانوا آباءَهُم أَو أَبناءَهُم أَو إِخوانَهُم أَو عَشيرَتَهُم ۚ أُولـٰئِكَ كَتَبَ في قُلوبِهِمُ الإيمانَ وَأَيَّدَهُم بِروحٍ مِنهُ ۖ وَيُدخِلُهُم جَنّاتٍ تَجري مِن تَحتِهَا الأَنهارُ خالِدينَ فيها ۚ رَضِيَ اللَّهُ عَنهُم وَرَضوا عَنهُ ۚ أُولـٰئِكَ حِزبُ اللَّهِ ۚ أَلا إِنَّ حِزبَ اللَّهِ هُمُ المُفلِحونَ"
    }
  ],
  "index": "58",
  "name": "المجادلة",
  "copyright": "# PLEASE DO NOT REMOVE OR CHANGE THIS COPYRIGHT BLOCK \n#==================================================================== \n#\n#  Tanzil Quran Text (Simple Minimal, Version 1.1)\n#  Copyright (C) 2007-2022 Tanzil Project\n#  License: Creative Commons Attribution 3.0\n#\n#  This copy of the Quran text is carefully produced, highly \n#  verified and continuously monitored by a group of specialists \n#  at Tanzil Project.\n#\n#  TERMS OF USE:\n#\n#  - Permission is granted to copy and distribute verbatim copies \n#    of this text, but CHANGING IT IS NOT ALLOWED.\n#\n#  - This Quran text can be used in any website or application, \n#    provided that its source (Tanzil Project) is clearly indicated, \n#    and a link is made to tanzil.net to enable users to keep\n#    track of changes.\n#\n#  - This copyright notice shall be included in all verbatim copies \n#    of the text, and shall be reproduced appropriately in all files \n#    derived from or containing substantial portion of this text.\n#\n#  Please check updates at: http://tanzil.net/updates/\n#\n#====================================================================\n",
  "type": "simple-min",
  "version": "1.1"
}