{
  "aya": [
    {
      "index": "1",
      "text": "اقْرَأْ بِاسْمِ رَبِّكَ الَّذِي خَلَقَ",
      "bismillah": "بِسْمِ اللَّهِ الرَّحْمَـٰنِ الرَّحِيمِ"
    },
    {
      "index": "2",
      "text": "خَلَقَ الْإِنْسَانَ مِنْ عَلَقٍ"
    },
    {
      "index": "3",
      "text": "اقْرَأْ وَرَبُّكَ الْأَكْرَمُ"
    },
    {
      "index": "4",
      "text": "الَّذِي عَلَّمَ بِالْقَلَمِ"
    },
    {
      "index": "5",
      "text": "عَلَّمَ الْإِنْسَانَ مَا لَمْ يَعْلَمْ"
    },
    {
      "index": "6",
      "text": "كَلَّا إِنَّ الْإِنْسَانَ لَيَطْغَىٰ"
    },
    {
      "index": "7",
      "text": "أَنْ رَآهُ اسْتَغْنَىٰ"
    },
    {
      "index": "8",
      "text": "إِنَّ إِلَىٰ رَبِّكَ الرُّجْعَىٰ"
    },
    {
      "index": "9",
      "text": "أَرَأَيْتَ الَّذِي يَنْهَىٰ"
    },
    {
      "index": "10",
      "text": "عَبْدًا إِذَا صَلَّىٰ"
    },
    {
      "index": "11",
      "text": "أَرَأَيْتَ إِنْ كَانَ عَلَى الْهُدَىٰ"
    },
    {
      "index": "12",
      "text": "أَوْ أَمَرَ بِالتَّقْوَىٰ"
    },
    {
      "index": "13",
      "text": "أَرَأَيْتَ إِنْ كَذَّبَ وَتَوَلَّىٰ"
    },
    {
      "index": "14",
      "text": "أَلَمْ يَعْلَمْ بِأَنَّ اللَّهَ يَرَىٰ"
    },
    {
      "index": "15",
      "text": "كَلَّا لَئِنْ لَمْ يَنْتَهِ لَنَسْفَعًا بِالنَّاصِيَةِ"
    },
    {
      "index": "16",
      "text": "نَاصِيَةٍ كَاذِبَةٍ خَاطِئَةٍ"
    },
    {
      "index": "17",
      "text": "فَلْيَدْعُ نَادِيَهُ"
    },
    {
      "index": "18",
      "text": "سَنَدْعُ الزَّبَانِيَةَ"
    },
    {
      "index": "19",
      "text": "كَلَّا لَا تُطِعْهُ وَاسْجُدْ وَاقْتَرِبْ ۩"
    }
  ],
  "index": "96",
  "name": "العلق",
  "copyright": "# PLEASE DO NOT REMOVE OR CHANGE THIS COPYRIGHT BLOCK \n#==================================================================== \n#\n#  Tanzil Quran Text (Simple Plain, Version 1.1)\n#  Copyright (C) 2007-2022 Tanzil Project\n#  License: Creative Commons Attribution 3.0\n#\n#  This copy of the Quran text is carefully produced, highly \n#  verified and continuously monitored by a group of specialists \n#  at Tanzil Project.\n#\n#  TERMS OF USE:\n#\n#  - Permission is granted to copy and distribute verbatim copies \n#    of this text, but CHANGING IT IS NOT ALLOWED.\n#\n#  - This Quran text can be used in any website or application, \n#    provided that its source (Tanzil Project) is clearly indicated, \n#    and a link is made to tanzil.net to enable users to keep\n#    track of changes.\n#\n#  - This copyright notice shall be included in all verbatim copies \n#    of the text, and shall be reproduced appropriately in all files \n#    derived from or containing substantial portion of this text.\n#\n#  Please check updates at: http://tanzil.net/updates/\n#\n#====================================================================\n",
  "type": "simple-plain",
  "version": "1.1"
}