{
  "aya": [
    {
      "index": "1",
      "text": "الر ۚ تِلْكَ آيَاتُ الْكِتَابِ الْمُبِينِ",
      "bismillah": "بِسْمِ اللَّهِ الرَّحْمَـٰنِ الرَّحِيمِ"
    },
    {
      "index": "2",
      "text": "إِنَّا أَنزَلْنَاهُ قُرْآنًا عَرَبِيًّا لَّعَلَّكُمْ تَعْقِلُونَ"
    },
    {
      "index": "3",
      "text": "نَحْنُ نَقُصُّ عَلَيْكَ أَحْسَنَ الْقَصَصِ بِمَا أَوْحَيْنَا إِلَيْكَ هَـٰذَا الْقُرْآنَ وَإِن كُنتَ مِن قَبْلِهِ لَمِنَ الْغَافِلِينَ"
    },
    {
      "index": "4",
      "text": "إِذْ قَالَ يُوسُفُ لِأَبِيهِ يَا أَبَتِ إِنِّي رَأَيْتُ أَحَدَ عَشَرَ كَوْكَبًا وَالشَّمْسَ وَالْقَمَرَ رَأَيْتُهُمْ لِي سَاجِدِينَ"
    },
    {
      "index": "5",
      "text": "قَالَ يَا بُنَيَّ لَا تَقْصُصْ رُؤْيَاكَ عَلَىٰ إِخْوَتِكَ فَيَكِيدُوا لَكَ كَيْدًا ۖ إِنَّ الشَّيْطَانَ لِلْإِنسَانِ عَدُوٌّ مُّبِينٌ"
    },
    {
      "index": "6",
      "text": "وَكَذَٰلِكَ يَجْتَبِيكَ رَبُّكَ وَيُعَلِّمُكَ مِن تَأْوِيلِ الْأَحَادِيثِ وَيُتِمُّ نِعْمَتَهُ عَلَيْكَ وَعَلَىٰ آلِ يَعْقُوبَ كَمَا أَتَمَّهَا عَلَىٰ أَبَوَيْكَ مِن قَبْلُ إِبْرَاهِيمَ وَإِسْحَاقَ ۚ إِنَّ رَبَّكَ عَلِيمٌ حَكِيمٌ"
    },
    {
      "index": "7",
      "text": "۞ لَّقَدْ كَانَ فِي يُوسُفَ وَإِخْوَتِهِ آيَاتٌ لِّلسَّائِلِينَ"
    },
    {
      "index": "8",
      "text": "إِذْ قَالُوا لَيُوسُفُ وَأَخُوهُ أَحَبُّ إِلَىٰ أَبِينَا مِنَّا وَنَحْنُ عُصْبَةٌ إِنَّ أَبَانَا لَفِي ضَلَالٍ مُّبِينٍ"
    },
    {
      "index": "9",
      "text": "اقْتُلُوا يُوسُفَ أَوِ اطْرَحُوهُ أَرْضًا يَخْلُ لَكُمْ وَجْهُ أَبِيكُمْ وَتَكُونُوا مِن بَعْدِهِ قَوْمًا صَالِحِينَ"
    },
    {
      "index": "10",
      "text": "قَالَ قَائِلٌ مِّنْهُمْ لَا تَقْتُلُوا يُوسُفَ وَأَلْقُوهُ فِي غَيَابَتِ الْجُبِّ يَلْتَقِطْهُ بَعْضُ السَّيَّارَةِ إِن كُنتُمْ فَاعِلِينَ"
    },
    {
      "index": "11",
      "text": "قَالُوا يَا أَبَانَا مَا لَكَ لَا تَأْمَنَّا عَلَىٰ يُوسُفَ وَإِنَّا لَهُ لَنَاصِحُونَ"
    },
    {
      "index": "12",
      "text": "أَرْسِلْهُ مَعَنَا غَدًا يَرْتَعْ وَيَلْعَبْ وَإِنَّا لَهُ لَحَافِظُونَ"
    },
    {
      "index": "13",
      "text": "قَالَ إِنِّي لَيَحْزُنُنِي أَن تَذْهَبُوا بِهِ وَأَخَافُ أَن يَأْكُلَهُ الذِّئْبُ وَأَنتُمْ عَنْهُ غَافِلُونَ"
    },
    {
      "index": "14",
      "text": "قَالُوا لَئِنْ أَكَلَهُ الذِّئْبُ وَنَحْنُ عُصْبَةٌ إِنَّا إِذًا لَّخَاسِرُونَ"
    },
    {
      "index": "15",
      "text": "فَلَمَّا ذَهَبُوا بِهِ وَأَجْمَعُوا أَن يَجْعَلُوهُ فِي غَيَابَتِ الْجُبِّ ۚ وَأَوْحَيْنَا إِلَيْهِ لَتُنَبِّئَنَّهُم بِأَمْرِهِمْ هَـٰذَا وَهُمْ لَا يَشْعُرُونَ"
    },
    {
      "index": "16",
      "text": "وَجَاءُوا أَبَاهُمْ عِشَاءً يَبْكُونَ"
    },
    {
      "index": "17",
      "text": "قَالُوا يَا أَبَانَا إِنَّا ذَهَبْنَا نَسْتَبِقُ وَتَرَكْنَا يُوسُفَ عِندَ مَتَاعِنَا فَأَكَلَهُ الذِّئْبُ ۖ وَمَا أَنتَ بِمُؤْمِنٍ لَّنَا وَلَوْ كُنَّا صَادِقِينَ"
    },
    {
      "index": "18",
      "text": "وَجَاءُوا عَلَىٰ قَمِيصِهِ بِدَمٍ كَذِبٍ ۚ قَالَ بَلْ سَوَّلَتْ لَكُمْ أَنفُسُكُمْ أَمْرًا ۖ فَصَبْرٌ جَمِيلٌ ۖ وَاللَّهُ الْمُسْتَعَانُ عَلَىٰ مَا تَصِفُونَ"
    },
    {
      "index": "19",
      "text": "وَجَاءَتْ سَيَّارَةٌ فَأَرْسَلُوا وَارِدَهُمْ فَأَدْلَىٰ دَلْوَهُ ۖ قَالَ يَا بُشْرَىٰ هَـٰذَا غُلَامٌ ۚ وَأَسَرُّوهُ بِضَاعَةً ۚ وَاللَّهُ عَلِيمٌ بِمَا يَعْمَلُونَ"
    },
    {
      "index": "20",
      "text": "وَشَرَوْهُ بِثَمَنٍ بَخْسٍ دَرَاهِمَ مَعْدُودَةٍ وَكَانُوا فِيهِ مِنَ الزَّاهِدِينَ"
    },
    {
      "index": "21",
      "text": "وَقَالَ الَّذِي اشْتَرَاهُ مِن مِّصْرَ لِامْرَأَتِهِ أَكْرِمِي مَثْوَاهُ عَسَىٰ أَن يَنفَعَنَا أَوْ نَتَّخِذَهُ وَلَدًا ۚ وَكَذَٰلِكَ مَكَّنَّا لِيُوسُفَ فِي الْأَرْضِ وَلِنُعَلِّمَهُ مِن تَأْوِيلِ الْأَحَادِيثِ ۚ وَاللَّهُ غَالِبٌ عَلَىٰ أَمْرِهِ وَلَـٰكِنَّ أَكْثَرَ النَّاسِ لَا يَعْلَمُونَ"
    },
    {
      "index": "22",
      "text": "وَلَمَّا بَلَغَ أَشُدَّهُ آتَيْنَاهُ حُكْمًا وَعِلْمًا ۚ وَكَذَٰلِكَ نَجْزِي الْمُحْسِنِينَ"
    },
    {
      "index": "23",
      "text": "وَرَاوَدَتْهُ الَّتِي هُوَ فِي بَيْتِهَا عَن نَّفْسِهِ وَغَلَّقَتِ الْأَبْوَابَ وَقَالَتْ هَيْتَ لَكَ ۚ قَالَ مَعَاذَ اللَّهِ ۖ إِنَّهُ رَبِّي أَحْسَنَ مَثْوَايَ ۖ إِنَّهُ لَا يُفْلِحُ الظَّالِمُونَ"
    },
    {
      "index": "24",
      "text": "وَلَقَدْ هَمَّتْ بِهِ ۖ وَهَمَّ بِهَا لَوْلَا أَن رَّأَىٰ بُرْهَانَ رَبِّهِ ۚ كَذَٰلِكَ لِنَصْرِفَ عَنْهُ السُّوءَ وَالْفَحْشَاءَ ۚ إِنَّهُ مِنْ عِبَادِنَا الْمُخْلَصِينَ"
    },
    {
      "index": "25",
      "text": "وَاسْتَبَقَا الْبَابَ وَقَدَّتْ قَمِيصَهُ مِن دُبُرٍ وَأَلْفَيَا سَيِّدَهَا لَدَى الْبَابِ ۚ قَالَتْ مَا جَزَاءُ مَنْ أَرَادَ بِأَهْلِكَ سُوءًا إِلَّا أَن يُسْجَنَ أَوْ عَذَابٌ أَلِيمٌ"
    },
    {
      "index": "26",
      "text": "قَالَ هِيَ رَاوَدَتْنِي عَن نَّفْسِي ۚ وَشَهِدَ شَاهِدٌ مِّنْ أَهْلِهَا إِن كَانَ قَمِيصُهُ قُدَّ مِن قُبُلٍ فَصَدَقَتْ وَهُوَ مِنَ الْكَاذِبِينَ"
    },
    {
      "index": "27",
      "text": "وَإِن كَانَ قَمِيصُهُ قُدَّ مِن دُبُرٍ فَكَذَبَتْ وَهُوَ مِنَ الصَّادِقِينَ"
    },
    {
      "index": "28",
      "text": "فَلَمَّا رَأَىٰ قَمِيصَهُ قُدَّ مِن دُبُرٍ قَالَ إِنَّهُ مِن كَيْدِكُنَّ ۖ إِنَّ كَيْدَكُنَّ عَظِيمٌ"
    },
    {
      "index": "29",
      "text": "يُوسُفُ أَعْرِضْ عَنْ هَـٰذَا ۚ وَاسْتَغْفِرِي لِذَنبِكِ ۖ إِنَّكِ كُنتِ مِنَ الْخَاطِئِينَ"
    },
    {
      "index": "30",
      "text": "۞ وَقَالَ نِسْوَةٌ فِي الْمَدِينَةِ امْرَأَتُ الْعَزِيزِ تُرَاوِدُ فَتَاهَا عَن نَّفْسِهِ ۖ قَدْ شَغَفَهَا حُبًّا ۖ إِنَّا لَنَرَاهَا فِي ضَلَالٍ مُّبِينٍ"
    },
    {
      "index": "31",
      "text": "فَلَمَّا سَمِعَتْ بِمَكْرِهِنَّ أَرْسَلَتْ إِلَيْهِنَّ وَأَعْتَدَتْ لَهُنَّ مُتَّكَأً وَآتَتْ كُلَّ وَاحِدَةٍ مِّنْهُنَّ سِكِّينًا وَقَالَتِ اخْرُجْ عَلَيْهِنَّ ۖ فَلَمَّا رَأَيْنَهُ أَكْبَرْنَهُ وَقَطَّعْنَ أَيْدِيَهُنَّ وَقُلْنَ حَاشَ لِلَّهِ مَا هَـٰذَا بَشَرًا إِنْ هَـٰذَا إِلَّا مَلَكٌ كَرِيمٌ"
    },
    {
      "index": "32",
      "text": "قَالَتْ فَذَٰلِكُنَّ الَّذِي لُمْتُنَّنِي فِيهِ ۖ وَلَقَدْ رَاوَدتُّهُ عَن نَّفْسِهِ فَاسْتَعْصَمَ ۖ وَلَئِن لَّمْ يَفْعَلْ مَا آمُرُهُ لَيُسْجَنَنَّ وَلَيَكُونًا مِّنَ الصَّاغِرِينَ"
    },
    {
      "index": "33",
      "text": "قَالَ رَبِّ السِّجْنُ أَحَبُّ إِلَيَّ مِمَّا يَدْعُونَنِي إِلَيْهِ ۖ وَإِلَّا تَصْرِفْ عَنِّي كَيْدَهُنَّ أَصْبُ إِلَيْهِنَّ وَأَكُن مِّنَ الْجَاهِلِينَ"
    },
    {
      "index": "34",
      "text": "فَاسْتَجَابَ لَهُ رَبُّهُ فَصَرَفَ عَنْهُ كَيْدَهُنَّ ۚ إِنَّهُ هُوَ السَّمِيعُ الْعَلِيمُ"
    },
    {
      "index": "35",
      "text": "ثُمَّ بَدَا لَهُم مِّن بَعْدِ مَا رَأَوُا الْآيَاتِ لَيَسْجُنُنَّهُ حَتَّىٰ حِينٍ"
    },
    {
      "index": "36",
      "text": "وَدَخَلَ مَعَهُ السِّجْنَ فَتَيَانِ ۖ قَالَ أَحَدُهُمَا إِنِّي أَرَانِي أَعْصِرُ خَمْرًا ۖ وَقَالَ الْآخَرُ إِنِّي أَرَانِي أَحْمِلُ فَوْقَ رَأْسِي خُبْزًا تَأْكُلُ الطَّيْرُ مِنْهُ ۖ نَبِّئْنَا بِتَأْوِيلِهِ ۖ إِنَّا نَرَاكَ مِنَ الْمُحْسِنِينَ"
    },
    {
      "index": "37",
      "text": "قَالَ لَا يَأْتِيكُمَا طَعَامٌ تُرْزَقَانِهِ إِلَّا نَبَّأْتُكُمَا بِتَأْوِيلِهِ قَبْلَ أَن يَأْتِيَكُمَا ۚ ذَٰلِكُمَا مِمَّا عَلَّمَنِي رَبِّي ۚ إِنِّي تَرَكْتُ مِلَّةَ قَوْمٍ لَّا يُؤْمِنُونَ بِاللَّهِ وَهُم بِالْآخِرَةِ هُمْ كَافِرُونَ"
    },
    {
      "index": "38",
      "text": "وَاتَّبَعْتُ مِلَّةَ آبَائِي إِبْرَاهِيمَ وَإِسْحَاقَ وَيَعْقُوبَ ۚ مَا كَانَ لَنَا أَن نُّشْرِكَ بِاللَّهِ مِن شَيْءٍ ۚ ذَٰلِكَ مِن فَضْلِ اللَّهِ عَلَيْنَا وَعَلَى النَّاسِ وَلَـٰكِنَّ أَكْثَرَ النَّاسِ لَا يَشْكُرُونَ"
    },
    {
      "index": "39",
      "text": "يَا صَاحِبَيِ السِّجْنِ أَأَرْبَابٌ مُّتَفَرِّقُونَ خَيْرٌ أَمِ اللَّهُ الْوَاحِدُ الْقَهَّارُ"
    },
    {
      "index": "40",
      "text": "مَا تَعْبُدُونَ مِن دُونِهِ إِلَّا أَسْمَاءً سَمَّيْتُمُوهَا أَنتُمْ وَآبَاؤُكُم مَّا أَنزَلَ اللَّهُ بِهَا مِن سُلْطَانٍ ۚ إِنِ الْحُكْمُ إِلَّا لِلَّهِ ۚ أَمَرَ أَلَّا تَعْبُدُوا إِلَّا إِيَّاهُ ۚ ذَٰلِكَ الدِّينُ الْقَيِّمُ وَلَـٰكِنَّ أَكْثَرَ النَّاسِ لَا يَعْلَمُونَ"
    },
    {
      "index": "41",
      "text": "يَا صَاحِبَيِ السِّجْنِ أَمَّا أَحَدُكُمَا فَيَسْقِي رَبَّهُ خَمْرًا ۖ وَأَمَّا الْآخَرُ فَيُصْلَبُ فَتَأْكُلُ الطَّيْرُ مِن رَّأْسِهِ ۚ قُضِيَ الْأَمْرُ الَّذِي فِيهِ تَسْتَفْتِيَانِ"
    },
    {
      "index": "42",
      "text": "وَقَالَ لِلَّذِي ظَنَّ أَنَّهُ نَاجٍ مِّنْهُمَا اذْكُرْنِي عِندَ رَبِّكَ فَأَنسَاهُ الشَّيْطَانُ ذِكْرَ رَبِّهِ فَلَبِثَ فِي السِّجْنِ بِضْعَ سِنِينَ"
    },
    {
      "index": "43",
      "text": "وَقَالَ الْمَلِكُ إِنِّي أَرَىٰ سَبْعَ بَقَرَاتٍ سِمَانٍ يَأْكُلُهُنَّ سَبْعٌ عِجَافٌ وَسَبْعَ سُنبُلَاتٍ خُضْرٍ وَأُخَرَ يَابِسَاتٍ ۖ يَا أَيُّهَا الْمَلَأُ أَفْتُونِي فِي رُؤْيَايَ إِن كُنتُمْ لِلرُّؤْيَا تَعْبُرُونَ"
    },
    {
      "index": "44",
      "text": "قَالُوا أَضْغَاثُ أَحْلَامٍ ۖ وَمَا نَحْنُ بِتَأْوِيلِ الْأَحْلَامِ بِعَالِمِينَ"
    },
    {
      "index": "45",
      "text": "وَقَالَ الَّذِي نَجَا مِنْهُمَا وَادَّكَرَ بَعْدَ أُمَّةٍ أَنَا أُنَبِّئُكُم بِتَأْوِيلِهِ فَأَرْسِلُونِ"
    },
    {
      "index": "46",
      "text": "يُوسُفُ أَيُّهَا الصِّدِّيقُ أَفْتِنَا فِي سَبْعِ بَقَرَاتٍ سِمَانٍ يَأْكُلُهُنَّ سَبْعٌ عِجَافٌ وَسَبْعِ سُنبُلَاتٍ خُضْرٍ وَأُخَرَ يَابِسَاتٍ لَّعَلِّي أَرْجِعُ إِلَى النَّاسِ لَعَلَّهُمْ يَعْلَمُونَ"
    },
    {
      "index": "47",
      "text": "قَالَ تَزْرَعُونَ سَبْعَ سِنِينَ دَأَبًا فَمَا حَصَدتُّمْ فَذَرُوهُ فِي سُنبُلِهِ إِلَّا قَلِيلًا مِّمَّا تَأْكُلُونَ"
    },
    {
      "index": "48",
      "text": "ثُمَّ يَأْتِي مِن بَعْدِ ذَٰلِكَ سَبْعٌ شِدَادٌ يَأْكُلْنَ مَا قَدَّمْتُمْ لَهُنَّ إِلَّا قَلِيلًا مِّمَّا تُحْصِنُونَ"
    },
    {
      "index": "49",
      "text": "ثُمَّ يَأْتِي مِن بَعْدِ ذَٰلِكَ عَامٌ فِيهِ يُغَاثُ النَّاسُ وَفِيهِ يَعْصِرُونَ"
    },
    {
      "index": "50",
      "text": "وَقَالَ الْمَلِكُ ائْتُونِي بِهِ ۖ فَلَمَّا جَاءَهُ الرَّسُولُ قَالَ ارْجِعْ إِلَىٰ رَبِّكَ فَاسْأَلْهُ مَا بَالُ النِّسْوَةِ اللَّاتِي قَطَّعْنَ أَيْدِيَهُنَّ ۚ إِنَّ رَبِّي بِكَيْدِهِنَّ عَلِيمٌ"
    },
    {
      "index": "51",
      "text": "قَالَ مَا خَطْبُكُنَّ إِذْ رَاوَدتُّنَّ يُوسُفَ عَن نَّفْسِهِ ۚ قُلْنَ حَاشَ لِلَّهِ مَا عَلِمْنَا عَلَيْهِ مِن سُوءٍ ۚ قَالَتِ امْرَأَتُ الْعَزِيزِ الْآنَ حَصْحَصَ الْحَقُّ أَنَا رَاوَدتُّهُ عَن نَّفْسِهِ وَإِنَّهُ لَمِنَ الصَّادِقِينَ"
    },
    {
      "index": "52",
      "text": "ذَٰلِكَ لِيَعْلَمَ أَنِّي لَمْ أَخُنْهُ بِالْغَيْبِ وَأَنَّ اللَّهَ لَا يَهْدِي كَيْدَ الْخَائِنِينَ"
    },
    {
      "index": "53",
      "text": "۞ وَمَا أُبَرِّئُ نَفْسِي ۚ إِنَّ النَّفْسَ لَأَمَّارَةٌ بِالسُّوءِ إِلَّا مَا رَحِمَ رَبِّي ۚ إِنَّ رَبِّي غَفُورٌ رَّحِيمٌ"
    },
    {
      "index": "54",
      "text": "وَقَالَ الْمَلِكُ ائْتُونِي بِهِ أَسْتَخْلِصْهُ لِنَفْسِي ۖ فَلَمَّا كَلَّمَهُ قَالَ إِنَّكَ الْيَوْمَ لَدَيْنَا مَكِينٌ أَمِينٌ"
    },
    {
      "index": "55",
      "text": "قَالَ اجْعَلْنِي عَلَىٰ خَزَائِنِ الْأَرْضِ ۖ إِنِّي حَفِيظٌ عَلِيمٌ"
    },
    {
      "index": "56",
      "text": "وَكَذَٰلِكَ مَكَّنَّا لِيُوسُفَ فِي الْأَرْضِ يَتَبَوَّأُ مِنْهَا حَيْثُ يَشَاءُ ۚ نُصِيبُ بِرَحْمَتِنَا مَن نَّشَاءُ ۖ وَلَا نُضِيعُ أَجْرَ الْمُحْسِنِينَ"
    },
    {
      "index": "57",
      "text": "وَلَأَجْرُ الْآخِرَةِ خَيْرٌ لِّلَّذِينَ آمَنُوا وَكَانُوا يَتَّقُونَ"
    },
    {
      "index": "58",
      "text": "وَجَاءَ إِخْوَةُ يُوسُفَ فَدَخَلُوا عَلَيْهِ فَعَرَفَهُمْ وَهُمْ لَهُ مُنكِرُونَ"
    },
    {
      "index": "59",
      "text": "وَلَمَّا جَهَّزَهُم بِجَهَازِهِمْ قَالَ ائْتُونِي بِأَخٍ لَّكُم مِّنْ أَبِيكُمْ ۚ أَلَا تَرَوْنَ أَنِّي أُوفِي الْكَيْلَ وَأَنَا خَيْرُ الْمُنزِلِينَ"
    },
    {
      "index": "60",
      "text": "فَإِن لَّمْ تَأْتُونِي بِهِ فَلَا كَيْلَ لَكُمْ عِندِي وَلَا تَقْرَبُونِ"
    },
    {
      "index": "61",
      "text": "قَالُوا سَنُرَاوِدُ عَنْهُ أَبَاهُ وَإِنَّا لَفَاعِلُونَ"
    },
    {
      "index": "62",
      "text": "وَقَالَ لِفِتْيَانِهِ اجْعَلُوا بِضَاعَتَهُمْ فِي رِحَالِهِمْ لَعَلَّهُمْ يَعْرِفُونَهَا إِذَا انقَلَبُوا إِلَىٰ أَهْلِهِمْ لَعَلَّهُمْ يَرْجِعُونَ"
    },
    {
      "index": "63",
      "text": "فَلَمَّا رَجَعُوا إِلَىٰ أَبِيهِمْ قَالُوا يَا أَبَانَا مُنِعَ مِنَّا الْكَيْلُ فَأَرْسِلْ مَعَنَا أَخَانَا نَكْتَلْ وَإِنَّا لَهُ لَحَافِظُونَ"
    },
    {
      "index": "64",
      "text": "قَالَ هَلْ آمَنُكُمْ عَلَيْهِ إِلَّا كَمَا أَمِنتُكُمْ عَلَىٰ أَخِيهِ مِن قَبْلُ ۖ فَاللَّهُ خَيْرٌ حَافِظًا ۖ وَهُوَ أَرْحَمُ الرَّاحِمِينَ"
    },
    {
      "index": "65",
      "text": "وَلَمَّا فَتَحُوا مَتَاعَهُمْ وَجَدُوا بِضَاعَتَهُمْ رُدَّتْ إِلَيْهِمْ ۖ قَالُوا يَا أَبَانَا مَا نَبْغِي ۖ هَـٰذِهِ بِضَاعَتُنَا رُدَّتْ إِلَيْنَا ۖ وَنَمِيرُ أَهْلَنَا وَنَحْفَظُ أَخَانَا وَنَزْدَادُ كَيْلَ بَعِيرٍ ۖ ذَٰلِكَ كَيْلٌ يَسِيرٌ"
    },
    {
      "index": "66",
      "text": "قَالَ لَنْ أُرْسِلَهُ مَعَكُمْ حَتَّىٰ تُؤْتُونِ مَوْثِقًا مِّنَ اللَّهِ لَتَأْتُنَّنِي بِهِ إِلَّا أَن يُحَاطَ بِكُمْ ۖ فَلَمَّا آتَوْهُ مَوْثِقَهُمْ قَالَ اللَّهُ عَلَىٰ مَا نَقُولُ وَكِيلٌ"
    },
    {
      "index": "67",
      "text": "وَقَالَ يَا بَنِيَّ لَا تَدْخُلُوا مِن بَابٍ وَاحِدٍ وَادْخُلُوا مِنْ أَبْوَابٍ مُّتَفَرِّقَةٍ ۖ وَمَا أُغْنِي عَنكُم مِّنَ اللَّهِ مِن شَيْءٍ ۖ إِنِ الْحُكْمُ إِلَّا لِلَّهِ ۖ عَلَيْهِ تَوَكَّلْتُ ۖ وَعَلَيْهِ فَلْيَتَوَكَّلِ الْمُتَوَكِّلُونَ"
    },
    {
      "index": "68",
      "text": "وَلَمَّا دَخَلُوا مِنْ حَيْثُ أَمَرَهُمْ أَبُوهُم مَّا كَانَ يُغْنِي عَنْهُم مِّنَ اللَّهِ مِن شَيْءٍ إِلَّا حَاجَةً فِي نَفْسِ يَعْقُوبَ قَضَاهَا ۚ وَإِنَّهُ لَذُو عِلْمٍ لِّمَا عَلَّمْنَاهُ وَلَـٰكِنَّ أَكْثَرَ النَّاسِ لَا يَعْلَمُونَ"
    },
    {
      "index": "69",
      "text": "وَلَمَّا دَخَلُوا عَلَىٰ يُوسُفَ آوَىٰ إِلَيْهِ أَخَاهُ ۖ قَالَ إِنِّي أَنَا أَخُوكَ فَلَا تَبْتَئِسْ بِمَا كَانُوا يَعْمَلُونَ"
    },
    {
      "index": "70",
      "text": "فَلَمَّا جَهَّزَهُم بِجَهَازِهِمْ جَعَلَ السِّقَايَةَ فِي رَحْلِ أَخِيهِ ثُمَّ أَذَّنَ مُؤَذِّنٌ أَيَّتُهَا الْعِيرُ إِنَّكُمْ لَسَارِقُونَ"
    },
    {
      "index": "71",
      "text": "قَالُوا وَأَقْبَلُوا عَلَيْهِم مَّاذَا تَفْقِدُونَ"
    },
    {
      "index": "72",
      "text": "قَالُوا نَفْقِدُ صُوَاعَ الْمَلِكِ وَلِمَن جَاءَ بِهِ حِمْلُ بَعِيرٍ وَأَنَا بِهِ زَعِيمٌ"
    },
    {
      "index": "73",
      "text": "قَالُوا تَاللَّهِ لَقَدْ عَلِمْتُم مَّا جِئْنَا لِنُفْسِدَ فِي الْأَرْضِ وَمَا كُنَّا سَارِقِينَ"
    },
    {
      "index": "74",
      "text": "قَالُوا فَمَا جَزَاؤُهُ إِن كُنتُمْ كَاذِبِينَ"
    },
    {
      "index": "75",
      "text": "قَالُوا جَزَاؤُهُ مَن وُجِدَ فِي رَحْلِهِ فَهُوَ جَزَاؤُهُ ۚ كَذَٰلِكَ نَجْزِي الظَّالِمِينَ"
    },
    {
      "index": "76",
      "text": "فَبَدَأَ بِأَوْعِيَتِهِمْ قَبْلَ وِعَاءِ أَخِيهِ ثُمَّ اسْتَخْرَجَهَا مِن وِعَاءِ أَخِيهِ ۚ كَذَٰلِكَ كِدْنَا لِيُوسُفَ ۖ مَا كَانَ لِيَأْخُذَ أَخَاهُ فِي دِينِ الْمَلِكِ إِلَّا أَن يَشَاءَ اللَّهُ ۚ نَرْفَعُ دَرَجَاتٍ مَّن نَّشَاءُ ۗ وَفَوْقَ كُلِّ ذِي عِلْمٍ عَلِيمٌ"
    },
    {
      "index": "77",
      "text": "۞ قَالُوا إِن يَسْرِقْ فَقَدْ سَرَقَ أَخٌ لَّهُ مِن قَبْلُ ۚ فَأَسَرَّهَا يُوسُفُ فِي نَفْسِهِ وَلَمْ يُبْدِهَا لَهُمْ ۚ قَالَ أَنتُمْ شَرٌّ مَّكَانًا ۖ وَاللَّهُ أَعْلَمُ بِمَا تَصِفُونَ"
    },
    {
      "index": "78",
      "text": "قَالُوا يَا أَيُّهَا الْعَزِيزُ إِنَّ لَهُ أَبًا شَيْخًا كَبِيرًا فَخُذْ أَحَدَنَا مَكَانَهُ ۖ إِنَّا نَرَاكَ مِنَ الْمُحْسِنِينَ"
    },
    {
      "index": "79",
      "text": "قَالَ مَعَاذَ اللَّهِ أَن نَّأْخُذَ إِلَّا مَن وَجَدْنَا مَتَاعَنَا عِندَهُ إِنَّا إِذًا لَّظَالِمُونَ"
    },
    {
      "index": "80",
      "text": "فَلَمَّا اسْتَيْأَسُوا مِنْهُ خَلَصُوا نَجِيًّا ۖ قَالَ كَبِيرُهُمْ أَلَمْ تَعْلَمُوا أَنَّ أَبَاكُمْ قَدْ أَخَذَ عَلَيْكُم مَّوْثِقًا مِّنَ اللَّهِ وَمِن قَبْلُ مَا فَرَّطتُمْ فِي يُوسُفَ ۖ فَلَنْ أَبْرَحَ الْأَرْضَ حَتَّىٰ يَأْذَنَ لِي أَبِي أَوْ يَحْكُمَ اللَّهُ لِي ۖ وَهُوَ خَيْرُ الْحَاكِمِينَ"
    },
    {
      "index": "81",
      "text": "ارْجِعُوا إِلَىٰ أَبِيكُمْ فَقُولُوا يَا أَبَانَا إِنَّ ابْنَكَ سَرَقَ وَمَا شَهِدْنَا إِلَّا بِمَا عَلِمْنَا وَمَا كُنَّا لِلْغَيْبِ حَافِظِينَ"
    },
    {
      "index": "82",
      "text": "وَاسْأَلِ الْقَرْيَةَ الَّتِي كُنَّا فِيهَا وَالْعِيرَ الَّتِي أَقْبَلْنَا فِيهَا ۖ وَإِنَّا لَصَادِقُونَ"
    },
    {
      "index": "83",
      "text": "قَالَ بَلْ سَوَّلَتْ لَكُمْ أَنفُسُكُمْ أَمْرًا ۖ فَصَبْرٌ جَمِيلٌ ۖ عَسَى اللَّهُ أَن يَأْتِيَنِي بِهِمْ جَمِيعًا ۚ إِنَّهُ هُوَ الْعَلِيمُ الْحَكِيمُ"
    },
    {
      "index": "84",
      "text": "وَتَوَلَّىٰ عَنْهُمْ وَقَالَ يَا أَسَفَىٰ عَلَىٰ يُوسُفَ وَابْيَضَّتْ عَيْنَاهُ مِنَ الْحُزْنِ فَهُوَ كَظِيمٌ"
    },
    {
      "index": "85",
      "text": "قَالُوا تَاللَّهِ تَفْتَأُ تَذْكُرُ يُوسُفَ حَتَّىٰ تَكُونَ حَرَضًا أَوْ تَكُونَ مِنَ الْهَالِكِينَ"
    },
    {
      "index": "86",
      "text": "قَالَ إِنَّمَا أَشْكُو بَثِّي وَحُزْنِي إِلَى اللَّهِ وَأَعْلَمُ مِنَ اللَّهِ مَا لَا تَعْلَمُونَ"
    },
    {
      "index": "87",
      "text": "يَا بَنِيَّ اذْهَبُوا فَتَحَسَّسُوا مِن يُوسُفَ وَأَخِيهِ وَلَا تَيْأَسُوا مِن رَّوْحِ اللَّهِ ۖ إِنَّهُ لَا يَيْأَسُ مِن رَّوْحِ اللَّهِ إِلَّا الْقَوْمُ الْكَافِرُونَ"
    },
    {
      "index": "88",
      "text": "فَلَمَّا دَخَلُوا عَلَيْهِ قَالُوا يَا أَيُّهَا الْعَزِيزُ مَسَّنَا وَأَهْلَنَا الضُّرُّ وَجِئْنَا بِبِضَاعَةٍ مُّزْجَاةٍ فَأَوْفِ لَنَا الْكَيْلَ وَتَصَدَّقْ عَلَيْنَا ۖ إِنَّ اللَّهَ يَجْزِي الْمُتَصَدِّقِينَ"
    },
    {
      "index": "89",
      "text": "قَالَ هَلْ عَلِمْتُم مَّا فَعَلْتُم بِيُوسُفَ وَأَخِيهِ إِذْ أَنتُمْ جَاهِلُونَ"
    },
    {
      "index": "90",
      "text": "قَالُوا أَإِنَّكَ لَأَنتَ يُوسُفُ ۖ قَالَ أَنَا يُوسُفُ وَهَـٰذَا أَخِي ۖ قَدْ مَنَّ اللَّهُ عَلَيْنَا ۖ إِنَّهُ مَن يَتَّقِ وَيَصْبِرْ فَإِنَّ اللَّهَ لَا يُضِيعُ أَجْرَ الْمُحْسِنِينَ"
    },
    {
      "index": "91",
      "text": "قَالُوا تَاللَّهِ لَقَدْ آثَرَكَ اللَّهُ عَلَيْنَا وَإِن كُنَّا لَخَاطِئِينَ"
    },
    {
      "index": "92",
      "text": "قَالَ لَا تَثْرِيبَ عَلَيْكُمُ الْيَوْمَ ۖ يَغْفِرُ اللَّهُ لَكُمْ ۖ وَهُوَ أَرْحَمُ الرَّاحِمِينَ"
    },
    {
      "index": "93",
      "text": "اذْهَبُوا بِقَمِيصِي هَـٰذَا فَأَلْقُوهُ عَلَىٰ وَجْهِ أَبِي يَأْتِ بَصِيرًا وَأْتُونِي بِأَهْلِكُمْ أَجْمَعِينَ"
    },
    {
      "index": "94",
      "text": "وَلَمَّا فَصَلَتِ الْعِيرُ قَالَ أَبُوهُمْ إِنِّي لَأَجِدُ رِيحَ يُوسُفَ ۖ لَوْلَا أَن تُفَنِّدُونِ"
    },
    {
      "index": "95",
      "text": "قَالُوا تَاللَّهِ إِنَّكَ لَفِي ضَلَالِكَ الْقَدِيمِ"
    },
    {
      "index": "96",
      "text": "فَلَمَّا أَن جَاءَ الْبَشِيرُ أَلْقَاهُ عَلَىٰ وَجْهِهِ فَارْتَدَّ بَصِيرًا ۖ قَالَ أَلَمْ أَقُل لَّكُمْ إِنِّي أَعْلَمُ مِنَ اللَّهِ مَا لَا تَعْلَمُونَ"
    },
    {
      "index": "97",
      "text": "قَالُوا يَا أَبَانَا اسْتَغْفِرْ لَنَا ذُنُوبَنَا إِنَّا كُنَّا خَاطِئِينَ"
    },
    {
      "index": "98",
      "text": "قَالَ سَوْفَ أَسْتَغْفِرُ لَكُمْ رَبِّي ۖ إِنَّهُ هُوَ الْغَفُورُ الرَّحِيمُ"
    },
    {
      "index": "99",
      "text": "فَلَمَّا دَخَلُوا عَلَىٰ يُوسُفَ آوَىٰ إِلَيْهِ أَبَوَيْهِ وَقَالَ ادْخُلُوا مِصْرَ إِن شَاءَ اللَّهُ آمِنِينَ"
    },
    {
      "index": "100",
      "text": "وَرَفَعَ أَبَوَيْهِ عَلَى الْعَرْشِ وَخَرُّوا لَهُ سُجَّدًا ۖ وَقَالَ يَا أَبَتِ هَـٰذَا تَأْوِيلُ رُؤْيَايَ مِن قَبْلُ قَدْ جَعَلَهَا رَبِّي حَقًّا ۖ وَقَدْ أَحْسَنَ بِي إِذْ أَخْرَجَنِي مِنَ السِّجْنِ وَجَاءَ بِكُم مِّنَ الْبَدْوِ مِن بَعْدِ أَن نَّزَغَ الشَّيْطَانُ بَيْنِي وَبَيْنَ إِخْوَتِي ۚ إِنَّ رَبِّي لَطِيفٌ لِّمَا يَشَاءُ ۚ إِنَّهُ هُوَ الْعَلِيمُ الْحَكِيمُ"
    },
    {
      "index": "101",
      "text": "۞ رَبِّ قَدْ آتَيْتَنِي مِنَ الْمُلْكِ وَعَلَّمْتَنِي مِن تَأْوِيلِ الْأَحَادِيثِ ۚ فَاطِرَ السَّمَاوَاتِ وَالْأَرْضِ أَنتَ وَلِيِّي فِي الدُّنْيَا وَالْآخِرَةِ ۖ تَوَفَّنِي مُسْلِمًا وَأَلْحِقْنِي بِالصَّالِحِينَ"
    },
    {
      "index": "102",
      "text": "ذَٰلِكَ مِنْ أَنبَاءِ الْغَيْبِ نُوحِيهِ إِلَيْكَ ۖ وَمَا كُنتَ لَدَيْهِمْ إِذْ أَجْمَعُوا أَمْرَهُمْ وَهُمْ يَمْكُرُونَ"
    },
    {
      "index": "103",
      "text": "وَمَا أَكْثَرُ النَّاسِ وَلَوْ حَرَصْتَ بِمُؤْمِنِينَ"
    },
    {
      "index": "104",
      "text": "وَمَا تَسْأَلُهُمْ عَلَيْهِ مِنْ أَجْرٍ ۚ إِنْ هُوَ إِلَّا ذِكْرٌ لِّلْعَالَمِينَ"
    },
    {
      "index": "105",
      "text": "وَكَأَيِّن مِّنْ آيَةٍ فِي السَّمَاوَاتِ وَالْأَرْضِ يَمُرُّونَ عَلَيْهَا وَهُمْ عَنْهَا مُعْرِضُونَ"
    },
    {
      "index": "106",
      "text": "وَمَا يُؤْمِنُ أَكْثَرُهُم بِاللَّهِ إِلَّا وَهُم مُّشْرِكُونَ"
    },
    {
      "index": "107",
      "text": "أَفَأَمِنُوا أَن تَأْتِيَهُمْ غَاشِيَةٌ مِّنْ عَذَابِ اللَّهِ أَوْ تَأْتِيَهُمُ السَّاعَةُ بَغْتَةً وَهُمْ لَا يَشْعُرُونَ"
    },
    {
      "index": "108",
      "text": "قُلْ هَـٰذِهِ سَبِيلِي أَدْعُو إِلَى اللَّهِ ۚ عَلَىٰ بَصِيرَةٍ أَنَا وَمَنِ اتَّبَعَنِي ۖ وَسُبْحَانَ اللَّهِ وَمَا أَنَا مِنَ الْمُشْرِكِينَ"
    },
    {
      "index": "109",
      "text": "وَمَا أَرْسَلْنَا مِن قَبْلِكَ إِلَّا رِجَالًا نُّوحِي إِلَيْهِم مِّنْ أَهْلِ الْقُرَىٰ ۗ أَفَلَمْ يَسِيرُوا فِي الْأَرْضِ فَيَنظُرُوا كَيْفَ كَانَ عَاقِبَةُ الَّذِينَ مِن قَبْلِهِمْ ۗ وَلَدَارُ الْآخِرَةِ خَيْرٌ لِّلَّذِينَ اتَّقَوْا ۗ أَفَلَا تَعْقِلُونَ"
    },
    {
      "index": "110",
      "text": "حَتَّىٰ إِذَا اسْتَيْأَسَ الرُّسُلُ وَظَنُّوا أَنَّهُمْ قَدْ كُذِبُوا جَاءَهُمْ نَصْرُنَا فَنُجِّيَ مَن نَّشَاءُ ۖ وَلَا يُرَدُّ بَأْسُنَا عَنِ الْقَوْمِ الْمُجْرِمِينَ"
    },
    {
      "index": "111",
      "text": "لَقَدْ كَانَ فِي قَصَصِهِمْ عِبْرَةٌ لِّأُولِي الْأَلْبَابِ ۗ مَا كَانَ حَدِيثًا يُفْتَرَىٰ وَلَـٰكِن تَصْدِيقَ الَّذِي بَيْنَ يَدَيْهِ وَتَفْصِيلَ كُلِّ شَيْءٍ وَهُدًى وَرَحْمَةً لِّقَوْمٍ يُؤْمِنُونَ"
    }
  ],
  "index": "12",
  "name": "يوسف",
  "copyright": "# PLEASE DO NOT REMOVE OR CHANGE THIS COPYRIGHT BLOCK \n#==================================================================== \n#\n#  Tanzil Quran Text (Simple, Version 1.1)\n#  Copyright (C) 2007-2022 Tanzil Project\n#  License: Creative Commons Attribution 3.0\n#\n#  This copy of the Quran text is carefully produced, highly \n#  verified and continuously monitored by a group of specialists \n#  at Tanzil Project.\n#\n#  TERMS OF USE:\n#\n#  - Permission is granted to copy and distribute verbatim copies \n#    of this text, but CHANGING IT IS NOT ALLOWED.\n#\n#  - This Quran text can be used in any website or application, \n#    provided that its source (Tanzil Project) is clearly indicated, \n#    and a link is made to tanzil.net to enable users to keep\n#    track of changes.\n#\n#  - This copyright notice shall be included in all verbatim copies \n#    of the text, and shall be reproduced appropriately in all files \n#    derived from or containing substantial portion of this text.\n#\n#  Please check updates at: http://tanzil.net/updates/\n#\n#====================================================================\n",
  "type": "simple",
  "version": "1.1"
}