{
  "aya": [
    {
      "index": "1",
      "text": "لا أقسم بيوم القيامة",
      "bismillah": "بسم الله الرحمن الرحيم"
    },
    {
      "index": "2",
      "text": "ولا أقسم بالنفس اللوامة"
    },
    {
      "index": "3",
      "text": "أيحسب الإنسان ألن نجمع عظامه"
    },
    {
      "index": "4",
      "text": "بلى قادرين على أن نسوي بنانه"
    },
    {
      "index": "5",
      "text": "بل يريد الإنسان ليفجر أمامه"
    },
    {
      "index": "6",
      "text": "يسأل أيان يوم القيامة"
    },
    {
      "index": "7",
      "text": "فإذا برق البصر"
    },
    {
      "index": "8",
      "text": "وخسف القمر"
    },
    {
      "index": "9",
      "text": "وجمع الشمس والقمر"
    },
    {
      "index": "10",
      "text": "يقول الإنسان يومئذ أين المفر"
    },
    {
      "index": "11",
      "text": "كلا لا وزر"
    },
    {
      "index": "12",
      "text": "إلى ربك يومئذ المستقر"
    },
    {
      "index": "13",
      "text": "ينبأ الإنسان يومئذ بما قدم وأخر"
    },
    {
      "index": "14",
      "text": "بل الإنسان على نفسه بصيرة"
    },
    {
      "index": "15",
      "text": "ولو ألقى معاذيره"
    },
    {
      "index": "16",
      "text": "لا تحرك به لسانك لتعجل به"
    },
    {
      "index": "17",
      "text": "إن علينا جمعه وقرآنه"
    },
    {
      "index": "18",
      "text": "فإذا قرأناه فاتبع قرآنه"
    },
    {
      "index": "19",
      "text": "ثم إن علينا بيانه"
    },
    {
      "index": "20",
      "text": "كلا بل تحبون العاجلة"
    },
    {
      "index": "21",
      "text": "وتذرون الآخرة"
    },
    {
      "index": "22",
      "text": "وجوه يومئذ ناضرة"
    },
    {
      "index": "23",
      "text": "إلى ربها ناظرة"
    },
    {
      "index": "24",
      "text": "ووجوه يومئذ باسرة"
    },
    {
      "index": "25",
      "text": "تظن أن يفعل بها فاقرة"
    },
    {
      "index": "26",
      "text": "كلا إذا بلغت التراقي"
    },
    {
      "index": "27",
      "text": "وقيل من ۜ راق"
    },
    {
      "index": "28",
      "text": "وظن أنه الفراق"
    },
    {
      "index": "29",
      "text": "والتفت الساق بالساق"
    },
    {
      "index": "30",
      "text": "إلى ربك يومئذ المساق"
    },
    {
      "index": "31",
      "text": "فلا صدق ولا صلى"
    },
    {
      "index": "32",
      "text": "ولكن كذب وتولى"
    },
    {
      "index": "33",
      "text": "ثم ذهب إلى أهله يتمطى"
    },
    {
      "index": "34",
      "text": "أولى لك فأولى"
    },
    {
      "index": "35",
      "text": "ثم أولى لك فأولى"
    },
    {
      "index": "36",
      "text": "أيحسب الإنسان أن يترك سدى"
    },
    {
      "index": "37",
      "text": "ألم يك نطفة من مني يمنى"
    },
    {
      "index": "38",
      "text": "ثم كان علقة فخلق فسوى"
    },
    {
      "index": "39",
      "text": "فجعل منه الزوجين الذكر والأنثى"
    },
    {
      "index": "40",
      "text": "أليس ذلك بقادر على أن يحيي الموتى"
    }
  ],
  "index": "75",
  "name": "القيامة",
  "copyright": "# PLEASE DO NOT REMOVE OR CHANGE THIS COPYRIGHT BLOCK \n#==================================================================== \n#\n#  Tanzil Quran Text (Simple Clean, Version 1.1)\n#  Copyright (C) 2007-2022 Tanzil Project\n#  License: Creative Commons Attribution 3.0\n#\n#  This copy of the Quran text is carefully produced, highly \n#  verified and continuously monitored by a group of specialists \n#  at Tanzil Project.\n#\n#  TERMS OF USE:\n#\n#  - Permission is granted to copy and distribute verbatim copies \n#    of this text, but CHANGING IT IS NOT ALLOWED.\n#\n#  - This Quran text can be used in any website or application, \n#    provided that its source (Tanzil Project) is clearly indicated, \n#    and a link is made to tanzil.net to enable users to keep\n#    track of changes.\n#\n#  - This copyright notice shall be included in all verbatim copies \n#    of the text, and shall be reproduced appropriately in all files \n#    derived from or containing substantial portion of this text.\n#\n#  Please check updates at: http://tanzil.net/updates/\n#\n#====================================================================\n",
  "type": "simple-clean",
  "version": "1.1"
}