{
  "aya": [
    {
      "index": "1",
      "text": "حم",
      "bismillah": "بِسمِ اللَّهِ الرَّحمـٰنِ الرَّحيمِ"
    },
    {
      "index": "2",
      "text": "وَالكِتابِ المُبينِ"
    },
    {
      "index": "3",
      "text": "إِنّا جَعَلناهُ قُرآنًا عَرَبِيًّا لَعَلَّكُم تَعقِلونَ"
    },
    {
      "index": "4",
      "text": "وَإِنَّهُ في أُمِّ الكِتابِ لَدَينا لَعَلِيٌّ حَكيمٌ"
    },
    {
      "index": "5",
      "text": "أَفَنَضرِبُ عَنكُمُ الذِّكرَ صَفحًا أَن كُنتُم قَومًا مُسرِفينَ"
    },
    {
      "index": "6",
      "text": "وَكَم أَرسَلنا مِن نَبِيٍّ فِي الأَوَّلينَ"
    },
    {
      "index": "7",
      "text": "وَما يَأتيهِم مِن نَبِيٍّ إِلّا كانوا بِهِ يَستَهزِئونَ"
    },
    {
      "index": "8",
      "text": "فَأَهلَكنا أَشَدَّ مِنهُم بَطشًا وَمَضىٰ مَثَلُ الأَوَّلينَ"
    },
    {
      "index": "9",
      "text": "وَلَئِن سَأَلتَهُم مَن خَلَقَ السَّماواتِ وَالأَرضَ لَيَقولُنَّ خَلَقَهُنَّ العَزيزُ العَليمُ"
    },
    {
      "index": "10",
      "text": "الَّذي جَعَلَ لَكُمُ الأَرضَ مَهدًا وَجَعَلَ لَكُم فيها سُبُلًا لَعَلَّكُم تَهتَدونَ"
    },
    {
      "index": "11",
      "text": "وَالَّذي نَزَّلَ مِنَ السَّماءِ ماءً بِقَدَرٍ فَأَنشَرنا بِهِ بَلدَةً مَيتًا ۚ كَذٰلِكَ تُخرَجونَ"
    },
    {
      "index": "12",
      "text": "وَالَّذي خَلَقَ الأَزواجَ كُلَّها وَجَعَلَ لَكُم مِنَ الفُلكِ وَالأَنعامِ ما تَركَبونَ"
    },
    {
      "index": "13",
      "text": "لِتَستَووا عَلىٰ ظُهورِهِ ثُمَّ تَذكُروا نِعمَةَ رَبِّكُم إِذَا استَوَيتُم عَلَيهِ وَتَقولوا سُبحانَ الَّذي سَخَّرَ لَنا هـٰذا وَما كُنّا لَهُ مُقرِنينَ"
    },
    {
      "index": "14",
      "text": "وَإِنّا إِلىٰ رَبِّنا لَمُنقَلِبونَ"
    },
    {
      "index": "15",
      "text": "وَجَعَلوا لَهُ مِن عِبادِهِ جُزءًا ۚ إِنَّ الإِنسانَ لَكَفورٌ مُبينٌ"
    },
    {
      "index": "16",
      "text": "أَمِ اتَّخَذَ مِمّا يَخلُقُ بَناتٍ وَأَصفاكُم بِالبَنينَ"
    },
    {
      "index": "17",
      "text": "وَإِذا بُشِّرَ أَحَدُهُم بِما ضَرَبَ لِلرَّحمـٰنِ مَثَلًا ظَلَّ وَجهُهُ مُسوَدًّا وَهُوَ كَظيمٌ"
    },
    {
      "index": "18",
      "text": "أَوَمَن يُنَشَّأُ فِي الحِليَةِ وَهُوَ فِي الخِصامِ غَيرُ مُبينٍ"
    },
    {
      "index": "19",
      "text": "وَجَعَلُوا المَلائِكَةَ الَّذينَ هُم عِبادُ الرَّحمـٰنِ إِناثًا ۚ أَشَهِدوا خَلقَهُم ۚ سَتُكتَبُ شَهادَتُهُم وَيُسأَلونَ"
    },
    {
      "index": "20",
      "text": "وَقالوا لَو شاءَ الرَّحمـٰنُ ما عَبَدناهُم ۗ ما لَهُم بِذٰلِكَ مِن عِلمٍ ۖ إِن هُم إِلّا يَخرُصونَ"
    },
    {
      "index": "21",
      "text": "أَم آتَيناهُم كِتابًا مِن قَبلِهِ فَهُم بِهِ مُستَمسِكونَ"
    },
    {
      "index": "22",
      "text": "بَل قالوا إِنّا وَجَدنا آباءَنا عَلىٰ أُمَّةٍ وَإِنّا عَلىٰ آثارِهِم مُهتَدونَ"
    },
    {
      "index": "23",
      "text": "وَكَذٰلِكَ ما أَرسَلنا مِن قَبلِكَ في قَريَةٍ مِن نَذيرٍ إِلّا قالَ مُترَفوها إِنّا وَجَدنا آباءَنا عَلىٰ أُمَّةٍ وَإِنّا عَلىٰ آثارِهِم مُقتَدونَ"
    },
    {
      "index": "24",
      "text": "۞ قالَ أَوَلَو جِئتُكُم بِأَهدىٰ مِمّا وَجَدتُم عَلَيهِ آباءَكُم ۖ قالوا إِنّا بِما أُرسِلتُم بِهِ كافِرونَ"
    },
    {
      "index": "25",
      "text": "فَانتَقَمنا مِنهُم ۖ فَانظُر كَيفَ كانَ عاقِبَةُ المُكَذِّبينَ"
    },
    {
      "index": "26",
      "text": "وَإِذ قالَ إِبراهيمُ لِأَبيهِ وَقَومِهِ إِنَّني بَراءٌ مِمّا تَعبُدونَ"
    },
    {
      "index": "27",
      "text": "إِلَّا الَّذي فَطَرَني فَإِنَّهُ سَيَهدينِ"
    },
    {
      "index": "28",
      "text": "وَجَعَلَها كَلِمَةً باقِيَةً في عَقِبِهِ لَعَلَّهُم يَرجِعونَ"
    },
    {
      "index": "29",
      "text": "بَل مَتَّعتُ هـٰؤُلاءِ وَآباءَهُم حَتّىٰ جاءَهُمُ الحَقُّ وَرَسولٌ مُبينٌ"
    },
    {
      "index": "30",
      "text": "وَلَمّا جاءَهُمُ الحَقُّ قالوا هـٰذا سِحرٌ وَإِنّا بِهِ كافِرونَ"
    },
    {
      "index": "31",
      "text": "وَقالوا لَولا نُزِّلَ هـٰذَا القُرآنُ عَلىٰ رَجُلٍ مِنَ القَريَتَينِ عَظيمٍ"
    },
    {
      "index": "32",
      "text": "أَهُم يَقسِمونَ رَحمَتَ رَبِّكَ ۚ نَحنُ قَسَمنا بَينَهُم مَعيشَتَهُم فِي الحَياةِ الدُّنيا ۚ وَرَفَعنا بَعضَهُم فَوقَ بَعضٍ دَرَجاتٍ لِيَتَّخِذَ بَعضُهُم بَعضًا سُخرِيًّا ۗ وَرَحمَتُ رَبِّكَ خَيرٌ مِمّا يَجمَعونَ"
    },
    {
      "index": "33",
      "text": "وَلَولا أَن يَكونَ النّاسُ أُمَّةً واحِدَةً لَجَعَلنا لِمَن يَكفُرُ بِالرَّحمـٰنِ لِبُيوتِهِم سُقُفًا مِن فِضَّةٍ وَمَعارِجَ عَلَيها يَظهَرونَ"
    },
    {
      "index": "34",
      "text": "وَلِبُيوتِهِم أَبوابًا وَسُرُرًا عَلَيها يَتَّكِئونَ"
    },
    {
      "index": "35",
      "text": "وَزُخرُفًا ۚ وَإِن كُلُّ ذٰلِكَ لَمّا مَتاعُ الحَياةِ الدُّنيا ۚ وَالآخِرَةُ عِندَ رَبِّكَ لِلمُتَّقينَ"
    },
    {
      "index": "36",
      "text": "وَمَن يَعشُ عَن ذِكرِ الرَّحمـٰنِ نُقَيِّض لَهُ شَيطانًا فَهُوَ لَهُ قَرينٌ"
    },
    {
      "index": "37",
      "text": "وَإِنَّهُم لَيَصُدّونَهُم عَنِ السَّبيلِ وَيَحسَبونَ أَنَّهُم مُهتَدونَ"
    },
    {
      "index": "38",
      "text": "حَتّىٰ إِذا جاءَنا قالَ يا لَيتَ بَيني وَبَينَكَ بُعدَ المَشرِقَينِ فَبِئسَ القَرينُ"
    },
    {
      "index": "39",
      "text": "وَلَن يَنفَعَكُمُ اليَومَ إِذ ظَلَمتُم أَنَّكُم فِي العَذابِ مُشتَرِكونَ"
    },
    {
      "index": "40",
      "text": "أَفَأَنتَ تُسمِعُ الصُّمَّ أَو تَهدِي العُميَ وَمَن كانَ في ضَلالٍ مُبينٍ"
    },
    {
      "index": "41",
      "text": "فَإِمّا نَذهَبَنَّ بِكَ فَإِنّا مِنهُم مُنتَقِمونَ"
    },
    {
      "index": "42",
      "text": "أَو نُرِيَنَّكَ الَّذي وَعَدناهُم فَإِنّا عَلَيهِم مُقتَدِرونَ"
    },
    {
      "index": "43",
      "text": "فَاستَمسِك بِالَّذي أوحِيَ إِلَيكَ ۖ إِنَّكَ عَلىٰ صِراطٍ مُستَقيمٍ"
    },
    {
      "index": "44",
      "text": "وَإِنَّهُ لَذِكرٌ لَكَ وَلِقَومِكَ ۖ وَسَوفَ تُسأَلونَ"
    },
    {
      "index": "45",
      "text": "وَاسأَل مَن أَرسَلنا مِن قَبلِكَ مِن رُسُلِنا أَجَعَلنا مِن دونِ الرَّحمـٰنِ آلِهَةً يُعبَدونَ"
    },
    {
      "index": "46",
      "text": "وَلَقَد أَرسَلنا موسىٰ بِآياتِنا إِلىٰ فِرعَونَ وَمَلَئِهِ فَقالَ إِنّي رَسولُ رَبِّ العالَمينَ"
    },
    {
      "index": "47",
      "text": "فَلَمّا جاءَهُم بِآياتِنا إِذا هُم مِنها يَضحَكونَ"
    },
    {
      "index": "48",
      "text": "وَما نُريهِم مِن آيَةٍ إِلّا هِيَ أَكبَرُ مِن أُختِها ۖ وَأَخَذناهُم بِالعَذابِ لَعَلَّهُم يَرجِعونَ"
    },
    {
      "index": "49",
      "text": "وَقالوا يا أَيُّهَ السّاحِرُ ادعُ لَنا رَبَّكَ بِما عَهِدَ عِندَكَ إِنَّنا لَمُهتَدونَ"
    },
    {
      "index": "50",
      "text": "فَلَمّا كَشَفنا عَنهُمُ العَذابَ إِذا هُم يَنكُثونَ"
    },
    {
      "index": "51",
      "text": "وَنادىٰ فِرعَونُ في قَومِهِ قالَ يا قَومِ أَلَيسَ لي مُلكُ مِصرَ وَهـٰذِهِ الأَنهارُ تَجري مِن تَحتي ۖ أَفَلا تُبصِرونَ"
    },
    {
      "index": "52",
      "text": "أَم أَنا خَيرٌ مِن هـٰذَا الَّذي هُوَ مَهينٌ وَلا يَكادُ يُبينُ"
    },
    {
      "index": "53",
      "text": "فَلَولا أُلقِيَ عَلَيهِ أَسوِرَةٌ مِن ذَهَبٍ أَو جاءَ مَعَهُ المَلائِكَةُ مُقتَرِنينَ"
    },
    {
      "index": "54",
      "text": "فَاستَخَفَّ قَومَهُ فَأَطاعوهُ ۚ إِنَّهُم كانوا قَومًا فاسِقينَ"
    },
    {
      "index": "55",
      "text": "فَلَمّا آسَفونَا انتَقَمنا مِنهُم فَأَغرَقناهُم أَجمَعينَ"
    },
    {
      "index": "56",
      "text": "فَجَعَلناهُم سَلَفًا وَمَثَلًا لِلآخِرينَ"
    },
    {
      "index": "57",
      "text": "۞ وَلَمّا ضُرِبَ ابنُ مَريَمَ مَثَلًا إِذا قَومُكَ مِنهُ يَصِدّونَ"
    },
    {
      "index": "58",
      "text": "وَقالوا أَآلِهَتُنا خَيرٌ أَم هُوَ ۚ ما ضَرَبوهُ لَكَ إِلّا جَدَلًا ۚ بَل هُم قَومٌ خَصِمونَ"
    },
    {
      "index": "59",
      "text": "إِن هُوَ إِلّا عَبدٌ أَنعَمنا عَلَيهِ وَجَعَلناهُ مَثَلًا لِبَني إِسرائيلَ"
    },
    {
      "index": "60",
      "text": "وَلَو نَشاءُ لَجَعَلنا مِنكُم مَلائِكَةً فِي الأَرضِ يَخلُفونَ"
    },
    {
      "index": "61",
      "text": "وَإِنَّهُ لَعِلمٌ لِلسّاعَةِ فَلا تَمتَرُنَّ بِها وَاتَّبِعونِ ۚ هـٰذا صِراطٌ مُستَقيمٌ"
    },
    {
      "index": "62",
      "text": "وَلا يَصُدَّنَّكُمُ الشَّيطانُ ۖ إِنَّهُ لَكُم عَدُوٌّ مُبينٌ"
    },
    {
      "index": "63",
      "text": "وَلَمّا جاءَ عيسىٰ بِالبَيِّناتِ قالَ قَد جِئتُكُم بِالحِكمَةِ وَلِأُبَيِّنَ لَكُم بَعضَ الَّذي تَختَلِفونَ فيهِ ۖ فَاتَّقُوا اللَّهَ وَأَطيعونِ"
    },
    {
      "index": "64",
      "text": "إِنَّ اللَّهَ هُوَ رَبّي وَرَبُّكُم فَاعبُدوهُ ۚ هـٰذا صِراطٌ مُستَقيمٌ"
    },
    {
      "index": "65",
      "text": "فَاختَلَفَ الأَحزابُ مِن بَينِهِم ۖ فَوَيلٌ لِلَّذينَ ظَلَموا مِن عَذابِ يَومٍ أَليمٍ"
    },
    {
      "index": "66",
      "text": "هَل يَنظُرونَ إِلَّا السّاعَةَ أَن تَأتِيَهُم بَغتَةً وَهُم لا يَشعُرونَ"
    },
    {
      "index": "67",
      "text": "الأَخِلّاءُ يَومَئِذٍ بَعضُهُم لِبَعضٍ عَدُوٌّ إِلَّا المُتَّقينَ"
    },
    {
      "index": "68",
      "text": "يا عِبادِ لا خَوفٌ عَلَيكُمُ اليَومَ وَلا أَنتُم تَحزَنونَ"
    },
    {
      "index": "69",
      "text": "الَّذينَ آمَنوا بِآياتِنا وَكانوا مُسلِمينَ"
    },
    {
      "index": "70",
      "text": "ادخُلُوا الجَنَّةَ أَنتُم وَأَزواجُكُم تُحبَرونَ"
    },
    {
      "index": "71",
      "text": "يُطافُ عَلَيهِم بِصِحافٍ مِن ذَهَبٍ وَأَكوابٍ ۖ وَفيها ما تَشتَهيهِ الأَنفُسُ وَتَلَذُّ الأَعيُنُ ۖ وَأَنتُم فيها خالِدونَ"
    },
    {
      "index": "72",
      "text": "وَتِلكَ الجَنَّةُ الَّتي أورِثتُموها بِما كُنتُم تَعمَلونَ"
    },
    {
      "index": "73",
      "text": "لَكُم فيها فاكِهَةٌ كَثيرَةٌ مِنها تَأكُلونَ"
    },
    {
      "index": "74",
      "text": "إِنَّ المُجرِمينَ في عَذابِ جَهَنَّمَ خالِدونَ"
    },
    {
      "index": "75",
      "text": "لا يُفَتَّرُ عَنهُم وَهُم فيهِ مُبلِسونَ"
    },
    {
      "index": "76",
      "text": "وَما ظَلَمناهُم وَلـٰكِن كانوا هُمُ الظّالِمينَ"
    },
    {
      "index": "77",
      "text": "وَنادَوا يا مالِكُ لِيَقضِ عَلَينا رَبُّكَ ۖ قالَ إِنَّكُم ماكِثونَ"
    },
    {
      "index": "78",
      "text": "لَقَد جِئناكُم بِالحَقِّ وَلـٰكِنَّ أَكثَرَكُم لِلحَقِّ كارِهونَ"
    },
    {
      "index": "79",
      "text": "أَم أَبرَموا أَمرًا فَإِنّا مُبرِمونَ"
    },
    {
      "index": "80",
      "text": "أَم يَحسَبونَ أَنّا لا نَسمَعُ سِرَّهُم وَنَجواهُم ۚ بَلىٰ وَرُسُلُنا لَدَيهِم يَكتُبونَ"
    },
    {
      "index": "81",
      "text": "قُل إِن كانَ لِلرَّحمـٰنِ وَلَدٌ فَأَنا أَوَّلُ العابِدينَ"
    },
    {
      "index": "82",
      "text": "سُبحانَ رَبِّ السَّماواتِ وَالأَرضِ رَبِّ العَرشِ عَمّا يَصِفونَ"
    },
    {
      "index": "83",
      "text": "فَذَرهُم يَخوضوا وَيَلعَبوا حَتّىٰ يُلاقوا يَومَهُمُ الَّذي يوعَدونَ"
    },
    {
      "index": "84",
      "text": "وَهُوَ الَّذي فِي السَّماءِ إِلـٰهٌ وَفِي الأَرضِ إِلـٰهٌ ۚ وَهُوَ الحَكيمُ العَليمُ"
    },
    {
      "index": "85",
      "text": "وَتَبارَكَ الَّذي لَهُ مُلكُ السَّماواتِ وَالأَرضِ وَما بَينَهُما وَعِندَهُ عِلمُ السّاعَةِ وَإِلَيهِ تُرجَعونَ"
    },
    {
      "index": "86",
      "text": "وَلا يَملِكُ الَّذينَ يَدعونَ مِن دونِهِ الشَّفاعَةَ إِلّا مَن شَهِدَ بِالحَقِّ وَهُم يَعلَمونَ"
    },
    {
      "index": "87",
      "text": "وَلَئِن سَأَلتَهُم مَن خَلَقَهُم لَيَقولُنَّ اللَّهُ ۖ فَأَنّىٰ يُؤفَكونَ"
    },
    {
      "index": "88",
      "text": "وَقيلِهِ يا رَبِّ إِنَّ هـٰؤُلاءِ قَومٌ لا يُؤمِنونَ"
    },
    {
      "index": "89",
      "text": "فَاصفَح عَنهُم وَقُل سَلامٌ ۚ فَسَوفَ يَعلَمونَ"
    }
  ],
  "index": "43",
  "name": "الزخرف",
  "copyright": "# PLEASE DO NOT REMOVE OR CHANGE THIS COPYRIGHT BLOCK \n#==================================================================== \n#\n#  Tanzil Quran Text (Simple Minimal, Version 1.1)\n#  Copyright (C) 2007-2022 Tanzil Project\n#  License: Creative Commons Attribution 3.0\n#\n#  This copy of the Quran text is carefully produced, highly \n#  verified and continuously monitored by a group of specialists \n#  at Tanzil Project.\n#\n#  TERMS OF USE:\n#\n#  - Permission is granted to copy and distribute verbatim copies \n#    of this text, but CHANGING IT IS NOT ALLOWED.\n#\n#  - This Quran text can be used in any website or application, \n#    provided that its source (Tanzil Project) is clearly indicated, \n#    and a link is made to tanzil.net to enable users to keep\n#    track of changes.\n#\n#  - This copyright notice shall be included in all verbatim copies \n#    of the text, and shall be reproduced appropriately in all files \n#    derived from or containing substantial portion of this text.\n#\n#  Please check updates at: http://tanzil.net/updates/\n#\n#====================================================================\n",
  "type": "simple-min",
  "version": "1.1"
}