{
  "aya": [
    {
      "index": "1",
      "text": "الحَمدُ لِلَّهِ فاطِرِ السَّمـٰوٰتِ وَالأَرضِ جاعِلِ المَلـٰئِكَةِ رُسُلًا أُولى أَجنِحَةٍ مَثنىٰ وَثُلـٰثَ وَرُبـٰعَ ۚ يَزيدُ فِى الخَلقِ ما يَشاءُ ۚ إِنَّ اللَّهَ عَلىٰ كُلِّ شَىءٍ قَديرٌ",
      "bismillah": "بِسمِ اللَّهِ الرَّحمـٰنِ الرَّحيمِ"
    },
    {
      "index": "2",
      "text": "ما يَفتَحِ اللَّهُ لِلنّاسِ مِن رَحمَةٍ فَلا مُمسِكَ لَها ۖ وَما يُمسِك فَلا مُرسِلَ لَهُ مِن بَعدِهِ ۚ وَهُوَ العَزيزُ الحَكيمُ"
    },
    {
      "index": "3",
      "text": "يـٰأَيُّهَا النّاسُ اذكُروا نِعمَتَ اللَّهِ عَلَيكُم ۚ هَل مِن خـٰلِقٍ غَيرُ اللَّهِ يَرزُقُكُم مِنَ السَّماءِ وَالأَرضِ ۚ لا إِلـٰهَ إِلّا هُوَ ۖ فَأَنّىٰ تُؤفَكونَ"
    },
    {
      "index": "4",
      "text": "وَإِن يُكَذِّبوكَ فَقَد كُذِّبَت رُسُلٌ مِن قَبلِكَ ۚ وَإِلَى اللَّهِ تُرجَعُ الأُمورُ"
    },
    {
      "index": "5",
      "text": "يـٰأَيُّهَا النّاسُ إِنَّ وَعدَ اللَّهِ حَقٌّ ۖ فَلا تَغُرَّنَّكُمُ الحَيوٰةُ الدُّنيا ۖ وَلا يَغُرَّنَّكُم بِاللَّهِ الغَرورُ"
    },
    {
      "index": "6",
      "text": "إِنَّ الشَّيطـٰنَ لَكُم عَدُوٌّ فَاتَّخِذوهُ عَدُوًّا ۚ إِنَّما يَدعوا حِزبَهُ لِيَكونوا مِن أَصحـٰبِ السَّعيرِ"
    },
    {
      "index": "7",
      "text": "الَّذينَ كَفَروا لَهُم عَذابٌ شَديدٌ ۖ وَالَّذينَ ءامَنوا وَعَمِلُوا الصّـٰلِحـٰتِ لَهُم مَغفِرَةٌ وَأَجرٌ كَبيرٌ"
    },
    {
      "index": "8",
      "text": "أَفَمَن زُيِّنَ لَهُ سوءُ عَمَلِهِ فَرَءاهُ حَسَنًا ۖ فَإِنَّ اللَّهَ يُضِلُّ مَن يَشاءُ وَيَهدى مَن يَشاءُ ۖ فَلا تَذهَب نَفسُكَ عَلَيهِم حَسَرٰتٍ ۚ إِنَّ اللَّهَ عَليمٌ بِما يَصنَعونَ"
    },
    {
      "index": "9",
      "text": "وَاللَّهُ الَّذى أَرسَلَ الرِّيـٰحَ فَتُثيرُ سَحابًا فَسُقنـٰهُ إِلىٰ بَلَدٍ مَيِّتٍ فَأَحيَينا بِهِ الأَرضَ بَعدَ مَوتِها ۚ كَذٰلِكَ النُّشورُ"
    },
    {
      "index": "10",
      "text": "مَن كانَ يُريدُ العِزَّةَ فَلِلَّهِ العِزَّةُ جَميعًا ۚ إِلَيهِ يَصعَدُ الكَلِمُ الطَّيِّبُ وَالعَمَلُ الصّـٰلِحُ يَرفَعُهُ ۚ وَالَّذينَ يَمكُرونَ السَّيِّـٔاتِ لَهُم عَذابٌ شَديدٌ ۖ وَمَكرُ أُولـٰئِكَ هُوَ يَبورُ"
    },
    {
      "index": "11",
      "text": "وَاللَّهُ خَلَقَكُم مِن تُرابٍ ثُمَّ مِن نُطفَةٍ ثُمَّ جَعَلَكُم أَزوٰجًا ۚ وَما تَحمِلُ مِن أُنثىٰ وَلا تَضَعُ إِلّا بِعِلمِهِ ۚ وَما يُعَمَّرُ مِن مُعَمَّرٍ وَلا يُنقَصُ مِن عُمُرِهِ إِلّا فى كِتـٰبٍ ۚ إِنَّ ذٰلِكَ عَلَى اللَّهِ يَسيرٌ"
    },
    {
      "index": "12",
      "text": "وَما يَستَوِى البَحرانِ هـٰذا عَذبٌ فُراتٌ سائِغٌ شَرابُهُ وَهـٰذا مِلحٌ أُجاجٌ ۖ وَمِن كُلٍّ تَأكُلونَ لَحمًا طَرِيًّا وَتَستَخرِجونَ حِليَةً تَلبَسونَها ۖ وَتَرَى الفُلكَ فيهِ مَواخِرَ لِتَبتَغوا مِن فَضلِهِ وَلَعَلَّكُم تَشكُرونَ"
    },
    {
      "index": "13",
      "text": "يولِجُ الَّيلَ فِى النَّهارِ وَيولِجُ النَّهارَ فِى الَّيلِ وَسَخَّرَ الشَّمسَ وَالقَمَرَ كُلٌّ يَجرى لِأَجَلٍ مُسَمًّى ۚ ذٰلِكُمُ اللَّهُ رَبُّكُم لَهُ المُلكُ ۚ وَالَّذينَ تَدعونَ مِن دونِهِ ما يَملِكونَ مِن قِطميرٍ"
    },
    {
      "index": "14",
      "text": "إِن تَدعوهُم لا يَسمَعوا دُعاءَكُم وَلَو سَمِعوا مَا استَجابوا لَكُم ۖ وَيَومَ القِيـٰمَةِ يَكفُرونَ بِشِركِكُم ۚ وَلا يُنَبِّئُكَ مِثلُ خَبيرٍ"
    },
    {
      "index": "15",
      "text": "۞ يـٰأَيُّهَا النّاسُ أَنتُمُ الفُقَراءُ إِلَى اللَّهِ ۖ وَاللَّهُ هُوَ الغَنِىُّ الحَميدُ"
    },
    {
      "index": "16",
      "text": "إِن يَشَأ يُذهِبكُم وَيَأتِ بِخَلقٍ جَديدٍ"
    },
    {
      "index": "17",
      "text": "وَما ذٰلِكَ عَلَى اللَّهِ بِعَزيزٍ"
    },
    {
      "index": "18",
      "text": "وَلا تَزِرُ وازِرَةٌ وِزرَ أُخرىٰ ۚ وَإِن تَدعُ مُثقَلَةٌ إِلىٰ حِملِها لا يُحمَل مِنهُ شَىءٌ وَلَو كانَ ذا قُربىٰ ۗ إِنَّما تُنذِرُ الَّذينَ يَخشَونَ رَبَّهُم بِالغَيبِ وَأَقامُوا الصَّلوٰةَ ۚ وَمَن تَزَكّىٰ فَإِنَّما يَتَزَكّىٰ لِنَفسِهِ ۚ وَإِلَى اللَّهِ المَصيرُ"
    },
    {
      "index": "19",
      "text": "وَما يَستَوِى الأَعمىٰ وَالبَصيرُ"
    },
    {
      "index": "20",
      "text": "وَلَا الظُّلُمـٰتُ وَلَا النّورُ"
    },
    {
      "index": "21",
      "text": "وَلَا الظِّلُّ وَلَا الحَرورُ"
    },
    {
      "index": "22",
      "text": "وَما يَستَوِى الأَحياءُ وَلَا الأَموٰتُ ۚ إِنَّ اللَّهَ يُسمِعُ مَن يَشاءُ ۖ وَما أَنتَ بِمُسمِعٍ مَن فِى القُبورِ"
    },
    {
      "index": "23",
      "text": "إِن أَنتَ إِلّا نَذيرٌ"
    },
    {
      "index": "24",
      "text": "إِنّا أَرسَلنـٰكَ بِالحَقِّ بَشيرًا وَنَذيرًا ۚ وَإِن مِن أُمَّةٍ إِلّا خَلا فيها نَذيرٌ"
    },
    {
      "index": "25",
      "text": "وَإِن يُكَذِّبوكَ فَقَد كَذَّبَ الَّذينَ مِن قَبلِهِم جاءَتهُم رُسُلُهُم بِالبَيِّنـٰتِ وَبِالزُّبُرِ وَبِالكِتـٰبِ المُنيرِ"
    },
    {
      "index": "26",
      "text": "ثُمَّ أَخَذتُ الَّذينَ كَفَروا ۖ فَكَيفَ كانَ نَكيرِ"
    },
    {
      "index": "27",
      "text": "أَلَم تَرَ أَنَّ اللَّهَ أَنزَلَ مِنَ السَّماءِ ماءً فَأَخرَجنا بِهِ ثَمَرٰتٍ مُختَلِفًا أَلوٰنُها ۚ وَمِنَ الجِبالِ جُدَدٌ بيضٌ وَحُمرٌ مُختَلِفٌ أَلوٰنُها وَغَرابيبُ سودٌ"
    },
    {
      "index": "28",
      "text": "وَمِنَ النّاسِ وَالدَّوابِّ وَالأَنعـٰمِ مُختَلِفٌ أَلوٰنُهُ كَذٰلِكَ ۗ إِنَّما يَخشَى اللَّهَ مِن عِبادِهِ العُلَمـٰؤُا۟ ۗ إِنَّ اللَّهَ عَزيزٌ غَفورٌ"
    },
    {
      "index": "29",
      "text": "إِنَّ الَّذينَ يَتلونَ كِتـٰبَ اللَّهِ وَأَقامُوا الصَّلوٰةَ وَأَنفَقوا مِمّا رَزَقنـٰهُم سِرًّا وَعَلانِيَةً يَرجونَ تِجـٰرَةً لَن تَبورَ"
    },
    {
      "index": "30",
      "text": "لِيُوَفِّيَهُم أُجورَهُم وَيَزيدَهُم مِن فَضلِهِ ۚ إِنَّهُ غَفورٌ شَكورٌ"
    },
    {
      "index": "31",
      "text": "وَالَّذى أَوحَينا إِلَيكَ مِنَ الكِتـٰبِ هُوَ الحَقُّ مُصَدِّقًا لِما بَينَ يَدَيهِ ۗ إِنَّ اللَّهَ بِعِبادِهِ لَخَبيرٌ بَصيرٌ"
    },
    {
      "index": "32",
      "text": "ثُمَّ أَورَثنَا الكِتـٰبَ الَّذينَ اصطَفَينا مِن عِبادِنا ۖ فَمِنهُم ظالِمٌ لِنَفسِهِ وَمِنهُم مُقتَصِدٌ وَمِنهُم سابِقٌ بِالخَيرٰتِ بِإِذنِ اللَّهِ ۚ ذٰلِكَ هُوَ الفَضلُ الكَبيرُ"
    },
    {
      "index": "33",
      "text": "جَنّـٰتُ عَدنٍ يَدخُلونَها يُحَلَّونَ فيها مِن أَساوِرَ مِن ذَهَبٍ وَلُؤلُؤًا ۖ وَلِباسُهُم فيها حَريرٌ"
    },
    {
      "index": "34",
      "text": "وَقالُوا الحَمدُ لِلَّهِ الَّذى أَذهَبَ عَنَّا الحَزَنَ ۖ إِنَّ رَبَّنا لَغَفورٌ شَكورٌ"
    },
    {
      "index": "35",
      "text": "الَّذى أَحَلَّنا دارَ المُقامَةِ مِن فَضلِهِ لا يَمَسُّنا فيها نَصَبٌ وَلا يَمَسُّنا فيها لُغوبٌ"
    },
    {
      "index": "36",
      "text": "وَالَّذينَ كَفَروا لَهُم نارُ جَهَنَّمَ لا يُقضىٰ عَلَيهِم فَيَموتوا وَلا يُخَفَّفُ عَنهُم مِن عَذابِها ۚ كَذٰلِكَ نَجزى كُلَّ كَفورٍ"
    },
    {
      "index": "37",
      "text": "وَهُم يَصطَرِخونَ فيها رَبَّنا أَخرِجنا نَعمَل صـٰلِحًا غَيرَ الَّذى كُنّا نَعمَلُ ۚ أَوَلَم نُعَمِّركُم ما يَتَذَكَّرُ فيهِ مَن تَذَكَّرَ وَجاءَكُمُ النَّذيرُ ۖ فَذوقوا فَما لِلظّـٰلِمينَ مِن نَصيرٍ"
    },
    {
      "index": "38",
      "text": "إِنَّ اللَّهَ عـٰلِمُ غَيبِ السَّمـٰوٰتِ وَالأَرضِ ۚ إِنَّهُ عَليمٌ بِذاتِ الصُّدورِ"
    },
    {
      "index": "39",
      "text": "هُوَ الَّذى جَعَلَكُم خَلـٰئِفَ فِى الأَرضِ ۚ فَمَن كَفَرَ فَعَلَيهِ كُفرُهُ ۖ وَلا يَزيدُ الكـٰفِرينَ كُفرُهُم عِندَ رَبِّهِم إِلّا مَقتًا ۖ وَلا يَزيدُ الكـٰفِرينَ كُفرُهُم إِلّا خَسارًا"
    },
    {
      "index": "40",
      "text": "قُل أَرَءَيتُم شُرَكاءَكُمُ الَّذينَ تَدعونَ مِن دونِ اللَّهِ أَرونى ماذا خَلَقوا مِنَ الأَرضِ أَم لَهُم شِركٌ فِى السَّمـٰوٰتِ أَم ءاتَينـٰهُم كِتـٰبًا فَهُم عَلىٰ بَيِّنَتٍ مِنهُ ۚ بَل إِن يَعِدُ الظّـٰلِمونَ بَعضُهُم بَعضًا إِلّا غُرورًا"
    },
    {
      "index": "41",
      "text": "۞ إِنَّ اللَّهَ يُمسِكُ السَّمـٰوٰتِ وَالأَرضَ أَن تَزولا ۚ وَلَئِن زالَتا إِن أَمسَكَهُما مِن أَحَدٍ مِن بَعدِهِ ۚ إِنَّهُ كانَ حَليمًا غَفورًا"
    },
    {
      "index": "42",
      "text": "وَأَقسَموا بِاللَّهِ جَهدَ أَيمـٰنِهِم لَئِن جاءَهُم نَذيرٌ لَيَكونُنَّ أَهدىٰ مِن إِحدَى الأُمَمِ ۖ فَلَمّا جاءَهُم نَذيرٌ ما زادَهُم إِلّا نُفورًا"
    },
    {
      "index": "43",
      "text": "استِكبارًا فِى الأَرضِ وَمَكرَ السَّيِّئِ ۚ وَلا يَحيقُ المَكرُ السَّيِّئُ إِلّا بِأَهلِهِ ۚ فَهَل يَنظُرونَ إِلّا سُنَّتَ الأَوَّلينَ ۚ فَلَن تَجِدَ لِسُنَّتِ اللَّهِ تَبديلًا ۖ وَلَن تَجِدَ لِسُنَّتِ اللَّهِ تَحويلًا"
    },
    {
      "index": "44",
      "text": "أَوَلَم يَسيروا فِى الأَرضِ فَيَنظُروا كَيفَ كانَ عـٰقِبَةُ الَّذينَ مِن قَبلِهِم وَكانوا أَشَدَّ مِنهُم قُوَّةً ۚ وَما كانَ اللَّهُ لِيُعجِزَهُ مِن شَىءٍ فِى السَّمـٰوٰتِ وَلا فِى الأَرضِ ۚ إِنَّهُ كانَ عَليمًا قَديرًا"
    },
    {
      "index": "45",
      "text": "وَلَو يُؤاخِذُ اللَّهُ النّاسَ بِما كَسَبوا ما تَرَكَ عَلىٰ ظَهرِها مِن دابَّةٍ وَلـٰكِن يُؤَخِّرُهُم إِلىٰ أَجَلٍ مُسَمًّى ۖ فَإِذا جاءَ أَجَلُهُم فَإِنَّ اللَّهَ كانَ بِعِبادِهِ بَصيرًا"
    }
  ],
  "index": "35",
  "name": "فاطر",
  "copyright": "# PLEASE DO NOT REMOVE OR CHANGE THIS COPYRIGHT BLOCK \n#==================================================================== \n#\n#  Tanzil Quran Text (Uthmani Minimal, Version 1.1)\n#  Copyright (C) 2007-2022 Tanzil Project\n#  License: Creative Commons Attribution 3.0\n#\n#  This copy of the Quran text is carefully produced, highly \n#  verified and continuously monitored by a group of specialists \n#  at Tanzil Project.\n#\n#  TERMS OF USE:\n#\n#  - Permission is granted to copy and distribute verbatim copies \n#    of this text, but CHANGING IT IS NOT ALLOWED.\n#\n#  - This Quran text can be used in any website or application, \n#    provided that its source (Tanzil Project) is clearly indicated, \n#    and a link is made to tanzil.net to enable users to keep\n#    track of changes.\n#\n#  - This copyright notice shall be included in all verbatim copies \n#    of the text, and shall be reproduced appropriately in all files \n#    derived from or containing substantial portion of this text.\n#\n#  Please check updates at: http://tanzil.net/updates/\n#\n#====================================================================\n",
  "type": "uthmani-min",
  "version": "1.1"
}