{
  "aya": [
    {
      "index": "1",
      "text": "وَالسَّماءِ وَالطّارِقِ",
      "bismillah": "بِسمِ اللَّهِ الرَّحمـٰنِ الرَّحيمِ"
    },
    {
      "index": "2",
      "text": "وَما أَدرىٰكَ مَا الطّارِقُ"
    },
    {
      "index": "3",
      "text": "النَّجمُ الثّاقِبُ"
    },
    {
      "index": "4",
      "text": "إِن كُلُّ نَفسٍ لَمّا عَلَيها حافِظٌ"
    },
    {
      "index": "5",
      "text": "فَليَنظُرِ الإِنسـٰنُ مِمَّ خُلِقَ"
    },
    {
      "index": "6",
      "text": "خُلِقَ مِن ماءٍ دافِقٍ"
    },
    {
      "index": "7",
      "text": "يَخرُجُ مِن بَينِ الصُّلبِ وَالتَّرائِبِ"
    },
    {
      "index": "8",
      "text": "إِنَّهُ عَلىٰ رَجعِهِ لَقادِرٌ"
    },
    {
      "index": "9",
      "text": "يَومَ تُبلَى السَّرائِرُ"
    },
    {
      "index": "10",
      "text": "فَما لَهُ مِن قُوَّةٍ وَلا ناصِرٍ"
    },
    {
      "index": "11",
      "text": "وَالسَّماءِ ذاتِ الرَّجعِ"
    },
    {
      "index": "12",
      "text": "وَالأَرضِ ذاتِ الصَّدعِ"
    },
    {
      "index": "13",
      "text": "إِنَّهُ لَقَولٌ فَصلٌ"
    },
    {
      "index": "14",
      "text": "وَما هُوَ بِالهَزلِ"
    },
    {
      "index": "15",
      "text": "إِنَّهُم يَكيدونَ كَيدًا"
    },
    {
      "index": "16",
      "text": "وَأَكيدُ كَيدًا"
    },
    {
      "index": "17",
      "text": "فَمَهِّلِ الكـٰفِرينَ أَمهِلهُم رُوَيدًا"
    }
  ],
  "index": "86",
  "name": "الطارق",
  "copyright": "# PLEASE DO NOT REMOVE OR CHANGE THIS COPYRIGHT BLOCK \n#==================================================================== \n#\n#  Tanzil Quran Text (Uthmani Minimal, Version 1.1)\n#  Copyright (C) 2007-2022 Tanzil Project\n#  License: Creative Commons Attribution 3.0\n#\n#  This copy of the Quran text is carefully produced, highly \n#  verified and continuously monitored by a group of specialists \n#  at Tanzil Project.\n#\n#  TERMS OF USE:\n#\n#  - Permission is granted to copy and distribute verbatim copies \n#    of this text, but CHANGING IT IS NOT ALLOWED.\n#\n#  - This Quran text can be used in any website or application, \n#    provided that its source (Tanzil Project) is clearly indicated, \n#    and a link is made to tanzil.net to enable users to keep\n#    track of changes.\n#\n#  - This copyright notice shall be included in all verbatim copies \n#    of the text, and shall be reproduced appropriately in all files \n#    derived from or containing substantial portion of this text.\n#\n#  Please check updates at: http://tanzil.net/updates/\n#\n#====================================================================\n",
  "type": "uthmani-min",
  "version": "1.1"
}