{
  "aya": [
    {
      "index": "1",
      "text": "هل أتاك حديث الغاشية",
      "bismillah": "بسم الله الرحمن الرحيم"
    },
    {
      "index": "2",
      "text": "وجوه يومئذ خاشعة"
    },
    {
      "index": "3",
      "text": "عاملة ناصبة"
    },
    {
      "index": "4",
      "text": "تصلى نارا حامية"
    },
    {
      "index": "5",
      "text": "تسقى من عين آنية"
    },
    {
      "index": "6",
      "text": "ليس لهم طعام إلا من ضريع"
    },
    {
      "index": "7",
      "text": "لا يسمن ولا يغني من جوع"
    },
    {
      "index": "8",
      "text": "وجوه يومئذ ناعمة"
    },
    {
      "index": "9",
      "text": "لسعيها راضية"
    },
    {
      "index": "10",
      "text": "في جنة عالية"
    },
    {
      "index": "11",
      "text": "لا تسمع فيها لاغية"
    },
    {
      "index": "12",
      "text": "فيها عين جارية"
    },
    {
      "index": "13",
      "text": "فيها سرر مرفوعة"
    },
    {
      "index": "14",
      "text": "وأكواب موضوعة"
    },
    {
      "index": "15",
      "text": "ونمارق مصفوفة"
    },
    {
      "index": "16",
      "text": "وزرابي مبثوثة"
    },
    {
      "index": "17",
      "text": "أفلا ينظرون إلى الإبل كيف خلقت"
    },
    {
      "index": "18",
      "text": "وإلى السماء كيف رفعت"
    },
    {
      "index": "19",
      "text": "وإلى الجبال كيف نصبت"
    },
    {
      "index": "20",
      "text": "وإلى الأرض كيف سطحت"
    },
    {
      "index": "21",
      "text": "فذكر إنما أنت مذكر"
    },
    {
      "index": "22",
      "text": "لست عليهم بمصيطر"
    },
    {
      "index": "23",
      "text": "إلا من تولى وكفر"
    },
    {
      "index": "24",
      "text": "فيعذبه الله العذاب الأكبر"
    },
    {
      "index": "25",
      "text": "إن إلينا إيابهم"
    },
    {
      "index": "26",
      "text": "ثم إن علينا حسابهم"
    }
  ],
  "index": "88",
  "name": "الغاشية",
  "copyright": "# PLEASE DO NOT REMOVE OR CHANGE THIS COPYRIGHT BLOCK \n#==================================================================== \n#\n#  Tanzil Quran Text (Simple Clean, Version 1.1)\n#  Copyright (C) 2007-2022 Tanzil Project\n#  License: Creative Commons Attribution 3.0\n#\n#  This copy of the Quran text is carefully produced, highly \n#  verified and continuously monitored by a group of specialists \n#  at Tanzil Project.\n#\n#  TERMS OF USE:\n#\n#  - Permission is granted to copy and distribute verbatim copies \n#    of this text, but CHANGING IT IS NOT ALLOWED.\n#\n#  - This Quran text can be used in any website or application, \n#    provided that its source (Tanzil Project) is clearly indicated, \n#    and a link is made to tanzil.net to enable users to keep\n#    track of changes.\n#\n#  - This copyright notice shall be included in all verbatim copies \n#    of the text, and shall be reproduced appropriately in all files \n#    derived from or containing substantial portion of this text.\n#\n#  Please check updates at: http://tanzil.net/updates/\n#\n#====================================================================\n",
  "type": "simple-clean",
  "version": "1.1"
}