{
  "aya": [
    {
      "index": "1",
      "text": "وَالطُّورِ",
      "bismillah": "بِسْمِ اللَّهِ الرَّحْمَـٰنِ الرَّحِيمِ"
    },
    {
      "index": "2",
      "text": "وَكِتَابٍ مَّسْطُورٍ"
    },
    {
      "index": "3",
      "text": "فِي رَقٍّ مَّنشُورٍ"
    },
    {
      "index": "4",
      "text": "وَالْبَيْتِ الْمَعْمُورِ"
    },
    {
      "index": "5",
      "text": "وَالسَّقْفِ الْمَرْفُوعِ"
    },
    {
      "index": "6",
      "text": "وَالْبَحْرِ الْمَسْجُورِ"
    },
    {
      "index": "7",
      "text": "إِنَّ عَذَابَ رَبِّكَ لَوَاقِعٌ"
    },
    {
      "index": "8",
      "text": "مَّا لَهُ مِن دَافِعٍ"
    },
    {
      "index": "9",
      "text": "يَوْمَ تَمُورُ السَّمَاءُ مَوْرًا"
    },
    {
      "index": "10",
      "text": "وَتَسِيرُ الْجِبَالُ سَيْرًا"
    },
    {
      "index": "11",
      "text": "فَوَيْلٌ يَوْمَئِذٍ لِّلْمُكَذِّبِينَ"
    },
    {
      "index": "12",
      "text": "الَّذِينَ هُمْ فِي خَوْضٍ يَلْعَبُونَ"
    },
    {
      "index": "13",
      "text": "يَوْمَ يُدَعُّونَ إِلَىٰ نَارِ جَهَنَّمَ دَعًّا"
    },
    {
      "index": "14",
      "text": "هَـٰذِهِ النَّارُ الَّتِي كُنتُم بِهَا تُكَذِّبُونَ"
    },
    {
      "index": "15",
      "text": "أَفَسِحْرٌ هَـٰذَا أَمْ أَنتُمْ لَا تُبْصِرُونَ"
    },
    {
      "index": "16",
      "text": "اصْلَوْهَا فَاصْبِرُوا أَوْ لَا تَصْبِرُوا سَوَاءٌ عَلَيْكُمْ ۖ إِنَّمَا تُجْزَوْنَ مَا كُنتُمْ تَعْمَلُونَ"
    },
    {
      "index": "17",
      "text": "إِنَّ الْمُتَّقِينَ فِي جَنَّاتٍ وَنَعِيمٍ"
    },
    {
      "index": "18",
      "text": "فَاكِهِينَ بِمَا آتَاهُمْ رَبُّهُمْ وَوَقَاهُمْ رَبُّهُمْ عَذَابَ الْجَحِيمِ"
    },
    {
      "index": "19",
      "text": "كُلُوا وَاشْرَبُوا هَنِيئًا بِمَا كُنتُمْ تَعْمَلُونَ"
    },
    {
      "index": "20",
      "text": "مُتَّكِئِينَ عَلَىٰ سُرُرٍ مَّصْفُوفَةٍ ۖ وَزَوَّجْنَاهُم بِحُورٍ عِينٍ"
    },
    {
      "index": "21",
      "text": "وَالَّذِينَ آمَنُوا وَاتَّبَعَتْهُمْ ذُرِّيَّتُهُم بِإِيمَانٍ أَلْحَقْنَا بِهِمْ ذُرِّيَّتَهُمْ وَمَا أَلَتْنَاهُم مِّنْ عَمَلِهِم مِّن شَيْءٍ ۚ كُلُّ امْرِئٍ بِمَا كَسَبَ رَهِينٌ"
    },
    {
      "index": "22",
      "text": "وَأَمْدَدْنَاهُم بِفَاكِهَةٍ وَلَحْمٍ مِّمَّا يَشْتَهُونَ"
    },
    {
      "index": "23",
      "text": "يَتَنَازَعُونَ فِيهَا كَأْسًا لَّا لَغْوٌ فِيهَا وَلَا تَأْثِيمٌ"
    },
    {
      "index": "24",
      "text": "۞ وَيَطُوفُ عَلَيْهِمْ غِلْمَانٌ لَّهُمْ كَأَنَّهُمْ لُؤْلُؤٌ مَّكْنُونٌ"
    },
    {
      "index": "25",
      "text": "وَأَقْبَلَ بَعْضُهُمْ عَلَىٰ بَعْضٍ يَتَسَاءَلُونَ"
    },
    {
      "index": "26",
      "text": "قَالُوا إِنَّا كُنَّا قَبْلُ فِي أَهْلِنَا مُشْفِقِينَ"
    },
    {
      "index": "27",
      "text": "فَمَنَّ اللَّهُ عَلَيْنَا وَوَقَانَا عَذَابَ السَّمُومِ"
    },
    {
      "index": "28",
      "text": "إِنَّا كُنَّا مِن قَبْلُ نَدْعُوهُ ۖ إِنَّهُ هُوَ الْبَرُّ الرَّحِيمُ"
    },
    {
      "index": "29",
      "text": "فَذَكِّرْ فَمَا أَنتَ بِنِعْمَتِ رَبِّكَ بِكَاهِنٍ وَلَا مَجْنُونٍ"
    },
    {
      "index": "30",
      "text": "أَمْ يَقُولُونَ شَاعِرٌ نَّتَرَبَّصُ بِهِ رَيْبَ الْمَنُونِ"
    },
    {
      "index": "31",
      "text": "قُلْ تَرَبَّصُوا فَإِنِّي مَعَكُم مِّنَ الْمُتَرَبِّصِينَ"
    },
    {
      "index": "32",
      "text": "أَمْ تَأْمُرُهُمْ أَحْلَامُهُم بِهَـٰذَا ۚ أَمْ هُمْ قَوْمٌ طَاغُونَ"
    },
    {
      "index": "33",
      "text": "أَمْ يَقُولُونَ تَقَوَّلَهُ ۚ بَل لَّا يُؤْمِنُونَ"
    },
    {
      "index": "34",
      "text": "فَلْيَأْتُوا بِحَدِيثٍ مِّثْلِهِ إِن كَانُوا صَادِقِينَ"
    },
    {
      "index": "35",
      "text": "أَمْ خُلِقُوا مِنْ غَيْرِ شَيْءٍ أَمْ هُمُ الْخَالِقُونَ"
    },
    {
      "index": "36",
      "text": "أَمْ خَلَقُوا السَّمَاوَاتِ وَالْأَرْضَ ۚ بَل لَّا يُوقِنُونَ"
    },
    {
      "index": "37",
      "text": "أَمْ عِندَهُمْ خَزَائِنُ رَبِّكَ أَمْ هُمُ الْمُصَيْطِرُونَ"
    },
    {
      "index": "38",
      "text": "أَمْ لَهُمْ سُلَّمٌ يَسْتَمِعُونَ فِيهِ ۖ فَلْيَأْتِ مُسْتَمِعُهُم بِسُلْطَانٍ مُّبِينٍ"
    },
    {
      "index": "39",
      "text": "أَمْ لَهُ الْبَنَاتُ وَلَكُمُ الْبَنُونَ"
    },
    {
      "index": "40",
      "text": "أَمْ تَسْأَلُهُمْ أَجْرًا فَهُم مِّن مَّغْرَمٍ مُّثْقَلُونَ"
    },
    {
      "index": "41",
      "text": "أَمْ عِندَهُمُ الْغَيْبُ فَهُمْ يَكْتُبُونَ"
    },
    {
      "index": "42",
      "text": "أَمْ يُرِيدُونَ كَيْدًا ۖ فَالَّذِينَ كَفَرُوا هُمُ الْمَكِيدُونَ"
    },
    {
      "index": "43",
      "text": "أَمْ لَهُمْ إِلَـٰهٌ غَيْرُ اللَّهِ ۚ سُبْحَانَ اللَّهِ عَمَّا يُشْرِكُونَ"
    },
    {
      "index": "44",
      "text": "وَإِن يَرَوْا كِسْفًا مِّنَ السَّمَاءِ سَاقِطًا يَقُولُوا سَحَابٌ مَّرْكُومٌ"
    },
    {
      "index": "45",
      "text": "فَذَرْهُمْ حَتَّىٰ يُلَاقُوا يَوْمَهُمُ الَّذِي فِيهِ يُصْعَقُونَ"
    },
    {
      "index": "46",
      "text": "يَوْمَ لَا يُغْنِي عَنْهُمْ كَيْدُهُمْ شَيْئًا وَلَا هُمْ يُنصَرُونَ"
    },
    {
      "index": "47",
      "text": "وَإِنَّ لِلَّذِينَ ظَلَمُوا عَذَابًا دُونَ ذَٰلِكَ وَلَـٰكِنَّ أَكْثَرَهُمْ لَا يَعْلَمُونَ"
    },
    {
      "index": "48",
      "text": "وَاصْبِرْ لِحُكْمِ رَبِّكَ فَإِنَّكَ بِأَعْيُنِنَا ۖ وَسَبِّحْ بِحَمْدِ رَبِّكَ حِينَ تَقُومُ"
    },
    {
      "index": "49",
      "text": "وَمِنَ اللَّيْلِ فَسَبِّحْهُ وَإِدْبَارَ النُّجُومِ"
    }
  ],
  "index": "52",
  "name": "الطور",
  "copyright": "# PLEASE DO NOT REMOVE OR CHANGE THIS COPYRIGHT BLOCK \n#==================================================================== \n#\n#  Tanzil Quran Text (Simple, Version 1.1)\n#  Copyright (C) 2007-2022 Tanzil Project\n#  License: Creative Commons Attribution 3.0\n#\n#  This copy of the Quran text is carefully produced, highly \n#  verified and continuously monitored by a group of specialists \n#  at Tanzil Project.\n#\n#  TERMS OF USE:\n#\n#  - Permission is granted to copy and distribute verbatim copies \n#    of this text, but CHANGING IT IS NOT ALLOWED.\n#\n#  - This Quran text can be used in any website or application, \n#    provided that its source (Tanzil Project) is clearly indicated, \n#    and a link is made to tanzil.net to enable users to keep\n#    track of changes.\n#\n#  - This copyright notice shall be included in all verbatim copies \n#    of the text, and shall be reproduced appropriately in all files \n#    derived from or containing substantial portion of this text.\n#\n#  Please check updates at: http://tanzil.net/updates/\n#\n#====================================================================\n",
  "type": "simple",
  "version": "1.1"
}