{
  "aya": [
    {
      "index": "1",
      "text": "تبارك الذي نزل الفرقان على عبده ليكون للعالمين نذيرا",
      "bismillah": "بسم الله الرحمن الرحيم"
    },
    {
      "index": "2",
      "text": "الذي له ملك السماوات والأرض ولم يتخذ ولدا ولم يكن له شريك في الملك وخلق كل شيء فقدره تقديرا"
    },
    {
      "index": "3",
      "text": "واتخذوا من دونه آلهة لا يخلقون شيئا وهم يخلقون ولا يملكون لأنفسهم ضرا ولا نفعا ولا يملكون موتا ولا حياة ولا نشورا"
    },
    {
      "index": "4",
      "text": "وقال الذين كفروا إن هذا إلا إفك افتراه وأعانه عليه قوم آخرون ۖ فقد جاءوا ظلما وزورا"
    },
    {
      "index": "5",
      "text": "وقالوا أساطير الأولين اكتتبها فهي تملى عليه بكرة وأصيلا"
    },
    {
      "index": "6",
      "text": "قل أنزله الذي يعلم السر في السماوات والأرض ۚ إنه كان غفورا رحيما"
    },
    {
      "index": "7",
      "text": "وقالوا مال هذا الرسول يأكل الطعام ويمشي في الأسواق ۙ لولا أنزل إليه ملك فيكون معه نذيرا"
    },
    {
      "index": "8",
      "text": "أو يلقى إليه كنز أو تكون له جنة يأكل منها ۚ وقال الظالمون إن تتبعون إلا رجلا مسحورا"
    },
    {
      "index": "9",
      "text": "انظر كيف ضربوا لك الأمثال فضلوا فلا يستطيعون سبيلا"
    },
    {
      "index": "10",
      "text": "تبارك الذي إن شاء جعل لك خيرا من ذلك جنات تجري من تحتها الأنهار ويجعل لك قصورا"
    },
    {
      "index": "11",
      "text": "بل كذبوا بالساعة ۖ وأعتدنا لمن كذب بالساعة سعيرا"
    },
    {
      "index": "12",
      "text": "إذا رأتهم من مكان بعيد سمعوا لها تغيظا وزفيرا"
    },
    {
      "index": "13",
      "text": "وإذا ألقوا منها مكانا ضيقا مقرنين دعوا هنالك ثبورا"
    },
    {
      "index": "14",
      "text": "لا تدعوا اليوم ثبورا واحدا وادعوا ثبورا كثيرا"
    },
    {
      "index": "15",
      "text": "قل أذلك خير أم جنة الخلد التي وعد المتقون ۚ كانت لهم جزاء ومصيرا"
    },
    {
      "index": "16",
      "text": "لهم فيها ما يشاءون خالدين ۚ كان على ربك وعدا مسئولا"
    },
    {
      "index": "17",
      "text": "ويوم يحشرهم وما يعبدون من دون الله فيقول أأنتم أضللتم عبادي هؤلاء أم هم ضلوا السبيل"
    },
    {
      "index": "18",
      "text": "قالوا سبحانك ما كان ينبغي لنا أن نتخذ من دونك من أولياء ولكن متعتهم وآباءهم حتى نسوا الذكر وكانوا قوما بورا"
    },
    {
      "index": "19",
      "text": "فقد كذبوكم بما تقولون فما تستطيعون صرفا ولا نصرا ۚ ومن يظلم منكم نذقه عذابا كبيرا"
    },
    {
      "index": "20",
      "text": "وما أرسلنا قبلك من المرسلين إلا إنهم ليأكلون الطعام ويمشون في الأسواق ۗ وجعلنا بعضكم لبعض فتنة أتصبرون ۗ وكان ربك بصيرا"
    },
    {
      "index": "21",
      "text": "۞ وقال الذين لا يرجون لقاءنا لولا أنزل علينا الملائكة أو نرى ربنا ۗ لقد استكبروا في أنفسهم وعتوا عتوا كبيرا"
    },
    {
      "index": "22",
      "text": "يوم يرون الملائكة لا بشرى يومئذ للمجرمين ويقولون حجرا محجورا"
    },
    {
      "index": "23",
      "text": "وقدمنا إلى ما عملوا من عمل فجعلناه هباء منثورا"
    },
    {
      "index": "24",
      "text": "أصحاب الجنة يومئذ خير مستقرا وأحسن مقيلا"
    },
    {
      "index": "25",
      "text": "ويوم تشقق السماء بالغمام ونزل الملائكة تنزيلا"
    },
    {
      "index": "26",
      "text": "الملك يومئذ الحق للرحمن ۚ وكان يوما على الكافرين عسيرا"
    },
    {
      "index": "27",
      "text": "ويوم يعض الظالم على يديه يقول يا ليتني اتخذت مع الرسول سبيلا"
    },
    {
      "index": "28",
      "text": "يا ويلتى ليتني لم أتخذ فلانا خليلا"
    },
    {
      "index": "29",
      "text": "لقد أضلني عن الذكر بعد إذ جاءني ۗ وكان الشيطان للإنسان خذولا"
    },
    {
      "index": "30",
      "text": "وقال الرسول يا رب إن قومي اتخذوا هذا القرآن مهجورا"
    },
    {
      "index": "31",
      "text": "وكذلك جعلنا لكل نبي عدوا من المجرمين ۗ وكفى بربك هاديا ونصيرا"
    },
    {
      "index": "32",
      "text": "وقال الذين كفروا لولا نزل عليه القرآن جملة واحدة ۚ كذلك لنثبت به فؤادك ۖ ورتلناه ترتيلا"
    },
    {
      "index": "33",
      "text": "ولا يأتونك بمثل إلا جئناك بالحق وأحسن تفسيرا"
    },
    {
      "index": "34",
      "text": "الذين يحشرون على وجوههم إلى جهنم أولئك شر مكانا وأضل سبيلا"
    },
    {
      "index": "35",
      "text": "ولقد آتينا موسى الكتاب وجعلنا معه أخاه هارون وزيرا"
    },
    {
      "index": "36",
      "text": "فقلنا اذهبا إلى القوم الذين كذبوا بآياتنا فدمرناهم تدميرا"
    },
    {
      "index": "37",
      "text": "وقوم نوح لما كذبوا الرسل أغرقناهم وجعلناهم للناس آية ۖ وأعتدنا للظالمين عذابا أليما"
    },
    {
      "index": "38",
      "text": "وعادا وثمود وأصحاب الرس وقرونا بين ذلك كثيرا"
    },
    {
      "index": "39",
      "text": "وكلا ضربنا له الأمثال ۖ وكلا تبرنا تتبيرا"
    },
    {
      "index": "40",
      "text": "ولقد أتوا على القرية التي أمطرت مطر السوء ۚ أفلم يكونوا يرونها ۚ بل كانوا لا يرجون نشورا"
    },
    {
      "index": "41",
      "text": "وإذا رأوك إن يتخذونك إلا هزوا أهذا الذي بعث الله رسولا"
    },
    {
      "index": "42",
      "text": "إن كاد ليضلنا عن آلهتنا لولا أن صبرنا عليها ۚ وسوف يعلمون حين يرون العذاب من أضل سبيلا"
    },
    {
      "index": "43",
      "text": "أرأيت من اتخذ إلهه هواه أفأنت تكون عليه وكيلا"
    },
    {
      "index": "44",
      "text": "أم تحسب أن أكثرهم يسمعون أو يعقلون ۚ إن هم إلا كالأنعام ۖ بل هم أضل سبيلا"
    },
    {
      "index": "45",
      "text": "ألم تر إلى ربك كيف مد الظل ولو شاء لجعله ساكنا ثم جعلنا الشمس عليه دليلا"
    },
    {
      "index": "46",
      "text": "ثم قبضناه إلينا قبضا يسيرا"
    },
    {
      "index": "47",
      "text": "وهو الذي جعل لكم الليل لباسا والنوم سباتا وجعل النهار نشورا"
    },
    {
      "index": "48",
      "text": "وهو الذي أرسل الرياح بشرا بين يدي رحمته ۚ وأنزلنا من السماء ماء طهورا"
    },
    {
      "index": "49",
      "text": "لنحيي به بلدة ميتا ونسقيه مما خلقنا أنعاما وأناسي كثيرا"
    },
    {
      "index": "50",
      "text": "ولقد صرفناه بينهم ليذكروا فأبى أكثر الناس إلا كفورا"
    },
    {
      "index": "51",
      "text": "ولو شئنا لبعثنا في كل قرية نذيرا"
    },
    {
      "index": "52",
      "text": "فلا تطع الكافرين وجاهدهم به جهادا كبيرا"
    },
    {
      "index": "53",
      "text": "۞ وهو الذي مرج البحرين هذا عذب فرات وهذا ملح أجاج وجعل بينهما برزخا وحجرا محجورا"
    },
    {
      "index": "54",
      "text": "وهو الذي خلق من الماء بشرا فجعله نسبا وصهرا ۗ وكان ربك قديرا"
    },
    {
      "index": "55",
      "text": "ويعبدون من دون الله ما لا ينفعهم ولا يضرهم ۗ وكان الكافر على ربه ظهيرا"
    },
    {
      "index": "56",
      "text": "وما أرسلناك إلا مبشرا ونذيرا"
    },
    {
      "index": "57",
      "text": "قل ما أسألكم عليه من أجر إلا من شاء أن يتخذ إلى ربه سبيلا"
    },
    {
      "index": "58",
      "text": "وتوكل على الحي الذي لا يموت وسبح بحمده ۚ وكفى به بذنوب عباده خبيرا"
    },
    {
      "index": "59",
      "text": "الذي خلق السماوات والأرض وما بينهما في ستة أيام ثم استوى على العرش ۚ الرحمن فاسأل به خبيرا"
    },
    {
      "index": "60",
      "text": "وإذا قيل لهم اسجدوا للرحمن قالوا وما الرحمن أنسجد لما تأمرنا وزادهم نفورا ۩"
    },
    {
      "index": "61",
      "text": "تبارك الذي جعل في السماء بروجا وجعل فيها سراجا وقمرا منيرا"
    },
    {
      "index": "62",
      "text": "وهو الذي جعل الليل والنهار خلفة لمن أراد أن يذكر أو أراد شكورا"
    },
    {
      "index": "63",
      "text": "وعباد الرحمن الذين يمشون على الأرض هونا وإذا خاطبهم الجاهلون قالوا سلاما"
    },
    {
      "index": "64",
      "text": "والذين يبيتون لربهم سجدا وقياما"
    },
    {
      "index": "65",
      "text": "والذين يقولون ربنا اصرف عنا عذاب جهنم ۖ إن عذابها كان غراما"
    },
    {
      "index": "66",
      "text": "إنها ساءت مستقرا ومقاما"
    },
    {
      "index": "67",
      "text": "والذين إذا أنفقوا لم يسرفوا ولم يقتروا وكان بين ذلك قواما"
    },
    {
      "index": "68",
      "text": "والذين لا يدعون مع الله إلها آخر ولا يقتلون النفس التي حرم الله إلا بالحق ولا يزنون ۚ ومن يفعل ذلك يلق أثاما"
    },
    {
      "index": "69",
      "text": "يضاعف له العذاب يوم القيامة ويخلد فيه مهانا"
    },
    {
      "index": "70",
      "text": "إلا من تاب وآمن وعمل عملا صالحا فأولئك يبدل الله سيئاتهم حسنات ۗ وكان الله غفورا رحيما"
    },
    {
      "index": "71",
      "text": "ومن تاب وعمل صالحا فإنه يتوب إلى الله متابا"
    },
    {
      "index": "72",
      "text": "والذين لا يشهدون الزور وإذا مروا باللغو مروا كراما"
    },
    {
      "index": "73",
      "text": "والذين إذا ذكروا بآيات ربهم لم يخروا عليها صما وعميانا"
    },
    {
      "index": "74",
      "text": "والذين يقولون ربنا هب لنا من أزواجنا وذرياتنا قرة أعين واجعلنا للمتقين إماما"
    },
    {
      "index": "75",
      "text": "أولئك يجزون الغرفة بما صبروا ويلقون فيها تحية وسلاما"
    },
    {
      "index": "76",
      "text": "خالدين فيها ۚ حسنت مستقرا ومقاما"
    },
    {
      "index": "77",
      "text": "قل ما يعبأ بكم ربي لولا دعاؤكم ۖ فقد كذبتم فسوف يكون لزاما"
    }
  ],
  "index": "25",
  "name": "الفرقان",
  "copyright": "# PLEASE DO NOT REMOVE OR CHANGE THIS COPYRIGHT BLOCK \n#==================================================================== \n#\n#  Tanzil Quran Text (Simple Clean, Version 1.1)\n#  Copyright (C) 2007-2022 Tanzil Project\n#  License: Creative Commons Attribution 3.0\n#\n#  This copy of the Quran text is carefully produced, highly \n#  verified and continuously monitored by a group of specialists \n#  at Tanzil Project.\n#\n#  TERMS OF USE:\n#\n#  - Permission is granted to copy and distribute verbatim copies \n#    of this text, but CHANGING IT IS NOT ALLOWED.\n#\n#  - This Quran text can be used in any website or application, \n#    provided that its source (Tanzil Project) is clearly indicated, \n#    and a link is made to tanzil.net to enable users to keep\n#    track of changes.\n#\n#  - This copyright notice shall be included in all verbatim copies \n#    of the text, and shall be reproduced appropriately in all files \n#    derived from or containing substantial portion of this text.\n#\n#  Please check updates at: http://tanzil.net/updates/\n#\n#====================================================================\n",
  "type": "simple-clean",
  "version": "1.1"
}