{
  "aya": [
    {
      "index": "1",
      "text": "المص",
      "bismillah": "بِسْمِ اللَّهِ الرَّحْمَـٰنِ الرَّحِيمِ"
    },
    {
      "index": "2",
      "text": "كِتَابٌ أُنْزِلَ إِلَيْكَ فَلَا يَكُنْ فِي صَدْرِكَ حَرَجٌ مِنْهُ لِتُنْذِرَ بِهِ وَذِكْرَىٰ لِلْمُؤْمِنِينَ"
    },
    {
      "index": "3",
      "text": "اتَّبِعُوا مَا أُنْزِلَ إِلَيْكُمْ مِنْ رَبِّكُمْ وَلَا تَتَّبِعُوا مِنْ دُونِهِ أَوْلِيَاءَ ۗ قَلِيلًا مَا تَذَكَّرُونَ"
    },
    {
      "index": "4",
      "text": "وَكَمْ مِنْ قَرْيَةٍ أَهْلَكْنَاهَا فَجَاءَهَا بَأْسُنَا بَيَاتًا أَوْ هُمْ قَائِلُونَ"
    },
    {
      "index": "5",
      "text": "فَمَا كَانَ دَعْوَاهُمْ إِذْ جَاءَهُمْ بَأْسُنَا إِلَّا أَنْ قَالُوا إِنَّا كُنَّا ظَالِمِينَ"
    },
    {
      "index": "6",
      "text": "فَلَنَسْأَلَنَّ الَّذِينَ أُرْسِلَ إِلَيْهِمْ وَلَنَسْأَلَنَّ الْمُرْسَلِينَ"
    },
    {
      "index": "7",
      "text": "فَلَنَقُصَّنَّ عَلَيْهِمْ بِعِلْمٍ ۖ وَمَا كُنَّا غَائِبِينَ"
    },
    {
      "index": "8",
      "text": "وَالْوَزْنُ يَوْمَئِذٍ الْحَقُّ ۚ فَمَنْ ثَقُلَتْ مَوَازِينُهُ فَأُولَـٰئِكَ هُمُ الْمُفْلِحُونَ"
    },
    {
      "index": "9",
      "text": "وَمَنْ خَفَّتْ مَوَازِينُهُ فَأُولَـٰئِكَ الَّذِينَ خَسِرُوا أَنْفُسَهُمْ بِمَا كَانُوا بِآيَاتِنَا يَظْلِمُونَ"
    },
    {
      "index": "10",
      "text": "وَلَقَدْ مَكَّنَّاكُمْ فِي الْأَرْضِ وَجَعَلْنَا لَكُمْ فِيهَا مَعَايِشَ ۗ قَلِيلًا مَا تَشْكُرُونَ"
    },
    {
      "index": "11",
      "text": "وَلَقَدْ خَلَقْنَاكُمْ ثُمَّ صَوَّرْنَاكُمْ ثُمَّ قُلْنَا لِلْمَلَائِكَةِ اسْجُدُوا لِآدَمَ فَسَجَدُوا إِلَّا إِبْلِيسَ لَمْ يَكُنْ مِنَ السَّاجِدِينَ"
    },
    {
      "index": "12",
      "text": "قَالَ مَا مَنَعَكَ أَلَّا تَسْجُدَ إِذْ أَمَرْتُكَ ۖ قَالَ أَنَا خَيْرٌ مِنْهُ خَلَقْتَنِي مِنْ نَارٍ وَخَلَقْتَهُ مِنْ طِينٍ"
    },
    {
      "index": "13",
      "text": "قَالَ فَاهْبِطْ مِنْهَا فَمَا يَكُونُ لَكَ أَنْ تَتَكَبَّرَ فِيهَا فَاخْرُجْ إِنَّكَ مِنَ الصَّاغِرِينَ"
    },
    {
      "index": "14",
      "text": "قَالَ أَنْظِرْنِي إِلَىٰ يَوْمِ يُبْعَثُونَ"
    },
    {
      "index": "15",
      "text": "قَالَ إِنَّكَ مِنَ الْمُنْظَرِينَ"
    },
    {
      "index": "16",
      "text": "قَالَ فَبِمَا أَغْوَيْتَنِي لَأَقْعُدَنَّ لَهُمْ صِرَاطَكَ الْمُسْتَقِيمَ"
    },
    {
      "index": "17",
      "text": "ثُمَّ لَآتِيَنَّهُمْ مِنْ بَيْنِ أَيْدِيهِمْ وَمِنْ خَلْفِهِمْ وَعَنْ أَيْمَانِهِمْ وَعَنْ شَمَائِلِهِمْ ۖ وَلَا تَجِدُ أَكْثَرَهُمْ شَاكِرِينَ"
    },
    {
      "index": "18",
      "text": "قَالَ اخْرُجْ مِنْهَا مَذْءُومًا مَدْحُورًا ۖ لَمَنْ تَبِعَكَ مِنْهُمْ لَأَمْلَأَنَّ جَهَنَّمَ مِنْكُمْ أَجْمَعِينَ"
    },
    {
      "index": "19",
      "text": "وَيَا آدَمُ اسْكُنْ أَنْتَ وَزَوْجُكَ الْجَنَّةَ فَكُلَا مِنْ حَيْثُ شِئْتُمَا وَلَا تَقْرَبَا هَـٰذِهِ الشَّجَرَةَ فَتَكُونَا مِنَ الظَّالِمِينَ"
    },
    {
      "index": "20",
      "text": "فَوَسْوَسَ لَهُمَا الشَّيْطَانُ لِيُبْدِيَ لَهُمَا مَا وُورِيَ عَنْهُمَا مِنْ سَوْآتِهِمَا وَقَالَ مَا نَهَاكُمَا رَبُّكُمَا عَنْ هَـٰذِهِ الشَّجَرَةِ إِلَّا أَنْ تَكُونَا مَلَكَيْنِ أَوْ تَكُونَا مِنَ الْخَالِدِينَ"
    },
    {
      "index": "21",
      "text": "وَقَاسَمَهُمَا إِنِّي لَكُمَا لَمِنَ النَّاصِحِينَ"
    },
    {
      "index": "22",
      "text": "فَدَلَّاهُمَا بِغُرُورٍ ۚ فَلَمَّا ذَاقَا الشَّجَرَةَ بَدَتْ لَهُمَا سَوْآتُهُمَا وَطَفِقَا يَخْصِفَانِ عَلَيْهِمَا مِنْ وَرَقِ الْجَنَّةِ ۖ وَنَادَاهُمَا رَبُّهُمَا أَلَمْ أَنْهَكُمَا عَنْ تِلْكُمَا الشَّجَرَةِ وَأَقُلْ لَكُمَا إِنَّ الشَّيْطَانَ لَكُمَا عَدُوٌّ مُبِينٌ"
    },
    {
      "index": "23",
      "text": "قَالَا رَبَّنَا ظَلَمْنَا أَنْفُسَنَا وَإِنْ لَمْ تَغْفِرْ لَنَا وَتَرْحَمْنَا لَنَكُونَنَّ مِنَ الْخَاسِرِينَ"
    },
    {
      "index": "24",
      "text": "قَالَ اهْبِطُوا بَعْضُكُمْ لِبَعْضٍ عَدُوٌّ ۖ وَلَكُمْ فِي الْأَرْضِ مُسْتَقَرٌّ وَمَتَاعٌ إِلَىٰ حِينٍ"
    },
    {
      "index": "25",
      "text": "قَالَ فِيهَا تَحْيَوْنَ وَفِيهَا تَمُوتُونَ وَمِنْهَا تُخْرَجُونَ"
    },
    {
      "index": "26",
      "text": "يَا بَنِي آدَمَ قَدْ أَنْزَلْنَا عَلَيْكُمْ لِبَاسًا يُوَارِي سَوْآتِكُمْ وَرِيشًا ۖ وَلِبَاسُ التَّقْوَىٰ ذَٰلِكَ خَيْرٌ ۚ ذَٰلِكَ مِنْ آيَاتِ اللَّهِ لَعَلَّهُمْ يَذَّكَّرُونَ"
    },
    {
      "index": "27",
      "text": "يَا بَنِي آدَمَ لَا يَفْتِنَنَّكُمُ الشَّيْطَانُ كَمَا أَخْرَجَ أَبَوَيْكُمْ مِنَ الْجَنَّةِ يَنْزِعُ عَنْهُمَا لِبَاسَهُمَا لِيُرِيَهُمَا سَوْآتِهِمَا ۗ إِنَّهُ يَرَاكُمْ هُوَ وَقَبِيلُهُ مِنْ حَيْثُ لَا تَرَوْنَهُمْ ۗ إِنَّا جَعَلْنَا الشَّيَاطِينَ أَوْلِيَاءَ لِلَّذِينَ لَا يُؤْمِنُونَ"
    },
    {
      "index": "28",
      "text": "وَإِذَا فَعَلُوا فَاحِشَةً قَالُوا وَجَدْنَا عَلَيْهَا آبَاءَنَا وَاللَّهُ أَمَرَنَا بِهَا ۗ قُلْ إِنَّ اللَّهَ لَا يَأْمُرُ بِالْفَحْشَاءِ ۖ أَتَقُولُونَ عَلَى اللَّهِ مَا لَا تَعْلَمُونَ"
    },
    {
      "index": "29",
      "text": "قُلْ أَمَرَ رَبِّي بِالْقِسْطِ ۖ وَأَقِيمُوا وُجُوهَكُمْ عِنْدَ كُلِّ مَسْجِدٍ وَادْعُوهُ مُخْلِصِينَ لَهُ الدِّينَ ۚ كَمَا بَدَأَكُمْ تَعُودُونَ"
    },
    {
      "index": "30",
      "text": "فَرِيقًا هَدَىٰ وَفَرِيقًا حَقَّ عَلَيْهِمُ الضَّلَالَةُ ۗ إِنَّهُمُ اتَّخَذُوا الشَّيَاطِينَ أَوْلِيَاءَ مِنْ دُونِ اللَّهِ وَيَحْسَبُونَ أَنَّهُمْ مُهْتَدُونَ"
    },
    {
      "index": "31",
      "text": "۞ يَا بَنِي آدَمَ خُذُوا زِينَتَكُمْ عِنْدَ كُلِّ مَسْجِدٍ وَكُلُوا وَاشْرَبُوا وَلَا تُسْرِفُوا ۚ إِنَّهُ لَا يُحِبُّ الْمُسْرِفِينَ"
    },
    {
      "index": "32",
      "text": "قُلْ مَنْ حَرَّمَ زِينَةَ اللَّهِ الَّتِي أَخْرَجَ لِعِبَادِهِ وَالطَّيِّبَاتِ مِنَ الرِّزْقِ ۚ قُلْ هِيَ لِلَّذِينَ آمَنُوا فِي الْحَيَاةِ الدُّنْيَا خَالِصَةً يَوْمَ الْقِيَامَةِ ۗ كَذَٰلِكَ نُفَصِّلُ الْآيَاتِ لِقَوْمٍ يَعْلَمُونَ"
    },
    {
      "index": "33",
      "text": "قُلْ إِنَّمَا حَرَّمَ رَبِّيَ الْفَوَاحِشَ مَا ظَهَرَ مِنْهَا وَمَا بَطَنَ وَالْإِثْمَ وَالْبَغْيَ بِغَيْرِ الْحَقِّ وَأَنْ تُشْرِكُوا بِاللَّهِ مَا لَمْ يُنَزِّلْ بِهِ سُلْطَانًا وَأَنْ تَقُولُوا عَلَى اللَّهِ مَا لَا تَعْلَمُونَ"
    },
    {
      "index": "34",
      "text": "وَلِكُلِّ أُمَّةٍ أَجَلٌ ۖ فَإِذَا جَاءَ أَجَلُهُمْ لَا يَسْتَأْخِرُونَ سَاعَةً ۖ وَلَا يَسْتَقْدِمُونَ"
    },
    {
      "index": "35",
      "text": "يَا بَنِي آدَمَ إِمَّا يَأْتِيَنَّكُمْ رُسُلٌ مِنْكُمْ يَقُصُّونَ عَلَيْكُمْ آيَاتِي ۙ فَمَنِ اتَّقَىٰ وَأَصْلَحَ فَلَا خَوْفٌ عَلَيْهِمْ وَلَا هُمْ يَحْزَنُونَ"
    },
    {
      "index": "36",
      "text": "وَالَّذِينَ كَذَّبُوا بِآيَاتِنَا وَاسْتَكْبَرُوا عَنْهَا أُولَـٰئِكَ أَصْحَابُ النَّارِ ۖ هُمْ فِيهَا خَالِدُونَ"
    },
    {
      "index": "37",
      "text": "فَمَنْ أَظْلَمُ مِمَّنِ افْتَرَىٰ عَلَى اللَّهِ كَذِبًا أَوْ كَذَّبَ بِآيَاتِهِ ۚ أُولَـٰئِكَ يَنَالُهُمْ نَصِيبُهُمْ مِنَ الْكِتَابِ ۖ حَتَّىٰ إِذَا جَاءَتْهُمْ رُسُلُنَا يَتَوَفَّوْنَهُمْ قَالُوا أَيْنَ مَا كُنْتُمْ تَدْعُونَ مِنْ دُونِ اللَّهِ ۖ قَالُوا ضَلُّوا عَنَّا وَشَهِدُوا عَلَىٰ أَنْفُسِهِمْ أَنَّهُمْ كَانُوا كَافِرِينَ"
    },
    {
      "index": "38",
      "text": "قَالَ ادْخُلُوا فِي أُمَمٍ قَدْ خَلَتْ مِنْ قَبْلِكُمْ مِنَ الْجِنِّ وَالْإِنْسِ فِي النَّارِ ۖ كُلَّمَا دَخَلَتْ أُمَّةٌ لَعَنَتْ أُخْتَهَا ۖ حَتَّىٰ إِذَا ادَّارَكُوا فِيهَا جَمِيعًا قَالَتْ أُخْرَاهُمْ لِأُولَاهُمْ رَبَّنَا هَـٰؤُلَاءِ أَضَلُّونَا فَآتِهِمْ عَذَابًا ضِعْفًا مِنَ النَّارِ ۖ قَالَ لِكُلٍّ ضِعْفٌ وَلَـٰكِنْ لَا تَعْلَمُونَ"
    },
    {
      "index": "39",
      "text": "وَقَالَتْ أُولَاهُمْ لِأُخْرَاهُمْ فَمَا كَانَ لَكُمْ عَلَيْنَا مِنْ فَضْلٍ فَذُوقُوا الْعَذَابَ بِمَا كُنْتُمْ تَكْسِبُونَ"
    },
    {
      "index": "40",
      "text": "إِنَّ الَّذِينَ كَذَّبُوا بِآيَاتِنَا وَاسْتَكْبَرُوا عَنْهَا لَا تُفَتَّحُ لَهُمْ أَبْوَابُ السَّمَاءِ وَلَا يَدْخُلُونَ الْجَنَّةَ حَتَّىٰ يَلِجَ الْجَمَلُ فِي سَمِّ الْخِيَاطِ ۚ وَكَذَٰلِكَ نَجْزِي الْمُجْرِمِينَ"
    },
    {
      "index": "41",
      "text": "لَهُمْ مِنْ جَهَنَّمَ مِهَادٌ وَمِنْ فَوْقِهِمْ غَوَاشٍ ۚ وَكَذَٰلِكَ نَجْزِي الظَّالِمِينَ"
    },
    {
      "index": "42",
      "text": "وَالَّذِينَ آمَنُوا وَعَمِلُوا الصَّالِحَاتِ لَا نُكَلِّفُ نَفْسًا إِلَّا وُسْعَهَا أُولَـٰئِكَ أَصْحَابُ الْجَنَّةِ ۖ هُمْ فِيهَا خَالِدُونَ"
    },
    {
      "index": "43",
      "text": "وَنَزَعْنَا مَا فِي صُدُورِهِمْ مِنْ غِلٍّ تَجْرِي مِنْ تَحْتِهِمُ الْأَنْهَارُ ۖ وَقَالُوا الْحَمْدُ لِلَّهِ الَّذِي هَدَانَا لِهَـٰذَا وَمَا كُنَّا لِنَهْتَدِيَ لَوْلَا أَنْ هَدَانَا اللَّهُ ۖ لَقَدْ جَاءَتْ رُسُلُ رَبِّنَا بِالْحَقِّ ۖ وَنُودُوا أَنْ تِلْكُمُ الْجَنَّةُ أُورِثْتُمُوهَا بِمَا كُنْتُمْ تَعْمَلُونَ"
    },
    {
      "index": "44",
      "text": "وَنَادَىٰ أَصْحَابُ الْجَنَّةِ أَصْحَابَ النَّارِ أَنْ قَدْ وَجَدْنَا مَا وَعَدَنَا رَبُّنَا حَقًّا فَهَلْ وَجَدْتُمْ مَا وَعَدَ رَبُّكُمْ حَقًّا ۖ قَالُوا نَعَمْ ۚ فَأَذَّنَ مُؤَذِّنٌ بَيْنَهُمْ أَنْ لَعْنَةُ اللَّهِ عَلَى الظَّالِمِينَ"
    },
    {
      "index": "45",
      "text": "الَّذِينَ يَصُدُّونَ عَنْ سَبِيلِ اللَّهِ وَيَبْغُونَهَا عِوَجًا وَهُمْ بِالْآخِرَةِ كَافِرُونَ"
    },
    {
      "index": "46",
      "text": "وَبَيْنَهُمَا حِجَابٌ ۚ وَعَلَى الْأَعْرَافِ رِجَالٌ يَعْرِفُونَ كُلًّا بِسِيمَاهُمْ ۚ وَنَادَوْا أَصْحَابَ الْجَنَّةِ أَنْ سَلَامٌ عَلَيْكُمْ ۚ لَمْ يَدْخُلُوهَا وَهُمْ يَطْمَعُونَ"
    },
    {
      "index": "47",
      "text": "۞ وَإِذَا صُرِفَتْ أَبْصَارُهُمْ تِلْقَاءَ أَصْحَابِ النَّارِ قَالُوا رَبَّنَا لَا تَجْعَلْنَا مَعَ الْقَوْمِ الظَّالِمِينَ"
    },
    {
      "index": "48",
      "text": "وَنَادَىٰ أَصْحَابُ الْأَعْرَافِ رِجَالًا يَعْرِفُونَهُمْ بِسِيمَاهُمْ قَالُوا مَا أَغْنَىٰ عَنْكُمْ جَمْعُكُمْ وَمَا كُنْتُمْ تَسْتَكْبِرُونَ"
    },
    {
      "index": "49",
      "text": "أَهَـٰؤُلَاءِ الَّذِينَ أَقْسَمْتُمْ لَا يَنَالُهُمُ اللَّهُ بِرَحْمَةٍ ۚ ادْخُلُوا الْجَنَّةَ لَا خَوْفٌ عَلَيْكُمْ وَلَا أَنْتُمْ تَحْزَنُونَ"
    },
    {
      "index": "50",
      "text": "وَنَادَىٰ أَصْحَابُ النَّارِ أَصْحَابَ الْجَنَّةِ أَنْ أَفِيضُوا عَلَيْنَا مِنَ الْمَاءِ أَوْ مِمَّا رَزَقَكُمُ اللَّهُ ۚ قَالُوا إِنَّ اللَّهَ حَرَّمَهُمَا عَلَى الْكَافِرِينَ"
    },
    {
      "index": "51",
      "text": "الَّذِينَ اتَّخَذُوا دِينَهُمْ لَهْوًا وَلَعِبًا وَغَرَّتْهُمُ الْحَيَاةُ الدُّنْيَا ۚ فَالْيَوْمَ نَنْسَاهُمْ كَمَا نَسُوا لِقَاءَ يَوْمِهِمْ هَـٰذَا وَمَا كَانُوا بِآيَاتِنَا يَجْحَدُونَ"
    },
    {
      "index": "52",
      "text": "وَلَقَدْ جِئْنَاهُمْ بِكِتَابٍ فَصَّلْنَاهُ عَلَىٰ عِلْمٍ هُدًى وَرَحْمَةً لِقَوْمٍ يُؤْمِنُونَ"
    },
    {
      "index": "53",
      "text": "هَلْ يَنْظُرُونَ إِلَّا تَأْوِيلَهُ ۚ يَوْمَ يَأْتِي تَأْوِيلُهُ يَقُولُ الَّذِينَ نَسُوهُ مِنْ قَبْلُ قَدْ جَاءَتْ رُسُلُ رَبِّنَا بِالْحَقِّ فَهَلْ لَنَا مِنْ شُفَعَاءَ فَيَشْفَعُوا لَنَا أَوْ نُرَدُّ فَنَعْمَلَ غَيْرَ الَّذِي كُنَّا نَعْمَلُ ۚ قَدْ خَسِرُوا أَنْفُسَهُمْ وَضَلَّ عَنْهُمْ مَا كَانُوا يَفْتَرُونَ"
    },
    {
      "index": "54",
      "text": "إِنَّ رَبَّكُمُ اللَّهُ الَّذِي خَلَقَ السَّمَاوَاتِ وَالْأَرْضَ فِي سِتَّةِ أَيَّامٍ ثُمَّ اسْتَوَىٰ عَلَى الْعَرْشِ يُغْشِي اللَّيْلَ النَّهَارَ يَطْلُبُهُ حَثِيثًا وَالشَّمْسَ وَالْقَمَرَ وَالنُّجُومَ مُسَخَّرَاتٍ بِأَمْرِهِ ۗ أَلَا لَهُ الْخَلْقُ وَالْأَمْرُ ۗ تَبَارَكَ اللَّهُ رَبُّ الْعَالَمِينَ"
    },
    {
      "index": "55",
      "text": "ادْعُوا رَبَّكُمْ تَضَرُّعًا وَخُفْيَةً ۚ إِنَّهُ لَا يُحِبُّ الْمُعْتَدِينَ"
    },
    {
      "index": "56",
      "text": "وَلَا تُفْسِدُوا فِي الْأَرْضِ بَعْدَ إِصْلَاحِهَا وَادْعُوهُ خَوْفًا وَطَمَعًا ۚ إِنَّ رَحْمَتَ اللَّهِ قَرِيبٌ مِنَ الْمُحْسِنِينَ"
    },
    {
      "index": "57",
      "text": "وَهُوَ الَّذِي يُرْسِلُ الرِّيَاحَ بُشْرًا بَيْنَ يَدَيْ رَحْمَتِهِ ۖ حَتَّىٰ إِذَا أَقَلَّتْ سَحَابًا ثِقَالًا سُقْنَاهُ لِبَلَدٍ مَيِّتٍ فَأَنْزَلْنَا بِهِ الْمَاءَ فَأَخْرَجْنَا بِهِ مِنْ كُلِّ الثَّمَرَاتِ ۚ كَذَٰلِكَ نُخْرِجُ الْمَوْتَىٰ لَعَلَّكُمْ تَذَكَّرُونَ"
    },
    {
      "index": "58",
      "text": "وَالْبَلَدُ الطَّيِّبُ يَخْرُجُ نَبَاتُهُ بِإِذْنِ رَبِّهِ ۖ وَالَّذِي خَبُثَ لَا يَخْرُجُ إِلَّا نَكِدًا ۚ كَذَٰلِكَ نُصَرِّفُ الْآيَاتِ لِقَوْمٍ يَشْكُرُونَ"
    },
    {
      "index": "59",
      "text": "لَقَدْ أَرْسَلْنَا نُوحًا إِلَىٰ قَوْمِهِ فَقَالَ يَا قَوْمِ اعْبُدُوا اللَّهَ مَا لَكُمْ مِنْ إِلَـٰهٍ غَيْرُهُ إِنِّي أَخَافُ عَلَيْكُمْ عَذَابَ يَوْمٍ عَظِيمٍ"
    },
    {
      "index": "60",
      "text": "قَالَ الْمَلَأُ مِنْ قَوْمِهِ إِنَّا لَنَرَاكَ فِي ضَلَالٍ مُبِينٍ"
    },
    {
      "index": "61",
      "text": "قَالَ يَا قَوْمِ لَيْسَ بِي ضَلَالَةٌ وَلَـٰكِنِّي رَسُولٌ مِنْ رَبِّ الْعَالَمِينَ"
    },
    {
      "index": "62",
      "text": "أُبَلِّغُكُمْ رِسَالَاتِ رَبِّي وَأَنْصَحُ لَكُمْ وَأَعْلَمُ مِنَ اللَّهِ مَا لَا تَعْلَمُونَ"
    },
    {
      "index": "63",
      "text": "أَوَعَجِبْتُمْ أَنْ جَاءَكُمْ ذِكْرٌ مِنْ رَبِّكُمْ عَلَىٰ رَجُلٍ مِنْكُمْ لِيُنْذِرَكُمْ وَلِتَتَّقُوا وَلَعَلَّكُمْ تُرْحَمُونَ"
    },
    {
      "index": "64",
      "text": "فَكَذَّبُوهُ فَأَنْجَيْنَاهُ وَالَّذِينَ مَعَهُ فِي الْفُلْكِ وَأَغْرَقْنَا الَّذِينَ كَذَّبُوا بِآيَاتِنَا ۚ إِنَّهُمْ كَانُوا قَوْمًا عَمِينَ"
    },
    {
      "index": "65",
      "text": "۞ وَإِلَىٰ عَادٍ أَخَاهُمْ هُودًا ۗ قَالَ يَا قَوْمِ اعْبُدُوا اللَّهَ مَا لَكُمْ مِنْ إِلَـٰهٍ غَيْرُهُ ۚ أَفَلَا تَتَّقُونَ"
    },
    {
      "index": "66",
      "text": "قَالَ الْمَلَأُ الَّذِينَ كَفَرُوا مِنْ قَوْمِهِ إِنَّا لَنَرَاكَ فِي سَفَاهَةٍ وَإِنَّا لَنَظُنُّكَ مِنَ الْكَاذِبِينَ"
    },
    {
      "index": "67",
      "text": "قَالَ يَا قَوْمِ لَيْسَ بِي سَفَاهَةٌ وَلَـٰكِنِّي رَسُولٌ مِنْ رَبِّ الْعَالَمِينَ"
    },
    {
      "index": "68",
      "text": "أُبَلِّغُكُمْ رِسَالَاتِ رَبِّي وَأَنَا لَكُمْ نَاصِحٌ أَمِينٌ"
    },
    {
      "index": "69",
      "text": "أَوَعَجِبْتُمْ أَنْ جَاءَكُمْ ذِكْرٌ مِنْ رَبِّكُمْ عَلَىٰ رَجُلٍ مِنْكُمْ لِيُنْذِرَكُمْ ۚ وَاذْكُرُوا إِذْ جَعَلَكُمْ خُلَفَاءَ مِنْ بَعْدِ قَوْمِ نُوحٍ وَزَادَكُمْ فِي الْخَلْقِ بَسْطَةً ۖ فَاذْكُرُوا آلَاءَ اللَّهِ لَعَلَّكُمْ تُفْلِحُونَ"
    },
    {
      "index": "70",
      "text": "قَالُوا أَجِئْتَنَا لِنَعْبُدَ اللَّهَ وَحْدَهُ وَنَذَرَ مَا كَانَ يَعْبُدُ آبَاؤُنَا ۖ فَأْتِنَا بِمَا تَعِدُنَا إِنْ كُنْتَ مِنَ الصَّادِقِينَ"
    },
    {
      "index": "71",
      "text": "قَالَ قَدْ وَقَعَ عَلَيْكُمْ مِنْ رَبِّكُمْ رِجْسٌ وَغَضَبٌ ۖ أَتُجَادِلُونَنِي فِي أَسْمَاءٍ سَمَّيْتُمُوهَا أَنْتُمْ وَآبَاؤُكُمْ مَا نَزَّلَ اللَّهُ بِهَا مِنْ سُلْطَانٍ ۚ فَانْتَظِرُوا إِنِّي مَعَكُمْ مِنَ الْمُنْتَظِرِينَ"
    },
    {
      "index": "72",
      "text": "فَأَنْجَيْنَاهُ وَالَّذِينَ مَعَهُ بِرَحْمَةٍ مِنَّا وَقَطَعْنَا دَابِرَ الَّذِينَ كَذَّبُوا بِآيَاتِنَا ۖ وَمَا كَانُوا مُؤْمِنِينَ"
    },
    {
      "index": "73",
      "text": "وَإِلَىٰ ثَمُودَ أَخَاهُمْ صَالِحًا ۗ قَالَ يَا قَوْمِ اعْبُدُوا اللَّهَ مَا لَكُمْ مِنْ إِلَـٰهٍ غَيْرُهُ ۖ قَدْ جَاءَتْكُمْ بَيِّنَةٌ مِنْ رَبِّكُمْ ۖ هَـٰذِهِ نَاقَةُ اللَّهِ لَكُمْ آيَةً ۖ فَذَرُوهَا تَأْكُلْ فِي أَرْضِ اللَّهِ ۖ وَلَا تَمَسُّوهَا بِسُوءٍ فَيَأْخُذَكُمْ عَذَابٌ أَلِيمٌ"
    },
    {
      "index": "74",
      "text": "وَاذْكُرُوا إِذْ جَعَلَكُمْ خُلَفَاءَ مِنْ بَعْدِ عَادٍ وَبَوَّأَكُمْ فِي الْأَرْضِ تَتَّخِذُونَ مِنْ سُهُولِهَا قُصُورًا وَتَنْحِتُونَ الْجِبَالَ بُيُوتًا ۖ فَاذْكُرُوا آلَاءَ اللَّهِ وَلَا تَعْثَوْا فِي الْأَرْضِ مُفْسِدِينَ"
    },
    {
      "index": "75",
      "text": "قَالَ الْمَلَأُ الَّذِينَ اسْتَكْبَرُوا مِنْ قَوْمِهِ لِلَّذِينَ اسْتُضْعِفُوا لِمَنْ آمَنَ مِنْهُمْ أَتَعْلَمُونَ أَنَّ صَالِحًا مُرْسَلٌ مِنْ رَبِّهِ ۚ قَالُوا إِنَّا بِمَا أُرْسِلَ بِهِ مُؤْمِنُونَ"
    },
    {
      "index": "76",
      "text": "قَالَ الَّذِينَ اسْتَكْبَرُوا إِنَّا بِالَّذِي آمَنْتُمْ بِهِ كَافِرُونَ"
    },
    {
      "index": "77",
      "text": "فَعَقَرُوا النَّاقَةَ وَعَتَوْا عَنْ أَمْرِ رَبِّهِمْ وَقَالُوا يَا صَالِحُ ائْتِنَا بِمَا تَعِدُنَا إِنْ كُنْتَ مِنَ الْمُرْسَلِينَ"
    },
    {
      "index": "78",
      "text": "فَأَخَذَتْهُمُ الرَّجْفَةُ فَأَصْبَحُوا فِي دَارِهِمْ جَاثِمِينَ"
    },
    {
      "index": "79",
      "text": "فَتَوَلَّىٰ عَنْهُمْ وَقَالَ يَا قَوْمِ لَقَدْ أَبْلَغْتُكُمْ رِسَالَةَ رَبِّي وَنَصَحْتُ لَكُمْ وَلَـٰكِنْ لَا تُحِبُّونَ النَّاصِحِينَ"
    },
    {
      "index": "80",
      "text": "وَلُوطًا إِذْ قَالَ لِقَوْمِهِ أَتَأْتُونَ الْفَاحِشَةَ مَا سَبَقَكُمْ بِهَا مِنْ أَحَدٍ مِنَ الْعَالَمِينَ"
    },
    {
      "index": "81",
      "text": "إِنَّكُمْ لَتَأْتُونَ الرِّجَالَ شَهْوَةً مِنْ دُونِ النِّسَاءِ ۚ بَلْ أَنْتُمْ قَوْمٌ مُسْرِفُونَ"
    },
    {
      "index": "82",
      "text": "وَمَا كَانَ جَوَابَ قَوْمِهِ إِلَّا أَنْ قَالُوا أَخْرِجُوهُمْ مِنْ قَرْيَتِكُمْ ۖ إِنَّهُمْ أُنَاسٌ يَتَطَهَّرُونَ"
    },
    {
      "index": "83",
      "text": "فَأَنْجَيْنَاهُ وَأَهْلَهُ إِلَّا امْرَأَتَهُ كَانَتْ مِنَ الْغَابِرِينَ"
    },
    {
      "index": "84",
      "text": "وَأَمْطَرْنَا عَلَيْهِمْ مَطَرًا ۖ فَانْظُرْ كَيْفَ كَانَ عَاقِبَةُ الْمُجْرِمِينَ"
    },
    {
      "index": "85",
      "text": "وَإِلَىٰ مَدْيَنَ أَخَاهُمْ شُعَيْبًا ۗ قَالَ يَا قَوْمِ اعْبُدُوا اللَّهَ مَا لَكُمْ مِنْ إِلَـٰهٍ غَيْرُهُ ۖ قَدْ جَاءَتْكُمْ بَيِّنَةٌ مِنْ رَبِّكُمْ ۖ فَأَوْفُوا الْكَيْلَ وَالْمِيزَانَ وَلَا تَبْخَسُوا النَّاسَ أَشْيَاءَهُمْ وَلَا تُفْسِدُوا فِي الْأَرْضِ بَعْدَ إِصْلَاحِهَا ۚ ذَٰلِكُمْ خَيْرٌ لَكُمْ إِنْ كُنْتُمْ مُؤْمِنِينَ"
    },
    {
      "index": "86",
      "text": "وَلَا تَقْعُدُوا بِكُلِّ صِرَاطٍ تُوعِدُونَ وَتَصُدُّونَ عَنْ سَبِيلِ اللَّهِ مَنْ آمَنَ بِهِ وَتَبْغُونَهَا عِوَجًا ۚ وَاذْكُرُوا إِذْ كُنْتُمْ قَلِيلًا فَكَثَّرَكُمْ ۖ وَانْظُرُوا كَيْفَ كَانَ عَاقِبَةُ الْمُفْسِدِينَ"
    },
    {
      "index": "87",
      "text": "وَإِنْ كَانَ طَائِفَةٌ مِنْكُمْ آمَنُوا بِالَّذِي أُرْسِلْتُ بِهِ وَطَائِفَةٌ لَمْ يُؤْمِنُوا فَاصْبِرُوا حَتَّىٰ يَحْكُمَ اللَّهُ بَيْنَنَا ۚ وَهُوَ خَيْرُ الْحَاكِمِينَ"
    },
    {
      "index": "88",
      "text": "۞ قَالَ الْمَلَأُ الَّذِينَ اسْتَكْبَرُوا مِنْ قَوْمِهِ لَنُخْرِجَنَّكَ يَا شُعَيْبُ وَالَّذِينَ آمَنُوا مَعَكَ مِنْ قَرْيَتِنَا أَوْ لَتَعُودُنَّ فِي مِلَّتِنَا ۚ قَالَ أَوَلَوْ كُنَّا كَارِهِينَ"
    },
    {
      "index": "89",
      "text": "قَدِ افْتَرَيْنَا عَلَى اللَّهِ كَذِبًا إِنْ عُدْنَا فِي مِلَّتِكُمْ بَعْدَ إِذْ نَجَّانَا اللَّهُ مِنْهَا ۚ وَمَا يَكُونُ لَنَا أَنْ نَعُودَ فِيهَا إِلَّا أَنْ يَشَاءَ اللَّهُ رَبُّنَا ۚ وَسِعَ رَبُّنَا كُلَّ شَيْءٍ عِلْمًا ۚ عَلَى اللَّهِ تَوَكَّلْنَا ۚ رَبَّنَا افْتَحْ بَيْنَنَا وَبَيْنَ قَوْمِنَا بِالْحَقِّ وَأَنْتَ خَيْرُ الْفَاتِحِينَ"
    },
    {
      "index": "90",
      "text": "وَقَالَ الْمَلَأُ الَّذِينَ كَفَرُوا مِنْ قَوْمِهِ لَئِنِ اتَّبَعْتُمْ شُعَيْبًا إِنَّكُمْ إِذًا لَخَاسِرُونَ"
    },
    {
      "index": "91",
      "text": "فَأَخَذَتْهُمُ الرَّجْفَةُ فَأَصْبَحُوا فِي دَارِهِمْ جَاثِمِينَ"
    },
    {
      "index": "92",
      "text": "الَّذِينَ كَذَّبُوا شُعَيْبًا كَأَنْ لَمْ يَغْنَوْا فِيهَا ۚ الَّذِينَ كَذَّبُوا شُعَيْبًا كَانُوا هُمُ الْخَاسِرِينَ"
    },
    {
      "index": "93",
      "text": "فَتَوَلَّىٰ عَنْهُمْ وَقَالَ يَا قَوْمِ لَقَدْ أَبْلَغْتُكُمْ رِسَالَاتِ رَبِّي وَنَصَحْتُ لَكُمْ ۖ فَكَيْفَ آسَىٰ عَلَىٰ قَوْمٍ كَافِرِينَ"
    },
    {
      "index": "94",
      "text": "وَمَا أَرْسَلْنَا فِي قَرْيَةٍ مِنْ نَبِيٍّ إِلَّا أَخَذْنَا أَهْلَهَا بِالْبَأْسَاءِ وَالضَّرَّاءِ لَعَلَّهُمْ يَضَّرَّعُونَ"
    },
    {
      "index": "95",
      "text": "ثُمَّ بَدَّلْنَا مَكَانَ السَّيِّئَةِ الْحَسَنَةَ حَتَّىٰ عَفَوْا وَقَالُوا قَدْ مَسَّ آبَاءَنَا الضَّرَّاءُ وَالسَّرَّاءُ فَأَخَذْنَاهُمْ بَغْتَةً وَهُمْ لَا يَشْعُرُونَ"
    },
    {
      "index": "96",
      "text": "وَلَوْ أَنَّ أَهْلَ الْقُرَىٰ آمَنُوا وَاتَّقَوْا لَفَتَحْنَا عَلَيْهِمْ بَرَكَاتٍ مِنَ السَّمَاءِ وَالْأَرْضِ وَلَـٰكِنْ كَذَّبُوا فَأَخَذْنَاهُمْ بِمَا كَانُوا يَكْسِبُونَ"
    },
    {
      "index": "97",
      "text": "أَفَأَمِنَ أَهْلُ الْقُرَىٰ أَنْ يَأْتِيَهُمْ بَأْسُنَا بَيَاتًا وَهُمْ نَائِمُونَ"
    },
    {
      "index": "98",
      "text": "أَوَأَمِنَ أَهْلُ الْقُرَىٰ أَنْ يَأْتِيَهُمْ بَأْسُنَا ضُحًى وَهُمْ يَلْعَبُونَ"
    },
    {
      "index": "99",
      "text": "أَفَأَمِنُوا مَكْرَ اللَّهِ ۚ فَلَا يَأْمَنُ مَكْرَ اللَّهِ إِلَّا الْقَوْمُ الْخَاسِرُونَ"
    },
    {
      "index": "100",
      "text": "أَوَلَمْ يَهْدِ لِلَّذِينَ يَرِثُونَ الْأَرْضَ مِنْ بَعْدِ أَهْلِهَا أَنْ لَوْ نَشَاءُ أَصَبْنَاهُمْ بِذُنُوبِهِمْ ۚ وَنَطْبَعُ عَلَىٰ قُلُوبِهِمْ فَهُمْ لَا يَسْمَعُونَ"
    },
    {
      "index": "101",
      "text": "تِلْكَ الْقُرَىٰ نَقُصُّ عَلَيْكَ مِنْ أَنْبَائِهَا ۚ وَلَقَدْ جَاءَتْهُمْ رُسُلُهُمْ بِالْبَيِّنَاتِ فَمَا كَانُوا لِيُؤْمِنُوا بِمَا كَذَّبُوا مِنْ قَبْلُ ۚ كَذَٰلِكَ يَطْبَعُ اللَّهُ عَلَىٰ قُلُوبِ الْكَافِرِينَ"
    },
    {
      "index": "102",
      "text": "وَمَا وَجَدْنَا لِأَكْثَرِهِمْ مِنْ عَهْدٍ ۖ وَإِنْ وَجَدْنَا أَكْثَرَهُمْ لَفَاسِقِينَ"
    },
    {
      "index": "103",
      "text": "ثُمَّ بَعَثْنَا مِنْ بَعْدِهِمْ مُوسَىٰ بِآيَاتِنَا إِلَىٰ فِرْعَوْنَ وَمَلَئِهِ فَظَلَمُوا بِهَا ۖ فَانْظُرْ كَيْفَ كَانَ عَاقِبَةُ الْمُفْسِدِينَ"
    },
    {
      "index": "104",
      "text": "وَقَالَ مُوسَىٰ يَا فِرْعَوْنُ إِنِّي رَسُولٌ مِنْ رَبِّ الْعَالَمِينَ"
    },
    {
      "index": "105",
      "text": "حَقِيقٌ عَلَىٰ أَنْ لَا أَقُولَ عَلَى اللَّهِ إِلَّا الْحَقَّ ۚ قَدْ جِئْتُكُمْ بِبَيِّنَةٍ مِنْ رَبِّكُمْ فَأَرْسِلْ مَعِيَ بَنِي إِسْرَائِيلَ"
    },
    {
      "index": "106",
      "text": "قَالَ إِنْ كُنْتَ جِئْتَ بِآيَةٍ فَأْتِ بِهَا إِنْ كُنْتَ مِنَ الصَّادِقِينَ"
    },
    {
      "index": "107",
      "text": "فَأَلْقَىٰ عَصَاهُ فَإِذَا هِيَ ثُعْبَانٌ مُبِينٌ"
    },
    {
      "index": "108",
      "text": "وَنَزَعَ يَدَهُ فَإِذَا هِيَ بَيْضَاءُ لِلنَّاظِرِينَ"
    },
    {
      "index": "109",
      "text": "قَالَ الْمَلَأُ مِنْ قَوْمِ فِرْعَوْنَ إِنَّ هَـٰذَا لَسَاحِرٌ عَلِيمٌ"
    },
    {
      "index": "110",
      "text": "يُرِيدُ أَنْ يُخْرِجَكُمْ مِنْ أَرْضِكُمْ ۖ فَمَاذَا تَأْمُرُونَ"
    },
    {
      "index": "111",
      "text": "قَالُوا أَرْجِهْ وَأَخَاهُ وَأَرْسِلْ فِي الْمَدَائِنِ حَاشِرِينَ"
    },
    {
      "index": "112",
      "text": "يَأْتُوكَ بِكُلِّ سَاحِرٍ عَلِيمٍ"
    },
    {
      "index": "113",
      "text": "وَجَاءَ السَّحَرَةُ فِرْعَوْنَ قَالُوا إِنَّ لَنَا لَأَجْرًا إِنْ كُنَّا نَحْنُ الْغَالِبِينَ"
    },
    {
      "index": "114",
      "text": "قَالَ نَعَمْ وَإِنَّكُمْ لَمِنَ الْمُقَرَّبِينَ"
    },
    {
      "index": "115",
      "text": "قَالُوا يَا مُوسَىٰ إِمَّا أَنْ تُلْقِيَ وَإِمَّا أَنْ نَكُونَ نَحْنُ الْمُلْقِينَ"
    },
    {
      "index": "116",
      "text": "قَالَ أَلْقُوا ۖ فَلَمَّا أَلْقَوْا سَحَرُوا أَعْيُنَ النَّاسِ وَاسْتَرْهَبُوهُمْ وَجَاءُوا بِسِحْرٍ عَظِيمٍ"
    },
    {
      "index": "117",
      "text": "۞ وَأَوْحَيْنَا إِلَىٰ مُوسَىٰ أَنْ أَلْقِ عَصَاكَ ۖ فَإِذَا هِيَ تَلْقَفُ مَا يَأْفِكُونَ"
    },
    {
      "index": "118",
      "text": "فَوَقَعَ الْحَقُّ وَبَطَلَ مَا كَانُوا يَعْمَلُونَ"
    },
    {
      "index": "119",
      "text": "فَغُلِبُوا هُنَالِكَ وَانْقَلَبُوا صَاغِرِينَ"
    },
    {
      "index": "120",
      "text": "وَأُلْقِيَ السَّحَرَةُ سَاجِدِينَ"
    },
    {
      "index": "121",
      "text": "قَالُوا آمَنَّا بِرَبِّ الْعَالَمِينَ"
    },
    {
      "index": "122",
      "text": "رَبِّ مُوسَىٰ وَهَارُونَ"
    },
    {
      "index": "123",
      "text": "قَالَ فِرْعَوْنُ آمَنْتُمْ بِهِ قَبْلَ أَنْ آذَنَ لَكُمْ ۖ إِنَّ هَـٰذَا لَمَكْرٌ مَكَرْتُمُوهُ فِي الْمَدِينَةِ لِتُخْرِجُوا مِنْهَا أَهْلَهَا ۖ فَسَوْفَ تَعْلَمُونَ"
    },
    {
      "index": "124",
      "text": "لَأُقَطِّعَنَّ أَيْدِيَكُمْ وَأَرْجُلَكُمْ مِنْ خِلَافٍ ثُمَّ لَأُصَلِّبَنَّكُمْ أَجْمَعِينَ"
    },
    {
      "index": "125",
      "text": "قَالُوا إِنَّا إِلَىٰ رَبِّنَا مُنْقَلِبُونَ"
    },
    {
      "index": "126",
      "text": "وَمَا تَنْقِمُ مِنَّا إِلَّا أَنْ آمَنَّا بِآيَاتِ رَبِّنَا لَمَّا جَاءَتْنَا ۚ رَبَّنَا أَفْرِغْ عَلَيْنَا صَبْرًا وَتَوَفَّنَا مُسْلِمِينَ"
    },
    {
      "index": "127",
      "text": "وَقَالَ الْمَلَأُ مِنْ قَوْمِ فِرْعَوْنَ أَتَذَرُ مُوسَىٰ وَقَوْمَهُ لِيُفْسِدُوا فِي الْأَرْضِ وَيَذَرَكَ وَآلِهَتَكَ ۚ قَالَ سَنُقَتِّلُ أَبْنَاءَهُمْ وَنَسْتَحْيِي نِسَاءَهُمْ وَإِنَّا فَوْقَهُمْ قَاهِرُونَ"
    },
    {
      "index": "128",
      "text": "قَالَ مُوسَىٰ لِقَوْمِهِ اسْتَعِينُوا بِاللَّهِ وَاصْبِرُوا ۖ إِنَّ الْأَرْضَ لِلَّهِ يُورِثُهَا مَنْ يَشَاءُ مِنْ عِبَادِهِ ۖ وَالْعَاقِبَةُ لِلْمُتَّقِينَ"
    },
    {
      "index": "129",
      "text": "قَالُوا أُوذِينَا مِنْ قَبْلِ أَنْ تَأْتِيَنَا وَمِنْ بَعْدِ مَا جِئْتَنَا ۚ قَالَ عَسَىٰ رَبُّكُمْ أَنْ يُهْلِكَ عَدُوَّكُمْ وَيَسْتَخْلِفَكُمْ فِي الْأَرْضِ فَيَنْظُرَ كَيْفَ تَعْمَلُونَ"
    },
    {
      "index": "130",
      "text": "وَلَقَدْ أَخَذْنَا آلَ فِرْعَوْنَ بِالسِّنِينَ وَنَقْصٍ مِنَ الثَّمَرَاتِ لَعَلَّهُمْ يَذَّكَّرُونَ"
    },
    {
      "index": "131",
      "text": "فَإِذَا جَاءَتْهُمُ الْحَسَنَةُ قَالُوا لَنَا هَـٰذِهِ ۖ وَإِنْ تُصِبْهُمْ سَيِّئَةٌ يَطَّيَّرُوا بِمُوسَىٰ وَمَنْ مَعَهُ ۗ أَلَا إِنَّمَا طَائِرُهُمْ عِنْدَ اللَّهِ وَلَـٰكِنَّ أَكْثَرَهُمْ لَا يَعْلَمُونَ"
    },
    {
      "index": "132",
      "text": "وَقَالُوا مَهْمَا تَأْتِنَا بِهِ مِنْ آيَةٍ لِتَسْحَرَنَا بِهَا فَمَا نَحْنُ لَكَ بِمُؤْمِنِينَ"
    },
    {
      "index": "133",
      "text": "فَأَرْسَلْنَا عَلَيْهِمُ الطُّوفَانَ وَالْجَرَادَ وَالْقُمَّلَ وَالضَّفَادِعَ وَالدَّمَ آيَاتٍ مُفَصَّلَاتٍ فَاسْتَكْبَرُوا وَكَانُوا قَوْمًا مُجْرِمِينَ"
    },
    {
      "index": "134",
      "text": "وَلَمَّا وَقَعَ عَلَيْهِمُ الرِّجْزُ قَالُوا يَا مُوسَى ادْعُ لَنَا رَبَّكَ بِمَا عَهِدَ عِنْدَكَ ۖ لَئِنْ كَشَفْتَ عَنَّا الرِّجْزَ لَنُؤْمِنَنَّ لَكَ وَلَنُرْسِلَنَّ مَعَكَ بَنِي إِسْرَائِيلَ"
    },
    {
      "index": "135",
      "text": "فَلَمَّا كَشَفْنَا عَنْهُمُ الرِّجْزَ إِلَىٰ أَجَلٍ هُمْ بَالِغُوهُ إِذَا هُمْ يَنْكُثُونَ"
    },
    {
      "index": "136",
      "text": "فَانْتَقَمْنَا مِنْهُمْ فَأَغْرَقْنَاهُمْ فِي الْيَمِّ بِأَنَّهُمْ كَذَّبُوا بِآيَاتِنَا وَكَانُوا عَنْهَا غَافِلِينَ"
    },
    {
      "index": "137",
      "text": "وَأَوْرَثْنَا الْقَوْمَ الَّذِينَ كَانُوا يُسْتَضْعَفُونَ مَشَارِقَ الْأَرْضِ وَمَغَارِبَهَا الَّتِي بَارَكْنَا فِيهَا ۖ وَتَمَّتْ كَلِمَتُ رَبِّكَ الْحُسْنَىٰ عَلَىٰ بَنِي إِسْرَائِيلَ بِمَا صَبَرُوا ۖ وَدَمَّرْنَا مَا كَانَ يَصْنَعُ فِرْعَوْنُ وَقَوْمُهُ وَمَا كَانُوا يَعْرِشُونَ"
    },
    {
      "index": "138",
      "text": "وَجَاوَزْنَا بِبَنِي إِسْرَائِيلَ الْبَحْرَ فَأَتَوْا عَلَىٰ قَوْمٍ يَعْكُفُونَ عَلَىٰ أَصْنَامٍ لَهُمْ ۚ قَالُوا يَا مُوسَى اجْعَلْ لَنَا إِلَـٰهًا كَمَا لَهُمْ آلِهَةٌ ۚ قَالَ إِنَّكُمْ قَوْمٌ تَجْهَلُونَ"
    },
    {
      "index": "139",
      "text": "إِنَّ هَـٰؤُلَاءِ مُتَبَّرٌ مَا هُمْ فِيهِ وَبَاطِلٌ مَا كَانُوا يَعْمَلُونَ"
    },
    {
      "index": "140",
      "text": "قَالَ أَغَيْرَ اللَّهِ أَبْغِيكُمْ إِلَـٰهًا وَهُوَ فَضَّلَكُمْ عَلَى الْعَالَمِينَ"
    },
    {
      "index": "141",
      "text": "وَإِذْ أَنْجَيْنَاكُمْ مِنْ آلِ فِرْعَوْنَ يَسُومُونَكُمْ سُوءَ الْعَذَابِ ۖ يُقَتِّلُونَ أَبْنَاءَكُمْ وَيَسْتَحْيُونَ نِسَاءَكُمْ ۚ وَفِي ذَٰلِكُمْ بَلَاءٌ مِنْ رَبِّكُمْ عَظِيمٌ"
    },
    {
      "index": "142",
      "text": "۞ وَوَاعَدْنَا مُوسَىٰ ثَلَاثِينَ لَيْلَةً وَأَتْمَمْنَاهَا بِعَشْرٍ فَتَمَّ مِيقَاتُ رَبِّهِ أَرْبَعِينَ لَيْلَةً ۚ وَقَالَ مُوسَىٰ لِأَخِيهِ هَارُونَ اخْلُفْنِي فِي قَوْمِي وَأَصْلِحْ وَلَا تَتَّبِعْ سَبِيلَ الْمُفْسِدِينَ"
    },
    {
      "index": "143",
      "text": "وَلَمَّا جَاءَ مُوسَىٰ لِمِيقَاتِنَا وَكَلَّمَهُ رَبُّهُ قَالَ رَبِّ أَرِنِي أَنْظُرْ إِلَيْكَ ۚ قَالَ لَنْ تَرَانِي وَلَـٰكِنِ انْظُرْ إِلَى الْجَبَلِ فَإِنِ اسْتَقَرَّ مَكَانَهُ فَسَوْفَ تَرَانِي ۚ فَلَمَّا تَجَلَّىٰ رَبُّهُ لِلْجَبَلِ جَعَلَهُ دَكًّا وَخَرَّ مُوسَىٰ صَعِقًا ۚ فَلَمَّا أَفَاقَ قَالَ سُبْحَانَكَ تُبْتُ إِلَيْكَ وَأَنَا أَوَّلُ الْمُؤْمِنِينَ"
    },
    {
      "index": "144",
      "text": "قَالَ يَا مُوسَىٰ إِنِّي اصْطَفَيْتُكَ عَلَى النَّاسِ بِرِسَالَاتِي وَبِكَلَامِي فَخُذْ مَا آتَيْتُكَ وَكُنْ مِنَ الشَّاكِرِينَ"
    },
    {
      "index": "145",
      "text": "وَكَتَبْنَا لَهُ فِي الْأَلْوَاحِ مِنْ كُلِّ شَيْءٍ مَوْعِظَةً وَتَفْصِيلًا لِكُلِّ شَيْءٍ فَخُذْهَا بِقُوَّةٍ وَأْمُرْ قَوْمَكَ يَأْخُذُوا بِأَحْسَنِهَا ۚ سَأُرِيكُمْ دَارَ الْفَاسِقِينَ"
    },
    {
      "index": "146",
      "text": "سَأَصْرِفُ عَنْ آيَاتِيَ الَّذِينَ يَتَكَبَّرُونَ فِي الْأَرْضِ بِغَيْرِ الْحَقِّ وَإِنْ يَرَوْا كُلَّ آيَةٍ لَا يُؤْمِنُوا بِهَا وَإِنْ يَرَوْا سَبِيلَ الرُّشْدِ لَا يَتَّخِذُوهُ سَبِيلًا وَإِنْ يَرَوْا سَبِيلَ الْغَيِّ يَتَّخِذُوهُ سَبِيلًا ۚ ذَٰلِكَ بِأَنَّهُمْ كَذَّبُوا بِآيَاتِنَا وَكَانُوا عَنْهَا غَافِلِينَ"
    },
    {
      "index": "147",
      "text": "وَالَّذِينَ كَذَّبُوا بِآيَاتِنَا وَلِقَاءِ الْآخِرَةِ حَبِطَتْ أَعْمَالُهُمْ ۚ هَلْ يُجْزَوْنَ إِلَّا مَا كَانُوا يَعْمَلُونَ"
    },
    {
      "index": "148",
      "text": "وَاتَّخَذَ قَوْمُ مُوسَىٰ مِنْ بَعْدِهِ مِنْ حُلِيِّهِمْ عِجْلًا جَسَدًا لَهُ خُوَارٌ ۚ أَلَمْ يَرَوْا أَنَّهُ لَا يُكَلِّمُهُمْ وَلَا يَهْدِيهِمْ سَبِيلًا ۘ اتَّخَذُوهُ وَكَانُوا ظَالِمِينَ"
    },
    {
      "index": "149",
      "text": "وَلَمَّا سُقِطَ فِي أَيْدِيهِمْ وَرَأَوْا أَنَّهُمْ قَدْ ضَلُّوا قَالُوا لَئِنْ لَمْ يَرْحَمْنَا رَبُّنَا وَيَغْفِرْ لَنَا لَنَكُونَنَّ مِنَ الْخَاسِرِينَ"
    },
    {
      "index": "150",
      "text": "وَلَمَّا رَجَعَ مُوسَىٰ إِلَىٰ قَوْمِهِ غَضْبَانَ أَسِفًا قَالَ بِئْسَمَا خَلَفْتُمُونِي مِنْ بَعْدِي ۖ أَعَجِلْتُمْ أَمْرَ رَبِّكُمْ ۖ وَأَلْقَى الْأَلْوَاحَ وَأَخَذَ بِرَأْسِ أَخِيهِ يَجُرُّهُ إِلَيْهِ ۚ قَالَ ابْنَ أُمَّ إِنَّ الْقَوْمَ اسْتَضْعَفُونِي وَكَادُوا يَقْتُلُونَنِي فَلَا تُشْمِتْ بِيَ الْأَعْدَاءَ وَلَا تَجْعَلْنِي مَعَ الْقَوْمِ الظَّالِمِينَ"
    },
    {
      "index": "151",
      "text": "قَالَ رَبِّ اغْفِرْ لِي وَلِأَخِي وَأَدْخِلْنَا فِي رَحْمَتِكَ ۖ وَأَنْتَ أَرْحَمُ الرَّاحِمِينَ"
    },
    {
      "index": "152",
      "text": "إِنَّ الَّذِينَ اتَّخَذُوا الْعِجْلَ سَيَنَالُهُمْ غَضَبٌ مِنْ رَبِّهِمْ وَذِلَّةٌ فِي الْحَيَاةِ الدُّنْيَا ۚ وَكَذَٰلِكَ نَجْزِي الْمُفْتَرِينَ"
    },
    {
      "index": "153",
      "text": "وَالَّذِينَ عَمِلُوا السَّيِّئَاتِ ثُمَّ تَابُوا مِنْ بَعْدِهَا وَآمَنُوا إِنَّ رَبَّكَ مِنْ بَعْدِهَا لَغَفُورٌ رَحِيمٌ"
    },
    {
      "index": "154",
      "text": "وَلَمَّا سَكَتَ عَنْ مُوسَى الْغَضَبُ أَخَذَ الْأَلْوَاحَ ۖ وَفِي نُسْخَتِهَا هُدًى وَرَحْمَةٌ لِلَّذِينَ هُمْ لِرَبِّهِمْ يَرْهَبُونَ"
    },
    {
      "index": "155",
      "text": "وَاخْتَارَ مُوسَىٰ قَوْمَهُ سَبْعِينَ رَجُلًا لِمِيقَاتِنَا ۖ فَلَمَّا أَخَذَتْهُمُ الرَّجْفَةُ قَالَ رَبِّ لَوْ شِئْتَ أَهْلَكْتَهُمْ مِنْ قَبْلُ وَإِيَّايَ ۖ أَتُهْلِكُنَا بِمَا فَعَلَ السُّفَهَاءُ مِنَّا ۖ إِنْ هِيَ إِلَّا فِتْنَتُكَ تُضِلُّ بِهَا مَنْ تَشَاءُ وَتَهْدِي مَنْ تَشَاءُ ۖ أَنْتَ وَلِيُّنَا فَاغْفِرْ لَنَا وَارْحَمْنَا ۖ وَأَنْتَ خَيْرُ الْغَافِرِينَ"
    },
    {
      "index": "156",
      "text": "۞ وَاكْتُبْ لَنَا فِي هَـٰذِهِ الدُّنْيَا حَسَنَةً وَفِي الْآخِرَةِ إِنَّا هُدْنَا إِلَيْكَ ۚ قَالَ عَذَابِي أُصِيبُ بِهِ مَنْ أَشَاءُ ۖ وَرَحْمَتِي وَسِعَتْ كُلَّ شَيْءٍ ۚ فَسَأَكْتُبُهَا لِلَّذِينَ يَتَّقُونَ وَيُؤْتُونَ الزَّكَاةَ وَالَّذِينَ هُمْ بِآيَاتِنَا يُؤْمِنُونَ"
    },
    {
      "index": "157",
      "text": "الَّذِينَ يَتَّبِعُونَ الرَّسُولَ النَّبِيَّ الْأُمِّيَّ الَّذِي يَجِدُونَهُ مَكْتُوبًا عِنْدَهُمْ فِي التَّوْرَاةِ وَالْإِنْجِيلِ يَأْمُرُهُمْ بِالْمَعْرُوفِ وَيَنْهَاهُمْ عَنِ الْمُنْكَرِ وَيُحِلُّ لَهُمُ الطَّيِّبَاتِ وَيُحَرِّمُ عَلَيْهِمُ الْخَبَائِثَ وَيَضَعُ عَنْهُمْ إِصْرَهُمْ وَالْأَغْلَالَ الَّتِي كَانَتْ عَلَيْهِمْ ۚ فَالَّذِينَ آمَنُوا بِهِ وَعَزَّرُوهُ وَنَصَرُوهُ وَاتَّبَعُوا النُّورَ الَّذِي أُنْزِلَ مَعَهُ ۙ أُولَـٰئِكَ هُمُ الْمُفْلِحُونَ"
    },
    {
      "index": "158",
      "text": "قُلْ يَا أَيُّهَا النَّاسُ إِنِّي رَسُولُ اللَّهِ إِلَيْكُمْ جَمِيعًا الَّذِي لَهُ مُلْكُ السَّمَاوَاتِ وَالْأَرْضِ ۖ لَا إِلَـٰهَ إِلَّا هُوَ يُحْيِي وَيُمِيتُ ۖ فَآمِنُوا بِاللَّهِ وَرَسُولِهِ النَّبِيِّ الْأُمِّيِّ الَّذِي يُؤْمِنُ بِاللَّهِ وَكَلِمَاتِهِ وَاتَّبِعُوهُ لَعَلَّكُمْ تَهْتَدُونَ"
    },
    {
      "index": "159",
      "text": "وَمِنْ قَوْمِ مُوسَىٰ أُمَّةٌ يَهْدُونَ بِالْحَقِّ وَبِهِ يَعْدِلُونَ"
    },
    {
      "index": "160",
      "text": "وَقَطَّعْنَاهُمُ اثْنَتَيْ عَشْرَةَ أَسْبَاطًا أُمَمًا ۚ وَأَوْحَيْنَا إِلَىٰ مُوسَىٰ إِذِ اسْتَسْقَاهُ قَوْمُهُ أَنِ اضْرِبْ بِعَصَاكَ الْحَجَرَ ۖ فَانْبَجَسَتْ مِنْهُ اثْنَتَا عَشْرَةَ عَيْنًا ۖ قَدْ عَلِمَ كُلُّ أُنَاسٍ مَشْرَبَهُمْ ۚ وَظَلَّلْنَا عَلَيْهِمُ الْغَمَامَ وَأَنْزَلْنَا عَلَيْهِمُ الْمَنَّ وَالسَّلْوَىٰ ۖ كُلُوا مِنْ طَيِّبَاتِ مَا رَزَقْنَاكُمْ ۚ وَمَا ظَلَمُونَا وَلَـٰكِنْ كَانُوا أَنْفُسَهُمْ يَظْلِمُونَ"
    },
    {
      "index": "161",
      "text": "وَإِذْ قِيلَ لَهُمُ اسْكُنُوا هَـٰذِهِ الْقَرْيَةَ وَكُلُوا مِنْهَا حَيْثُ شِئْتُمْ وَقُولُوا حِطَّةٌ وَادْخُلُوا الْبَابَ سُجَّدًا نَغْفِرْ لَكُمْ خَطِيئَاتِكُمْ ۚ سَنَزِيدُ الْمُحْسِنِينَ"
    },
    {
      "index": "162",
      "text": "فَبَدَّلَ الَّذِينَ ظَلَمُوا مِنْهُمْ قَوْلًا غَيْرَ الَّذِي قِيلَ لَهُمْ فَأَرْسَلْنَا عَلَيْهِمْ رِجْزًا مِنَ السَّمَاءِ بِمَا كَانُوا يَظْلِمُونَ"
    },
    {
      "index": "163",
      "text": "وَاسْأَلْهُمْ عَنِ الْقَرْيَةِ الَّتِي كَانَتْ حَاضِرَةَ الْبَحْرِ إِذْ يَعْدُونَ فِي السَّبْتِ إِذْ تَأْتِيهِمْ حِيتَانُهُمْ يَوْمَ سَبْتِهِمْ شُرَّعًا وَيَوْمَ لَا يَسْبِتُونَ ۙ لَا تَأْتِيهِمْ ۚ كَذَٰلِكَ نَبْلُوهُمْ بِمَا كَانُوا يَفْسُقُونَ"
    },
    {
      "index": "164",
      "text": "وَإِذْ قَالَتْ أُمَّةٌ مِنْهُمْ لِمَ تَعِظُونَ قَوْمًا ۙ اللَّهُ مُهْلِكُهُمْ أَوْ مُعَذِّبُهُمْ عَذَابًا شَدِيدًا ۖ قَالُوا مَعْذِرَةً إِلَىٰ رَبِّكُمْ وَلَعَلَّهُمْ يَتَّقُونَ"
    },
    {
      "index": "165",
      "text": "فَلَمَّا نَسُوا مَا ذُكِّرُوا بِهِ أَنْجَيْنَا الَّذِينَ يَنْهَوْنَ عَنِ السُّوءِ وَأَخَذْنَا الَّذِينَ ظَلَمُوا بِعَذَابٍ بَئِيسٍ بِمَا كَانُوا يَفْسُقُونَ"
    },
    {
      "index": "166",
      "text": "فَلَمَّا عَتَوْا عَنْ مَا نُهُوا عَنْهُ قُلْنَا لَهُمْ كُونُوا قِرَدَةً خَاسِئِينَ"
    },
    {
      "index": "167",
      "text": "وَإِذْ تَأَذَّنَ رَبُّكَ لَيَبْعَثَنَّ عَلَيْهِمْ إِلَىٰ يَوْمِ الْقِيَامَةِ مَنْ يَسُومُهُمْ سُوءَ الْعَذَابِ ۗ إِنَّ رَبَّكَ لَسَرِيعُ الْعِقَابِ ۖ وَإِنَّهُ لَغَفُورٌ رَحِيمٌ"
    },
    {
      "index": "168",
      "text": "وَقَطَّعْنَاهُمْ فِي الْأَرْضِ أُمَمًا ۖ مِنْهُمُ الصَّالِحُونَ وَمِنْهُمْ دُونَ ذَٰلِكَ ۖ وَبَلَوْنَاهُمْ بِالْحَسَنَاتِ وَالسَّيِّئَاتِ لَعَلَّهُمْ يَرْجِعُونَ"
    },
    {
      "index": "169",
      "text": "فَخَلَفَ مِنْ بَعْدِهِمْ خَلْفٌ وَرِثُوا الْكِتَابَ يَأْخُذُونَ عَرَضَ هَـٰذَا الْأَدْنَىٰ وَيَقُولُونَ سَيُغْفَرُ لَنَا وَإِنْ يَأْتِهِمْ عَرَضٌ مِثْلُهُ يَأْخُذُوهُ ۚ أَلَمْ يُؤْخَذْ عَلَيْهِمْ مِيثَاقُ الْكِتَابِ أَنْ لَا يَقُولُوا عَلَى اللَّهِ إِلَّا الْحَقَّ وَدَرَسُوا مَا فِيهِ ۗ وَالدَّارُ الْآخِرَةُ خَيْرٌ لِلَّذِينَ يَتَّقُونَ ۗ أَفَلَا تَعْقِلُونَ"
    },
    {
      "index": "170",
      "text": "وَالَّذِينَ يُمَسِّكُونَ بِالْكِتَابِ وَأَقَامُوا الصَّلَاةَ إِنَّا لَا نُضِيعُ أَجْرَ الْمُصْلِحِينَ"
    },
    {
      "index": "171",
      "text": "۞ وَإِذْ نَتَقْنَا الْجَبَلَ فَوْقَهُمْ كَأَنَّهُ ظُلَّةٌ وَظَنُّوا أَنَّهُ وَاقِعٌ بِهِمْ خُذُوا مَا آتَيْنَاكُمْ بِقُوَّةٍ وَاذْكُرُوا مَا فِيهِ لَعَلَّكُمْ تَتَّقُونَ"
    },
    {
      "index": "172",
      "text": "وَإِذْ أَخَذَ رَبُّكَ مِنْ بَنِي آدَمَ مِنْ ظُهُورِهِمْ ذُرِّيَّتَهُمْ وَأَشْهَدَهُمْ عَلَىٰ أَنْفُسِهِمْ أَلَسْتُ بِرَبِّكُمْ ۖ قَالُوا بَلَىٰ ۛ شَهِدْنَا ۛ أَنْ تَقُولُوا يَوْمَ الْقِيَامَةِ إِنَّا كُنَّا عَنْ هَـٰذَا غَافِلِينَ"
    },
    {
      "index": "173",
      "text": "أَوْ تَقُولُوا إِنَّمَا أَشْرَكَ آبَاؤُنَا مِنْ قَبْلُ وَكُنَّا ذُرِّيَّةً مِنْ بَعْدِهِمْ ۖ أَفَتُهْلِكُنَا بِمَا فَعَلَ الْمُبْطِلُونَ"
    },
    {
      "index": "174",
      "text": "وَكَذَٰلِكَ نُفَصِّلُ الْآيَاتِ وَلَعَلَّهُمْ يَرْجِعُونَ"
    },
    {
      "index": "175",
      "text": "وَاتْلُ عَلَيْهِمْ نَبَأَ الَّذِي آتَيْنَاهُ آيَاتِنَا فَانْسَلَخَ مِنْهَا فَأَتْبَعَهُ الشَّيْطَانُ فَكَانَ مِنَ الْغَاوِينَ"
    },
    {
      "index": "176",
      "text": "وَلَوْ شِئْنَا لَرَفَعْنَاهُ بِهَا وَلَـٰكِنَّهُ أَخْلَدَ إِلَى الْأَرْضِ وَاتَّبَعَ هَوَاهُ ۚ فَمَثَلُهُ كَمَثَلِ الْكَلْبِ إِنْ تَحْمِلْ عَلَيْهِ يَلْهَثْ أَوْ تَتْرُكْهُ يَلْهَثْ ۚ ذَٰلِكَ مَثَلُ الْقَوْمِ الَّذِينَ كَذَّبُوا بِآيَاتِنَا ۚ فَاقْصُصِ الْقَصَصَ لَعَلَّهُمْ يَتَفَكَّرُونَ"
    },
    {
      "index": "177",
      "text": "سَاءَ مَثَلًا الْقَوْمُ الَّذِينَ كَذَّبُوا بِآيَاتِنَا وَأَنْفُسَهُمْ كَانُوا يَظْلِمُونَ"
    },
    {
      "index": "178",
      "text": "مَنْ يَهْدِ اللَّهُ فَهُوَ الْمُهْتَدِي ۖ وَمَنْ يُضْلِلْ فَأُولَـٰئِكَ هُمُ الْخَاسِرُونَ"
    },
    {
      "index": "179",
      "text": "وَلَقَدْ ذَرَأْنَا لِجَهَنَّمَ كَثِيرًا مِنَ الْجِنِّ وَالْإِنْسِ ۖ لَهُمْ قُلُوبٌ لَا يَفْقَهُونَ بِهَا وَلَهُمْ أَعْيُنٌ لَا يُبْصِرُونَ بِهَا وَلَهُمْ آذَانٌ لَا يَسْمَعُونَ بِهَا ۚ أُولَـٰئِكَ كَالْأَنْعَامِ بَلْ هُمْ أَضَلُّ ۚ أُولَـٰئِكَ هُمُ الْغَافِلُونَ"
    },
    {
      "index": "180",
      "text": "وَلِلَّهِ الْأَسْمَاءُ الْحُسْنَىٰ فَادْعُوهُ بِهَا ۖ وَذَرُوا الَّذِينَ يُلْحِدُونَ فِي أَسْمَائِهِ ۚ سَيُجْزَوْنَ مَا كَانُوا يَعْمَلُونَ"
    },
    {
      "index": "181",
      "text": "وَمِمَّنْ خَلَقْنَا أُمَّةٌ يَهْدُونَ بِالْحَقِّ وَبِهِ يَعْدِلُونَ"
    },
    {
      "index": "182",
      "text": "وَالَّذِينَ كَذَّبُوا بِآيَاتِنَا سَنَسْتَدْرِجُهُمْ مِنْ حَيْثُ لَا يَعْلَمُونَ"
    },
    {
      "index": "183",
      "text": "وَأُمْلِي لَهُمْ ۚ إِنَّ كَيْدِي مَتِينٌ"
    },
    {
      "index": "184",
      "text": "أَوَلَمْ يَتَفَكَّرُوا ۗ مَا بِصَاحِبِهِمْ مِنْ جِنَّةٍ ۚ إِنْ هُوَ إِلَّا نَذِيرٌ مُبِينٌ"
    },
    {
      "index": "185",
      "text": "أَوَلَمْ يَنْظُرُوا فِي مَلَكُوتِ السَّمَاوَاتِ وَالْأَرْضِ وَمَا خَلَقَ اللَّهُ مِنْ شَيْءٍ وَأَنْ عَسَىٰ أَنْ يَكُونَ قَدِ اقْتَرَبَ أَجَلُهُمْ ۖ فَبِأَيِّ حَدِيثٍ بَعْدَهُ يُؤْمِنُونَ"
    },
    {
      "index": "186",
      "text": "مَنْ يُضْلِلِ اللَّهُ فَلَا هَادِيَ لَهُ ۚ وَيَذَرُهُمْ فِي طُغْيَانِهِمْ يَعْمَهُونَ"
    },
    {
      "index": "187",
      "text": "يَسْأَلُونَكَ عَنِ السَّاعَةِ أَيَّانَ مُرْسَاهَا ۖ قُلْ إِنَّمَا عِلْمُهَا عِنْدَ رَبِّي ۖ لَا يُجَلِّيهَا لِوَقْتِهَا إِلَّا هُوَ ۚ ثَقُلَتْ فِي السَّمَاوَاتِ وَالْأَرْضِ ۚ لَا تَأْتِيكُمْ إِلَّا بَغْتَةً ۗ يَسْأَلُونَكَ كَأَنَّكَ حَفِيٌّ عَنْهَا ۖ قُلْ إِنَّمَا عِلْمُهَا عِنْدَ اللَّهِ وَلَـٰكِنَّ أَكْثَرَ النَّاسِ لَا يَعْلَمُونَ"
    },
    {
      "index": "188",
      "text": "قُلْ لَا أَمْلِكُ لِنَفْسِي نَفْعًا وَلَا ضَرًّا إِلَّا مَا شَاءَ اللَّهُ ۚ وَلَوْ كُنْتُ أَعْلَمُ الْغَيْبَ لَاسْتَكْثَرْتُ مِنَ الْخَيْرِ وَمَا مَسَّنِيَ السُّوءُ ۚ إِنْ أَنَا إِلَّا نَذِيرٌ وَبَشِيرٌ لِقَوْمٍ يُؤْمِنُونَ"
    },
    {
      "index": "189",
      "text": "۞ هُوَ الَّذِي خَلَقَكُمْ مِنْ نَفْسٍ وَاحِدَةٍ وَجَعَلَ مِنْهَا زَوْجَهَا لِيَسْكُنَ إِلَيْهَا ۖ فَلَمَّا تَغَشَّاهَا حَمَلَتْ حَمْلًا خَفِيفًا فَمَرَّتْ بِهِ ۖ فَلَمَّا أَثْقَلَتْ دَعَوَا اللَّهَ رَبَّهُمَا لَئِنْ آتَيْتَنَا صَالِحًا لَنَكُونَنَّ مِنَ الشَّاكِرِينَ"
    },
    {
      "index": "190",
      "text": "فَلَمَّا آتَاهُمَا صَالِحًا جَعَلَا لَهُ شُرَكَاءَ فِيمَا آتَاهُمَا ۚ فَتَعَالَى اللَّهُ عَمَّا يُشْرِكُونَ"
    },
    {
      "index": "191",
      "text": "أَيُشْرِكُونَ مَا لَا يَخْلُقُ شَيْئًا وَهُمْ يُخْلَقُونَ"
    },
    {
      "index": "192",
      "text": "وَلَا يَسْتَطِيعُونَ لَهُمْ نَصْرًا وَلَا أَنْفُسَهُمْ يَنْصُرُونَ"
    },
    {
      "index": "193",
      "text": "وَإِنْ تَدْعُوهُمْ إِلَى الْهُدَىٰ لَا يَتَّبِعُوكُمْ ۚ سَوَاءٌ عَلَيْكُمْ أَدَعَوْتُمُوهُمْ أَمْ أَنْتُمْ صَامِتُونَ"
    },
    {
      "index": "194",
      "text": "إِنَّ الَّذِينَ تَدْعُونَ مِنْ دُونِ اللَّهِ عِبَادٌ أَمْثَالُكُمْ ۖ فَادْعُوهُمْ فَلْيَسْتَجِيبُوا لَكُمْ إِنْ كُنْتُمْ صَادِقِينَ"
    },
    {
      "index": "195",
      "text": "أَلَهُمْ أَرْجُلٌ يَمْشُونَ بِهَا ۖ أَمْ لَهُمْ أَيْدٍ يَبْطِشُونَ بِهَا ۖ أَمْ لَهُمْ أَعْيُنٌ يُبْصِرُونَ بِهَا ۖ أَمْ لَهُمْ آذَانٌ يَسْمَعُونَ بِهَا ۗ قُلِ ادْعُوا شُرَكَاءَكُمْ ثُمَّ كِيدُونِ فَلَا تُنْظِرُونِ"
    },
    {
      "index": "196",
      "text": "إِنَّ وَلِيِّيَ اللَّهُ الَّذِي نَزَّلَ الْكِتَابَ ۖ وَهُوَ يَتَوَلَّى الصَّالِحِينَ"
    },
    {
      "index": "197",
      "text": "وَالَّذِينَ تَدْعُونَ مِنْ دُونِهِ لَا يَسْتَطِيعُونَ نَصْرَكُمْ وَلَا أَنْفُسَهُمْ يَنْصُرُونَ"
    },
    {
      "index": "198",
      "text": "وَإِنْ تَدْعُوهُمْ إِلَى الْهُدَىٰ لَا يَسْمَعُوا ۖ وَتَرَاهُمْ يَنْظُرُونَ إِلَيْكَ وَهُمْ لَا يُبْصِرُونَ"
    },
    {
      "index": "199",
      "text": "خُذِ الْعَفْوَ وَأْمُرْ بِالْعُرْفِ وَأَعْرِضْ عَنِ الْجَاهِلِينَ"
    },
    {
      "index": "200",
      "text": "وَإِمَّا يَنْزَغَنَّكَ مِنَ الشَّيْطَانِ نَزْغٌ فَاسْتَعِذْ بِاللَّهِ ۚ إِنَّهُ سَمِيعٌ عَلِيمٌ"
    },
    {
      "index": "201",
      "text": "إِنَّ الَّذِينَ اتَّقَوْا إِذَا مَسَّهُمْ طَائِفٌ مِنَ الشَّيْطَانِ تَذَكَّرُوا فَإِذَا هُمْ مُبْصِرُونَ"
    },
    {
      "index": "202",
      "text": "وَإِخْوَانُهُمْ يَمُدُّونَهُمْ فِي الْغَيِّ ثُمَّ لَا يُقْصِرُونَ"
    },
    {
      "index": "203",
      "text": "وَإِذَا لَمْ تَأْتِهِمْ بِآيَةٍ قَالُوا لَوْلَا اجْتَبَيْتَهَا ۚ قُلْ إِنَّمَا أَتَّبِعُ مَا يُوحَىٰ إِلَيَّ مِنْ رَبِّي ۚ هَـٰذَا بَصَائِرُ مِنْ رَبِّكُمْ وَهُدًى وَرَحْمَةٌ لِقَوْمٍ يُؤْمِنُونَ"
    },
    {
      "index": "204",
      "text": "وَإِذَا قُرِئَ الْقُرْآنُ فَاسْتَمِعُوا لَهُ وَأَنْصِتُوا لَعَلَّكُمْ تُرْحَمُونَ"
    },
    {
      "index": "205",
      "text": "وَاذْكُرْ رَبَّكَ فِي نَفْسِكَ تَضَرُّعًا وَخِيفَةً وَدُونَ الْجَهْرِ مِنَ الْقَوْلِ بِالْغُدُوِّ وَالْآصَالِ وَلَا تَكُنْ مِنَ الْغَافِلِينَ"
    },
    {
      "index": "206",
      "text": "إِنَّ الَّذِينَ عِنْدَ رَبِّكَ لَا يَسْتَكْبِرُونَ عَنْ عِبَادَتِهِ وَيُسَبِّحُونَهُ وَلَهُ يَسْجُدُونَ ۩"
    }
  ],
  "index": "7",
  "name": "الأعراف",
  "copyright": "# PLEASE DO NOT REMOVE OR CHANGE THIS COPYRIGHT BLOCK \n#==================================================================== \n#\n#  Tanzil Quran Text (Simple Plain, Version 1.1)\n#  Copyright (C) 2007-2022 Tanzil Project\n#  License: Creative Commons Attribution 3.0\n#\n#  This copy of the Quran text is carefully produced, highly \n#  verified and continuously monitored by a group of specialists \n#  at Tanzil Project.\n#\n#  TERMS OF USE:\n#\n#  - Permission is granted to copy and distribute verbatim copies \n#    of this text, but CHANGING IT IS NOT ALLOWED.\n#\n#  - This Quran text can be used in any website or application, \n#    provided that its source (Tanzil Project) is clearly indicated, \n#    and a link is made to tanzil.net to enable users to keep\n#    track of changes.\n#\n#  - This copyright notice shall be included in all verbatim copies \n#    of the text, and shall be reproduced appropriately in all files \n#    derived from or containing substantial portion of this text.\n#\n#  Please check updates at: http://tanzil.net/updates/\n#\n#====================================================================\n",
  "type": "simple-plain",
  "version": "1.1"
}