{
  "aya": [
    {
      "index": "1",
      "text": "يس",
      "bismillah": "بِسمِ اللَّهِ الرَّحمـٰنِ الرَّحيمِ"
    },
    {
      "index": "2",
      "text": "وَالقُرءانِ الحَكيمِ"
    },
    {
      "index": "3",
      "text": "إِنَّكَ لَمِنَ المُرسَلينَ"
    },
    {
      "index": "4",
      "text": "عَلىٰ صِرٰطٍ مُستَقيمٍ"
    },
    {
      "index": "5",
      "text": "تَنزيلَ العَزيزِ الرَّحيمِ"
    },
    {
      "index": "6",
      "text": "لِتُنذِرَ قَومًا ما أُنذِرَ ءاباؤُهُم فَهُم غـٰفِلونَ"
    },
    {
      "index": "7",
      "text": "لَقَد حَقَّ القَولُ عَلىٰ أَكثَرِهِم فَهُم لا يُؤمِنونَ"
    },
    {
      "index": "8",
      "text": "إِنّا جَعَلنا فى أَعنـٰقِهِم أَغلـٰلًا فَهِىَ إِلَى الأَذقانِ فَهُم مُقمَحونَ"
    },
    {
      "index": "9",
      "text": "وَجَعَلنا مِن بَينِ أَيديهِم سَدًّا وَمِن خَلفِهِم سَدًّا فَأَغشَينـٰهُم فَهُم لا يُبصِرونَ"
    },
    {
      "index": "10",
      "text": "وَسَواءٌ عَلَيهِم ءَأَنذَرتَهُم أَم لَم تُنذِرهُم لا يُؤمِنونَ"
    },
    {
      "index": "11",
      "text": "إِنَّما تُنذِرُ مَنِ اتَّبَعَ الذِّكرَ وَخَشِىَ الرَّحمـٰنَ بِالغَيبِ ۖ فَبَشِّرهُ بِمَغفِرَةٍ وَأَجرٍ كَريمٍ"
    },
    {
      "index": "12",
      "text": "إِنّا نَحنُ نُحىِ المَوتىٰ وَنَكتُبُ ما قَدَّموا وَءاثـٰرَهُم ۚ وَكُلَّ شَىءٍ أَحصَينـٰهُ فى إِمامٍ مُبينٍ"
    },
    {
      "index": "13",
      "text": "وَاضرِب لَهُم مَثَلًا أَصحـٰبَ القَريَةِ إِذ جاءَهَا المُرسَلونَ"
    },
    {
      "index": "14",
      "text": "إِذ أَرسَلنا إِلَيهِمُ اثنَينِ فَكَذَّبوهُما فَعَزَّزنا بِثالِثٍ فَقالوا إِنّا إِلَيكُم مُرسَلونَ"
    },
    {
      "index": "15",
      "text": "قالوا ما أَنتُم إِلّا بَشَرٌ مِثلُنا وَما أَنزَلَ الرَّحمـٰنُ مِن شَىءٍ إِن أَنتُم إِلّا تَكذِبونَ"
    },
    {
      "index": "16",
      "text": "قالوا رَبُّنا يَعلَمُ إِنّا إِلَيكُم لَمُرسَلونَ"
    },
    {
      "index": "17",
      "text": "وَما عَلَينا إِلَّا البَلـٰغُ المُبينُ"
    },
    {
      "index": "18",
      "text": "قالوا إِنّا تَطَيَّرنا بِكُم ۖ لَئِن لَم تَنتَهوا لَنَرجُمَنَّكُم وَلَيَمَسَّنَّكُم مِنّا عَذابٌ أَليمٌ"
    },
    {
      "index": "19",
      "text": "قالوا طـٰئِرُكُم مَعَكُم ۚ أَئِن ذُكِّرتُم ۚ بَل أَنتُم قَومٌ مُسرِفونَ"
    },
    {
      "index": "20",
      "text": "وَجاءَ مِن أَقصَا المَدينَةِ رَجُلٌ يَسعىٰ قالَ يـٰقَومِ اتَّبِعُوا المُرسَلينَ"
    },
    {
      "index": "21",
      "text": "اتَّبِعوا مَن لا يَسـَٔلُكُم أَجرًا وَهُم مُهتَدونَ"
    },
    {
      "index": "22",
      "text": "وَما لِىَ لا أَعبُدُ الَّذى فَطَرَنى وَإِلَيهِ تُرجَعونَ"
    },
    {
      "index": "23",
      "text": "ءَأَتَّخِذُ مِن دونِهِ ءالِهَةً إِن يُرِدنِ الرَّحمـٰنُ بِضُرٍّ لا تُغنِ عَنّى شَفـٰعَتُهُم شَيـًٔا وَلا يُنقِذونِ"
    },
    {
      "index": "24",
      "text": "إِنّى إِذًا لَفى ضَلـٰلٍ مُبينٍ"
    },
    {
      "index": "25",
      "text": "إِنّى ءامَنتُ بِرَبِّكُم فَاسمَعونِ"
    },
    {
      "index": "26",
      "text": "قيلَ ادخُلِ الجَنَّةَ ۖ قالَ يـٰلَيتَ قَومى يَعلَمونَ"
    },
    {
      "index": "27",
      "text": "بِما غَفَرَ لى رَبّى وَجَعَلَنى مِنَ المُكرَمينَ"
    },
    {
      "index": "28",
      "text": "۞ وَما أَنزَلنا عَلىٰ قَومِهِ مِن بَعدِهِ مِن جُندٍ مِنَ السَّماءِ وَما كُنّا مُنزِلينَ"
    },
    {
      "index": "29",
      "text": "إِن كانَت إِلّا صَيحَةً وٰحِدَةً فَإِذا هُم خـٰمِدونَ"
    },
    {
      "index": "30",
      "text": "يـٰحَسرَةً عَلَى العِبادِ ۚ ما يَأتيهِم مِن رَسولٍ إِلّا كانوا بِهِ يَستَهزِءونَ"
    },
    {
      "index": "31",
      "text": "أَلَم يَرَوا كَم أَهلَكنا قَبلَهُم مِنَ القُرونِ أَنَّهُم إِلَيهِم لا يَرجِعونَ"
    },
    {
      "index": "32",
      "text": "وَإِن كُلٌّ لَمّا جَميعٌ لَدَينا مُحضَرونَ"
    },
    {
      "index": "33",
      "text": "وَءايَةٌ لَهُمُ الأَرضُ المَيتَةُ أَحيَينـٰها وَأَخرَجنا مِنها حَبًّا فَمِنهُ يَأكُلونَ"
    },
    {
      "index": "34",
      "text": "وَجَعَلنا فيها جَنّـٰتٍ مِن نَخيلٍ وَأَعنـٰبٍ وَفَجَّرنا فيها مِنَ العُيونِ"
    },
    {
      "index": "35",
      "text": "لِيَأكُلوا مِن ثَمَرِهِ وَما عَمِلَتهُ أَيديهِم ۖ أَفَلا يَشكُرونَ"
    },
    {
      "index": "36",
      "text": "سُبحـٰنَ الَّذى خَلَقَ الأَزوٰجَ كُلَّها مِمّا تُنبِتُ الأَرضُ وَمِن أَنفُسِهِم وَمِمّا لا يَعلَمونَ"
    },
    {
      "index": "37",
      "text": "وَءايَةٌ لَهُمُ الَّيلُ نَسلَخُ مِنهُ النَّهارَ فَإِذا هُم مُظلِمونَ"
    },
    {
      "index": "38",
      "text": "وَالشَّمسُ تَجرى لِمُستَقَرٍّ لَها ۚ ذٰلِكَ تَقديرُ العَزيزِ العَليمِ"
    },
    {
      "index": "39",
      "text": "وَالقَمَرَ قَدَّرنـٰهُ مَنازِلَ حَتّىٰ عادَ كَالعُرجونِ القَديمِ"
    },
    {
      "index": "40",
      "text": "لَا الشَّمسُ يَنبَغى لَها أَن تُدرِكَ القَمَرَ وَلَا الَّيلُ سابِقُ النَّهارِ ۚ وَكُلٌّ فى فَلَكٍ يَسبَحونَ"
    },
    {
      "index": "41",
      "text": "وَءايَةٌ لَهُم أَنّا حَمَلنا ذُرِّيَّتَهُم فِى الفُلكِ المَشحونِ"
    },
    {
      "index": "42",
      "text": "وَخَلَقنا لَهُم مِن مِثلِهِ ما يَركَبونَ"
    },
    {
      "index": "43",
      "text": "وَإِن نَشَأ نُغرِقهُم فَلا صَريخَ لَهُم وَلا هُم يُنقَذونَ"
    },
    {
      "index": "44",
      "text": "إِلّا رَحمَةً مِنّا وَمَتـٰعًا إِلىٰ حينٍ"
    },
    {
      "index": "45",
      "text": "وَإِذا قيلَ لَهُمُ اتَّقوا ما بَينَ أَيديكُم وَما خَلفَكُم لَعَلَّكُم تُرحَمونَ"
    },
    {
      "index": "46",
      "text": "وَما تَأتيهِم مِن ءايَةٍ مِن ءايـٰتِ رَبِّهِم إِلّا كانوا عَنها مُعرِضينَ"
    },
    {
      "index": "47",
      "text": "وَإِذا قيلَ لَهُم أَنفِقوا مِمّا رَزَقَكُمُ اللَّهُ قالَ الَّذينَ كَفَروا لِلَّذينَ ءامَنوا أَنُطعِمُ مَن لَو يَشاءُ اللَّهُ أَطعَمَهُ إِن أَنتُم إِلّا فى ضَلـٰلٍ مُبينٍ"
    },
    {
      "index": "48",
      "text": "وَيَقولونَ مَتىٰ هـٰذَا الوَعدُ إِن كُنتُم صـٰدِقينَ"
    },
    {
      "index": "49",
      "text": "ما يَنظُرونَ إِلّا صَيحَةً وٰحِدَةً تَأخُذُهُم وَهُم يَخِصِّمونَ"
    },
    {
      "index": "50",
      "text": "فَلا يَستَطيعونَ تَوصِيَةً وَلا إِلىٰ أَهلِهِم يَرجِعونَ"
    },
    {
      "index": "51",
      "text": "وَنُفِخَ فِى الصّورِ فَإِذا هُم مِنَ الأَجداثِ إِلىٰ رَبِّهِم يَنسِلونَ"
    },
    {
      "index": "52",
      "text": "قالوا يـٰوَيلَنا مَن بَعَثَنا مِن مَرقَدِنا ۜ ۗ هـٰذا ما وَعَدَ الرَّحمـٰنُ وَصَدَقَ المُرسَلونَ"
    },
    {
      "index": "53",
      "text": "إِن كانَت إِلّا صَيحَةً وٰحِدَةً فَإِذا هُم جَميعٌ لَدَينا مُحضَرونَ"
    },
    {
      "index": "54",
      "text": "فَاليَومَ لا تُظلَمُ نَفسٌ شَيـًٔا وَلا تُجزَونَ إِلّا ما كُنتُم تَعمَلونَ"
    },
    {
      "index": "55",
      "text": "إِنَّ أَصحـٰبَ الجَنَّةِ اليَومَ فى شُغُلٍ فـٰكِهونَ"
    },
    {
      "index": "56",
      "text": "هُم وَأَزوٰجُهُم فى ظِلـٰلٍ عَلَى الأَرائِكِ مُتَّكِـٔونَ"
    },
    {
      "index": "57",
      "text": "لَهُم فيها فـٰكِهَةٌ وَلَهُم ما يَدَّعونَ"
    },
    {
      "index": "58",
      "text": "سَلـٰمٌ قَولًا مِن رَبٍّ رَحيمٍ"
    },
    {
      "index": "59",
      "text": "وَامتـٰزُوا اليَومَ أَيُّهَا المُجرِمونَ"
    },
    {
      "index": "60",
      "text": "۞ أَلَم أَعهَد إِلَيكُم يـٰبَنى ءادَمَ أَن لا تَعبُدُوا الشَّيطـٰنَ ۖ إِنَّهُ لَكُم عَدُوٌّ مُبينٌ"
    },
    {
      "index": "61",
      "text": "وَأَنِ اعبُدونى ۚ هـٰذا صِرٰطٌ مُستَقيمٌ"
    },
    {
      "index": "62",
      "text": "وَلَقَد أَضَلَّ مِنكُم جِبِلًّا كَثيرًا ۖ أَفَلَم تَكونوا تَعقِلونَ"
    },
    {
      "index": "63",
      "text": "هـٰذِهِ جَهَنَّمُ الَّتى كُنتُم توعَدونَ"
    },
    {
      "index": "64",
      "text": "اصلَوهَا اليَومَ بِما كُنتُم تَكفُرونَ"
    },
    {
      "index": "65",
      "text": "اليَومَ نَختِمُ عَلىٰ أَفوٰهِهِم وَتُكَلِّمُنا أَيديهِم وَتَشهَدُ أَرجُلُهُم بِما كانوا يَكسِبونَ"
    },
    {
      "index": "66",
      "text": "وَلَو نَشاءُ لَطَمَسنا عَلىٰ أَعيُنِهِم فَاستَبَقُوا الصِّرٰطَ فَأَنّىٰ يُبصِرونَ"
    },
    {
      "index": "67",
      "text": "وَلَو نَشاءُ لَمَسَخنـٰهُم عَلىٰ مَكانَتِهِم فَمَا استَطـٰعوا مُضِيًّا وَلا يَرجِعونَ"
    },
    {
      "index": "68",
      "text": "وَمَن نُعَمِّرهُ نُنَكِّسهُ فِى الخَلقِ ۖ أَفَلا يَعقِلونَ"
    },
    {
      "index": "69",
      "text": "وَما عَلَّمنـٰهُ الشِّعرَ وَما يَنبَغى لَهُ ۚ إِن هُوَ إِلّا ذِكرٌ وَقُرءانٌ مُبينٌ"
    },
    {
      "index": "70",
      "text": "لِيُنذِرَ مَن كانَ حَيًّا وَيَحِقَّ القَولُ عَلَى الكـٰفِرينَ"
    },
    {
      "index": "71",
      "text": "أَوَلَم يَرَوا أَنّا خَلَقنا لَهُم مِمّا عَمِلَت أَيدينا أَنعـٰمًا فَهُم لَها مـٰلِكونَ"
    },
    {
      "index": "72",
      "text": "وَذَلَّلنـٰها لَهُم فَمِنها رَكوبُهُم وَمِنها يَأكُلونَ"
    },
    {
      "index": "73",
      "text": "وَلَهُم فيها مَنـٰفِعُ وَمَشارِبُ ۖ أَفَلا يَشكُرونَ"
    },
    {
      "index": "74",
      "text": "وَاتَّخَذوا مِن دونِ اللَّهِ ءالِهَةً لَعَلَّهُم يُنصَرونَ"
    },
    {
      "index": "75",
      "text": "لا يَستَطيعونَ نَصرَهُم وَهُم لَهُم جُندٌ مُحضَرونَ"
    },
    {
      "index": "76",
      "text": "فَلا يَحزُنكَ قَولُهُم ۘ إِنّا نَعلَمُ ما يُسِرّونَ وَما يُعلِنونَ"
    },
    {
      "index": "77",
      "text": "أَوَلَم يَرَ الإِنسـٰنُ أَنّا خَلَقنـٰهُ مِن نُطفَةٍ فَإِذا هُوَ خَصيمٌ مُبينٌ"
    },
    {
      "index": "78",
      "text": "وَضَرَبَ لَنا مَثَلًا وَنَسِىَ خَلقَهُ ۖ قالَ مَن يُحىِ العِظـٰمَ وَهِىَ رَميمٌ"
    },
    {
      "index": "79",
      "text": "قُل يُحييهَا الَّذى أَنشَأَها أَوَّلَ مَرَّةٍ ۖ وَهُوَ بِكُلِّ خَلقٍ عَليمٌ"
    },
    {
      "index": "80",
      "text": "الَّذى جَعَلَ لَكُم مِنَ الشَّجَرِ الأَخضَرِ نارًا فَإِذا أَنتُم مِنهُ توقِدونَ"
    },
    {
      "index": "81",
      "text": "أَوَلَيسَ الَّذى خَلَقَ السَّمـٰوٰتِ وَالأَرضَ بِقـٰدِرٍ عَلىٰ أَن يَخلُقَ مِثلَهُم ۚ بَلىٰ وَهُوَ الخَلّـٰقُ العَليمُ"
    },
    {
      "index": "82",
      "text": "إِنَّما أَمرُهُ إِذا أَرادَ شَيـًٔا أَن يَقولَ لَهُ كُن فَيَكونُ"
    },
    {
      "index": "83",
      "text": "فَسُبحـٰنَ الَّذى بِيَدِهِ مَلَكوتُ كُلِّ شَىءٍ وَإِلَيهِ تُرجَعونَ"
    }
  ],
  "index": "36",
  "name": "يس",
  "copyright": "# PLEASE DO NOT REMOVE OR CHANGE THIS COPYRIGHT BLOCK \n#==================================================================== \n#\n#  Tanzil Quran Text (Uthmani Minimal, Version 1.1)\n#  Copyright (C) 2007-2022 Tanzil Project\n#  License: Creative Commons Attribution 3.0\n#\n#  This copy of the Quran text is carefully produced, highly \n#  verified and continuously monitored by a group of specialists \n#  at Tanzil Project.\n#\n#  TERMS OF USE:\n#\n#  - Permission is granted to copy and distribute verbatim copies \n#    of this text, but CHANGING IT IS NOT ALLOWED.\n#\n#  - This Quran text can be used in any website or application, \n#    provided that its source (Tanzil Project) is clearly indicated, \n#    and a link is made to tanzil.net to enable users to keep\n#    track of changes.\n#\n#  - This copyright notice shall be included in all verbatim copies \n#    of the text, and shall be reproduced appropriately in all files \n#    derived from or containing substantial portion of this text.\n#\n#  Please check updates at: http://tanzil.net/updates/\n#\n#====================================================================\n",
  "type": "uthmani-min",
  "version": "1.1"
}