{
  "aya": [
    {
      "index": "1",
      "text": "يا أَيُّهَا النّاسُ اتَّقوا رَبَّكُم ۚ إِنَّ زَلزَلَةَ السّاعَةِ شَيءٌ عَظيمٌ",
      "bismillah": "بِسمِ اللَّهِ الرَّحمـٰنِ الرَّحيمِ"
    },
    {
      "index": "2",
      "text": "يَومَ تَرَونَها تَذهَلُ كُلُّ مُرضِعَةٍ عَمّا أَرضَعَت وَتَضَعُ كُلُّ ذاتِ حَملٍ حَملَها وَتَرَى النّاسَ سُكارىٰ وَما هُم بِسُكارىٰ وَلـٰكِنَّ عَذابَ اللَّهِ شَديدٌ"
    },
    {
      "index": "3",
      "text": "وَمِنَ النّاسِ مَن يُجادِلُ فِي اللَّهِ بِغَيرِ عِلمٍ وَيَتَّبِعُ كُلَّ شَيطانٍ مَريدٍ"
    },
    {
      "index": "4",
      "text": "كُتِبَ عَلَيهِ أَنَّهُ مَن تَوَلّاهُ فَأَنَّهُ يُضِلُّهُ وَيَهديهِ إِلىٰ عَذابِ السَّعيرِ"
    },
    {
      "index": "5",
      "text": "يا أَيُّهَا النّاسُ إِن كُنتُم في رَيبٍ مِنَ البَعثِ فَإِنّا خَلَقناكُم مِن تُرابٍ ثُمَّ مِن نُطفَةٍ ثُمَّ مِن عَلَقَةٍ ثُمَّ مِن مُضغَةٍ مُخَلَّقَةٍ وَغَيرِ مُخَلَّقَةٍ لِنُبَيِّنَ لَكُم ۚ وَنُقِرُّ فِي الأَرحامِ ما نَشاءُ إِلىٰ أَجَلٍ مُسَمًّى ثُمَّ نُخرِجُكُم طِفلًا ثُمَّ لِتَبلُغوا أَشُدَّكُم ۖ وَمِنكُم مَن يُتَوَفّىٰ وَمِنكُم مَن يُرَدُّ إِلىٰ أَرذَلِ العُمُرِ لِكَيلا يَعلَمَ مِن بَعدِ عِلمٍ شَيئًا ۚ وَتَرَى الأَرضَ هامِدَةً فَإِذا أَنزَلنا عَلَيهَا الماءَ اهتَزَّت وَرَبَت وَأَنبَتَت مِن كُلِّ زَوجٍ بَهيجٍ"
    },
    {
      "index": "6",
      "text": "ذٰلِكَ بِأَنَّ اللَّهَ هُوَ الحَقُّ وَأَنَّهُ يُحيِي المَوتىٰ وَأَنَّهُ عَلىٰ كُلِّ شَيءٍ قَديرٌ"
    },
    {
      "index": "7",
      "text": "وَأَنَّ السّاعَةَ آتِيَةٌ لا رَيبَ فيها وَأَنَّ اللَّهَ يَبعَثُ مَن فِي القُبورِ"
    },
    {
      "index": "8",
      "text": "وَمِنَ النّاسِ مَن يُجادِلُ فِي اللَّهِ بِغَيرِ عِلمٍ وَلا هُدًى وَلا كِتابٍ مُنيرٍ"
    },
    {
      "index": "9",
      "text": "ثانِيَ عِطفِهِ لِيُضِلَّ عَن سَبيلِ اللَّهِ ۖ لَهُ فِي الدُّنيا خِزيٌ ۖ وَنُذيقُهُ يَومَ القِيامَةِ عَذابَ الحَريقِ"
    },
    {
      "index": "10",
      "text": "ذٰلِكَ بِما قَدَّمَت يَداكَ وَأَنَّ اللَّهَ لَيسَ بِظَلّامٍ لِلعَبيدِ"
    },
    {
      "index": "11",
      "text": "وَمِنَ النّاسِ مَن يَعبُدُ اللَّهَ عَلىٰ حَرفٍ ۖ فَإِن أَصابَهُ خَيرٌ اطمَأَنَّ بِهِ ۖ وَإِن أَصابَتهُ فِتنَةٌ انقَلَبَ عَلىٰ وَجهِهِ خَسِرَ الدُّنيا وَالآخِرَةَ ۚ ذٰلِكَ هُوَ الخُسرانُ المُبينُ"
    },
    {
      "index": "12",
      "text": "يَدعو مِن دونِ اللَّهِ ما لا يَضُرُّهُ وَما لا يَنفَعُهُ ۚ ذٰلِكَ هُوَ الضَّلالُ البَعيدُ"
    },
    {
      "index": "13",
      "text": "يَدعو لَمَن ضَرُّهُ أَقرَبُ مِن نَفعِهِ ۚ لَبِئسَ المَولىٰ وَلَبِئسَ العَشيرُ"
    },
    {
      "index": "14",
      "text": "إِنَّ اللَّهَ يُدخِلُ الَّذينَ آمَنوا وَعَمِلُوا الصّالِحاتِ جَنّاتٍ تَجري مِن تَحتِهَا الأَنهارُ ۚ إِنَّ اللَّهَ يَفعَلُ ما يُريدُ"
    },
    {
      "index": "15",
      "text": "مَن كانَ يَظُنُّ أَن لَن يَنصُرَهُ اللَّهُ فِي الدُّنيا وَالآخِرَةِ فَليَمدُد بِسَبَبٍ إِلَى السَّماءِ ثُمَّ ليَقطَع فَليَنظُر هَل يُذهِبَنَّ كَيدُهُ ما يَغيظُ"
    },
    {
      "index": "16",
      "text": "وَكَذٰلِكَ أَنزَلناهُ آياتٍ بَيِّناتٍ وَأَنَّ اللَّهَ يَهدي مَن يُريدُ"
    },
    {
      "index": "17",
      "text": "إِنَّ الَّذينَ آمَنوا وَالَّذينَ هادوا وَالصّابِئينَ وَالنَّصارىٰ وَالمَجوسَ وَالَّذينَ أَشرَكوا إِنَّ اللَّهَ يَفصِلُ بَينَهُم يَومَ القِيامَةِ ۚ إِنَّ اللَّهَ عَلىٰ كُلِّ شَيءٍ شَهيدٌ"
    },
    {
      "index": "18",
      "text": "أَلَم تَرَ أَنَّ اللَّهَ يَسجُدُ لَهُ مَن فِي السَّماواتِ وَمَن فِي الأَرضِ وَالشَّمسُ وَالقَمَرُ وَالنُّجومُ وَالجِبالُ وَالشَّجَرُ وَالدَّوابُّ وَكَثيرٌ مِنَ النّاسِ ۖ وَكَثيرٌ حَقَّ عَلَيهِ العَذابُ ۗ وَمَن يُهِنِ اللَّهُ فَما لَهُ مِن مُكرِمٍ ۚ إِنَّ اللَّهَ يَفعَلُ ما يَشاءُ ۩"
    },
    {
      "index": "19",
      "text": "۞ هـٰذانِ خَصمانِ اختَصَموا في رَبِّهِم ۖ فَالَّذينَ كَفَروا قُطِّعَت لَهُم ثِيابٌ مِن نارٍ يُصَبُّ مِن فَوقِ رُءوسِهِمُ الحَميمُ"
    },
    {
      "index": "20",
      "text": "يُصهَرُ بِهِ ما في بُطونِهِم وَالجُلودُ"
    },
    {
      "index": "21",
      "text": "وَلَهُم مَقامِعُ مِن حَديدٍ"
    },
    {
      "index": "22",
      "text": "كُلَّما أَرادوا أَن يَخرُجوا مِنها مِن غَمٍّ أُعيدوا فيها وَذوقوا عَذابَ الحَريقِ"
    },
    {
      "index": "23",
      "text": "إِنَّ اللَّهَ يُدخِلُ الَّذينَ آمَنوا وَعَمِلُوا الصّالِحاتِ جَنّاتٍ تَجري مِن تَحتِهَا الأَنهارُ يُحَلَّونَ فيها مِن أَساوِرَ مِن ذَهَبٍ وَلُؤلُؤًا ۖ وَلِباسُهُم فيها حَريرٌ"
    },
    {
      "index": "24",
      "text": "وَهُدوا إِلَى الطَّيِّبِ مِنَ القَولِ وَهُدوا إِلىٰ صِراطِ الحَميدِ"
    },
    {
      "index": "25",
      "text": "إِنَّ الَّذينَ كَفَروا وَيَصُدّونَ عَن سَبيلِ اللَّهِ وَالمَسجِدِ الحَرامِ الَّذي جَعَلناهُ لِلنّاسِ سَواءً العاكِفُ فيهِ وَالبادِ ۚ وَمَن يُرِد فيهِ بِإِلحادٍ بِظُلمٍ نُذِقهُ مِن عَذابٍ أَليمٍ"
    },
    {
      "index": "26",
      "text": "وَإِذ بَوَّأنا لِإِبراهيمَ مَكانَ البَيتِ أَن لا تُشرِك بي شَيئًا وَطَهِّر بَيتِيَ لِلطّائِفينَ وَالقائِمينَ وَالرُّكَّعِ السُّجودِ"
    },
    {
      "index": "27",
      "text": "وَأَذِّن فِي النّاسِ بِالحَجِّ يَأتوكَ رِجالًا وَعَلىٰ كُلِّ ضامِرٍ يَأتينَ مِن كُلِّ فَجٍّ عَميقٍ"
    },
    {
      "index": "28",
      "text": "لِيَشهَدوا مَنافِعَ لَهُم وَيَذكُرُوا اسمَ اللَّهِ في أَيّامٍ مَعلوماتٍ عَلىٰ ما رَزَقَهُم مِن بَهيمَةِ الأَنعامِ ۖ فَكُلوا مِنها وَأَطعِمُوا البائِسَ الفَقيرَ"
    },
    {
      "index": "29",
      "text": "ثُمَّ ليَقضوا تَفَثَهُم وَليوفوا نُذورَهُم وَليَطَّوَّفوا بِالبَيتِ العَتيقِ"
    },
    {
      "index": "30",
      "text": "ذٰلِكَ وَمَن يُعَظِّم حُرُماتِ اللَّهِ فَهُوَ خَيرٌ لَهُ عِندَ رَبِّهِ ۗ وَأُحِلَّت لَكُمُ الأَنعامُ إِلّا ما يُتلىٰ عَلَيكُم ۖ فَاجتَنِبُوا الرِّجسَ مِنَ الأَوثانِ وَاجتَنِبوا قَولَ الزّورِ"
    },
    {
      "index": "31",
      "text": "حُنَفاءَ لِلَّهِ غَيرَ مُشرِكينَ بِهِ ۚ وَمَن يُشرِك بِاللَّهِ فَكَأَنَّما خَرَّ مِنَ السَّماءِ فَتَخطَفُهُ الطَّيرُ أَو تَهوي بِهِ الرّيحُ في مَكانٍ سَحيقٍ"
    },
    {
      "index": "32",
      "text": "ذٰلِكَ وَمَن يُعَظِّم شَعائِرَ اللَّهِ فَإِنَّها مِن تَقوَى القُلوبِ"
    },
    {
      "index": "33",
      "text": "لَكُم فيها مَنافِعُ إِلىٰ أَجَلٍ مُسَمًّى ثُمَّ مَحِلُّها إِلَى البَيتِ العَتيقِ"
    },
    {
      "index": "34",
      "text": "وَلِكُلِّ أُمَّةٍ جَعَلنا مَنسَكًا لِيَذكُرُوا اسمَ اللَّهِ عَلىٰ ما رَزَقَهُم مِن بَهيمَةِ الأَنعامِ ۗ فَإِلـٰهُكُم إِلـٰهٌ واحِدٌ فَلَهُ أَسلِموا ۗ وَبَشِّرِ المُخبِتينَ"
    },
    {
      "index": "35",
      "text": "الَّذينَ إِذا ذُكِرَ اللَّهُ وَجِلَت قُلوبُهُم وَالصّابِرينَ عَلىٰ ما أَصابَهُم وَالمُقيمِي الصَّلاةِ وَمِمّا رَزَقناهُم يُنفِقونَ"
    },
    {
      "index": "36",
      "text": "وَالبُدنَ جَعَلناها لَكُم مِن شَعائِرِ اللَّهِ لَكُم فيها خَيرٌ ۖ فَاذكُرُوا اسمَ اللَّهِ عَلَيها صَوافَّ ۖ فَإِذا وَجَبَت جُنوبُها فَكُلوا مِنها وَأَطعِمُوا القانِعَ وَالمُعتَرَّ ۚ كَذٰلِكَ سَخَّرناها لَكُم لَعَلَّكُم تَشكُرونَ"
    },
    {
      "index": "37",
      "text": "لَن يَنالَ اللَّهَ لُحومُها وَلا دِماؤُها وَلـٰكِن يَنالُهُ التَّقوىٰ مِنكُم ۚ كَذٰلِكَ سَخَّرَها لَكُم لِتُكَبِّرُوا اللَّهَ عَلىٰ ما هَداكُم ۗ وَبَشِّرِ المُحسِنينَ"
    },
    {
      "index": "38",
      "text": "۞ إِنَّ اللَّهَ يُدافِعُ عَنِ الَّذينَ آمَنوا ۗ إِنَّ اللَّهَ لا يُحِبُّ كُلَّ خَوّانٍ كَفورٍ"
    },
    {
      "index": "39",
      "text": "أُذِنَ لِلَّذينَ يُقاتَلونَ بِأَنَّهُم ظُلِموا ۚ وَإِنَّ اللَّهَ عَلىٰ نَصرِهِم لَقَديرٌ"
    },
    {
      "index": "40",
      "text": "الَّذينَ أُخرِجوا مِن دِيارِهِم بِغَيرِ حَقٍّ إِلّا أَن يَقولوا رَبُّنَا اللَّهُ ۗ وَلَولا دَفعُ اللَّهِ النّاسَ بَعضَهُم بِبَعضٍ لَهُدِّمَت صَوامِعُ وَبِيَعٌ وَصَلَواتٌ وَمَساجِدُ يُذكَرُ فيهَا اسمُ اللَّهِ كَثيرًا ۗ وَلَيَنصُرَنَّ اللَّهُ مَن يَنصُرُهُ ۗ إِنَّ اللَّهَ لَقَوِيٌّ عَزيزٌ"
    },
    {
      "index": "41",
      "text": "الَّذينَ إِن مَكَّنّاهُم فِي الأَرضِ أَقامُوا الصَّلاةَ وَآتَوُا الزَّكاةَ وَأَمَروا بِالمَعروفِ وَنَهَوا عَنِ المُنكَرِ ۗ وَلِلَّهِ عاقِبَةُ الأُمورِ"
    },
    {
      "index": "42",
      "text": "وَإِن يُكَذِّبوكَ فَقَد كَذَّبَت قَبلَهُم قَومُ نوحٍ وَعادٌ وَثَمودُ"
    },
    {
      "index": "43",
      "text": "وَقَومُ إِبراهيمَ وَقَومُ لوطٍ"
    },
    {
      "index": "44",
      "text": "وَأَصحابُ مَديَنَ ۖ وَكُذِّبَ موسىٰ فَأَملَيتُ لِلكافِرينَ ثُمَّ أَخَذتُهُم ۖ فَكَيفَ كانَ نَكيرِ"
    },
    {
      "index": "45",
      "text": "فَكَأَيِّن مِن قَريَةٍ أَهلَكناها وَهِيَ ظالِمَةٌ فَهِيَ خاوِيَةٌ عَلىٰ عُروشِها وَبِئرٍ مُعَطَّلَةٍ وَقَصرٍ مَشيدٍ"
    },
    {
      "index": "46",
      "text": "أَفَلَم يَسيروا فِي الأَرضِ فَتَكونَ لَهُم قُلوبٌ يَعقِلونَ بِها أَو آذانٌ يَسمَعونَ بِها ۖ فَإِنَّها لا تَعمَى الأَبصارُ وَلـٰكِن تَعمَى القُلوبُ الَّتي فِي الصُّدورِ"
    },
    {
      "index": "47",
      "text": "وَيَستَعجِلونَكَ بِالعَذابِ وَلَن يُخلِفَ اللَّهُ وَعدَهُ ۚ وَإِنَّ يَومًا عِندَ رَبِّكَ كَأَلفِ سَنَةٍ مِمّا تَعُدّونَ"
    },
    {
      "index": "48",
      "text": "وَكَأَيِّن مِن قَريَةٍ أَملَيتُ لَها وَهِيَ ظالِمَةٌ ثُمَّ أَخَذتُها وَإِلَيَّ المَصيرُ"
    },
    {
      "index": "49",
      "text": "قُل يا أَيُّهَا النّاسُ إِنَّما أَنا لَكُم نَذيرٌ مُبينٌ"
    },
    {
      "index": "50",
      "text": "فَالَّذينَ آمَنوا وَعَمِلُوا الصّالِحاتِ لَهُم مَغفِرَةٌ وَرِزقٌ كَريمٌ"
    },
    {
      "index": "51",
      "text": "وَالَّذينَ سَعَوا في آياتِنا مُعاجِزينَ أُولـٰئِكَ أَصحابُ الجَحيمِ"
    },
    {
      "index": "52",
      "text": "وَما أَرسَلنا مِن قَبلِكَ مِن رَسولٍ وَلا نَبِيٍّ إِلّا إِذا تَمَنّىٰ أَلقَى الشَّيطانُ في أُمنِيَّتِهِ فَيَنسَخُ اللَّهُ ما يُلقِي الشَّيطانُ ثُمَّ يُحكِمُ اللَّهُ آياتِهِ ۗ وَاللَّهُ عَليمٌ حَكيمٌ"
    },
    {
      "index": "53",
      "text": "لِيَجعَلَ ما يُلقِي الشَّيطانُ فِتنَةً لِلَّذينَ في قُلوبِهِم مَرَضٌ وَالقاسِيَةِ قُلوبُهُم ۗ وَإِنَّ الظّالِمينَ لَفي شِقاقٍ بَعيدٍ"
    },
    {
      "index": "54",
      "text": "وَلِيَعلَمَ الَّذينَ أوتُوا العِلمَ أَنَّهُ الحَقُّ مِن رَبِّكَ فَيُؤمِنوا بِهِ فَتُخبِتَ لَهُ قُلوبُهُم ۗ وَإِنَّ اللَّهَ لَهادِ الَّذينَ آمَنوا إِلىٰ صِراطٍ مُستَقيمٍ"
    },
    {
      "index": "55",
      "text": "وَلا يَزالُ الَّذينَ كَفَروا في مِريَةٍ مِنهُ حَتّىٰ تَأتِيَهُمُ السّاعَةُ بَغتَةً أَو يَأتِيَهُم عَذابُ يَومٍ عَقيمٍ"
    },
    {
      "index": "56",
      "text": "المُلكُ يَومَئِذٍ لِلَّهِ يَحكُمُ بَينَهُم ۚ فَالَّذينَ آمَنوا وَعَمِلُوا الصّالِحاتِ في جَنّاتِ النَّعيمِ"
    },
    {
      "index": "57",
      "text": "وَالَّذينَ كَفَروا وَكَذَّبوا بِآياتِنا فَأُولـٰئِكَ لَهُم عَذابٌ مُهينٌ"
    },
    {
      "index": "58",
      "text": "وَالَّذينَ هاجَروا في سَبيلِ اللَّهِ ثُمَّ قُتِلوا أَو ماتوا لَيَرزُقَنَّهُمُ اللَّهُ رِزقًا حَسَنًا ۚ وَإِنَّ اللَّهَ لَهُوَ خَيرُ الرّازِقينَ"
    },
    {
      "index": "59",
      "text": "لَيُدخِلَنَّهُم مُدخَلًا يَرضَونَهُ ۗ وَإِنَّ اللَّهَ لَعَليمٌ حَليمٌ"
    },
    {
      "index": "60",
      "text": "۞ ذٰلِكَ وَمَن عاقَبَ بِمِثلِ ما عوقِبَ بِهِ ثُمَّ بُغِيَ عَلَيهِ لَيَنصُرَنَّهُ اللَّهُ ۗ إِنَّ اللَّهَ لَعَفُوٌّ غَفورٌ"
    },
    {
      "index": "61",
      "text": "ذٰلِكَ بِأَنَّ اللَّهَ يولِجُ اللَّيلَ فِي النَّهارِ وَيولِجُ النَّهارَ فِي اللَّيلِ وَأَنَّ اللَّهَ سَميعٌ بَصيرٌ"
    },
    {
      "index": "62",
      "text": "ذٰلِكَ بِأَنَّ اللَّهَ هُوَ الحَقُّ وَأَنَّ ما يَدعونَ مِن دونِهِ هُوَ الباطِلُ وَأَنَّ اللَّهَ هُوَ العَلِيُّ الكَبيرُ"
    },
    {
      "index": "63",
      "text": "أَلَم تَرَ أَنَّ اللَّهَ أَنزَلَ مِنَ السَّماءِ ماءً فَتُصبِحُ الأَرضُ مُخضَرَّةً ۗ إِنَّ اللَّهَ لَطيفٌ خَبيرٌ"
    },
    {
      "index": "64",
      "text": "لَهُ ما فِي السَّماواتِ وَما فِي الأَرضِ ۗ وَإِنَّ اللَّهَ لَهُوَ الغَنِيُّ الحَميدُ"
    },
    {
      "index": "65",
      "text": "أَلَم تَرَ أَنَّ اللَّهَ سَخَّرَ لَكُم ما فِي الأَرضِ وَالفُلكَ تَجري فِي البَحرِ بِأَمرِهِ وَيُمسِكُ السَّماءَ أَن تَقَعَ عَلَى الأَرضِ إِلّا بِإِذنِهِ ۗ إِنَّ اللَّهَ بِالنّاسِ لَرَءوفٌ رَحيمٌ"
    },
    {
      "index": "66",
      "text": "وَهُوَ الَّذي أَحياكُم ثُمَّ يُميتُكُم ثُمَّ يُحييكُم ۗ إِنَّ الإِنسانَ لَكَفورٌ"
    },
    {
      "index": "67",
      "text": "لِكُلِّ أُمَّةٍ جَعَلنا مَنسَكًا هُم ناسِكوهُ ۖ فَلا يُنازِعُنَّكَ فِي الأَمرِ ۚ وَادعُ إِلىٰ رَبِّكَ ۖ إِنَّكَ لَعَلىٰ هُدًى مُستَقيمٍ"
    },
    {
      "index": "68",
      "text": "وَإِن جادَلوكَ فَقُلِ اللَّهُ أَعلَمُ بِما تَعمَلونَ"
    },
    {
      "index": "69",
      "text": "اللَّهُ يَحكُمُ بَينَكُم يَومَ القِيامَةِ فيما كُنتُم فيهِ تَختَلِفونَ"
    },
    {
      "index": "70",
      "text": "أَلَم تَعلَم أَنَّ اللَّهَ يَعلَمُ ما فِي السَّماءِ وَالأَرضِ ۗ إِنَّ ذٰلِكَ في كِتابٍ ۚ إِنَّ ذٰلِكَ عَلَى اللَّهِ يَسيرٌ"
    },
    {
      "index": "71",
      "text": "وَيَعبُدونَ مِن دونِ اللَّهِ ما لَم يُنَزِّل بِهِ سُلطانًا وَما لَيسَ لَهُم بِهِ عِلمٌ ۗ وَما لِلظّالِمينَ مِن نَصيرٍ"
    },
    {
      "index": "72",
      "text": "وَإِذا تُتلىٰ عَلَيهِم آياتُنا بَيِّناتٍ تَعرِفُ في وُجوهِ الَّذينَ كَفَرُوا المُنكَرَ ۖ يَكادونَ يَسطونَ بِالَّذينَ يَتلونَ عَلَيهِم آياتِنا ۗ قُل أَفَأُنَبِّئُكُم بِشَرٍّ مِن ذٰلِكُمُ ۗ النّارُ وَعَدَهَا اللَّهُ الَّذينَ كَفَروا ۖ وَبِئسَ المَصيرُ"
    },
    {
      "index": "73",
      "text": "يا أَيُّهَا النّاسُ ضُرِبَ مَثَلٌ فَاستَمِعوا لَهُ ۚ إِنَّ الَّذينَ تَدعونَ مِن دونِ اللَّهِ لَن يَخلُقوا ذُبابًا وَلَوِ اجتَمَعوا لَهُ ۖ وَإِن يَسلُبهُمُ الذُّبابُ شَيئًا لا يَستَنقِذوهُ مِنهُ ۚ ضَعُفَ الطّالِبُ وَالمَطلوبُ"
    },
    {
      "index": "74",
      "text": "ما قَدَرُوا اللَّهَ حَقَّ قَدرِهِ ۗ إِنَّ اللَّهَ لَقَوِيٌّ عَزيزٌ"
    },
    {
      "index": "75",
      "text": "اللَّهُ يَصطَفي مِنَ المَلائِكَةِ رُسُلًا وَمِنَ النّاسِ ۚ إِنَّ اللَّهَ سَميعٌ بَصيرٌ"
    },
    {
      "index": "76",
      "text": "يَعلَمُ ما بَينَ أَيديهِم وَما خَلفَهُم ۗ وَإِلَى اللَّهِ تُرجَعُ الأُمورُ"
    },
    {
      "index": "77",
      "text": "يا أَيُّهَا الَّذينَ آمَنُوا اركَعوا وَاسجُدوا وَاعبُدوا رَبَّكُم وَافعَلُوا الخَيرَ لَعَلَّكُم تُفلِحونَ ۩"
    },
    {
      "index": "78",
      "text": "وَجاهِدوا فِي اللَّهِ حَقَّ جِهادِهِ ۚ هُوَ اجتَباكُم وَما جَعَلَ عَلَيكُم فِي الدّينِ مِن حَرَجٍ ۚ مِلَّةَ أَبيكُم إِبراهيمَ ۚ هُوَ سَمّاكُمُ المُسلِمينَ مِن قَبلُ وَفي هـٰذا لِيَكونَ الرَّسولُ شَهيدًا عَلَيكُم وَتَكونوا شُهَداءَ عَلَى النّاسِ ۚ فَأَقيمُوا الصَّلاةَ وَآتُوا الزَّكاةَ وَاعتَصِموا بِاللَّهِ هُوَ مَولاكُم ۖ فَنِعمَ المَولىٰ وَنِعمَ النَّصيرُ"
    }
  ],
  "index": "22",
  "name": "الحج",
  "copyright": "# PLEASE DO NOT REMOVE OR CHANGE THIS COPYRIGHT BLOCK \n#==================================================================== \n#\n#  Tanzil Quran Text (Simple Minimal, Version 1.1)\n#  Copyright (C) 2007-2022 Tanzil Project\n#  License: Creative Commons Attribution 3.0\n#\n#  This copy of the Quran text is carefully produced, highly \n#  verified and continuously monitored by a group of specialists \n#  at Tanzil Project.\n#\n#  TERMS OF USE:\n#\n#  - Permission is granted to copy and distribute verbatim copies \n#    of this text, but CHANGING IT IS NOT ALLOWED.\n#\n#  - This Quran text can be used in any website or application, \n#    provided that its source (Tanzil Project) is clearly indicated, \n#    and a link is made to tanzil.net to enable users to keep\n#    track of changes.\n#\n#  - This copyright notice shall be included in all verbatim copies \n#    of the text, and shall be reproduced appropriately in all files \n#    derived from or containing substantial portion of this text.\n#\n#  Please check updates at: http://tanzil.net/updates/\n#\n#====================================================================\n",
  "type": "simple-min",
  "version": "1.1"
}