{
  "aya": [
    {
      "index": "1",
      "text": "قُلْ أَعُوذُ بِرَبِّ ٱلْفَلَقِ",
      "bismillah": "بِسْمِ ٱللَّهِ ٱلرَّحْمَـٰنِ ٱلرَّحِيمِ"
    },
    {
      "index": "2",
      "text": "مِن شَرِّ مَا خَلَقَ"
    },
    {
      "index": "3",
      "text": "وَمِن شَرِّ غَاسِقٍ إِذَا وَقَبَ"
    },
    {
      "index": "4",
      "text": "وَمِن شَرِّ ٱلنَّفَّـٰثَـٰتِ فِى ٱلْعُقَدِ"
    },
    {
      "index": "5",
      "text": "وَمِن شَرِّ حَاسِدٍ إِذَا حَسَدَ"
    }
  ],
  "index": "113",
  "name": "الفلق",
  "copyright": "# PLEASE DO NOT REMOVE OR CHANGE THIS COPYRIGHT BLOCK \n#==================================================================== \n#\n#  Tanzil Quran Text (Uthmani, Version 1.1)\n#  Copyright (C) 2007-2022 Tanzil Project\n#  License: Creative Commons Attribution 3.0\n#\n#  This copy of the Quran text is carefully produced, highly \n#  verified and continuously monitored by a group of specialists \n#  at Tanzil Project.\n#\n#  TERMS OF USE:\n#\n#  - Permission is granted to copy and distribute verbatim copies \n#    of this text, but CHANGING IT IS NOT ALLOWED.\n#\n#  - This Quran text can be used in any website or application, \n#    provided that its source (Tanzil Project) is clearly indicated, \n#    and a link is made to tanzil.net to enable users to keep\n#    track of changes.\n#\n#  - This copyright notice shall be included in all verbatim copies \n#    of the text, and shall be reproduced appropriately in all files \n#    derived from or containing substantial portion of this text.\n#\n#  Please check updates at: http://tanzil.net/updates/\n#\n#====================================================================\n",
  "type": "uthmani",
  "version": "1.1"
}