{
  "aya": [
    {
      "index": "1",
      "text": "طه",
      "bismillah": "بِسمِ اللَّهِ الرَّحمـٰنِ الرَّحيمِ"
    },
    {
      "index": "2",
      "text": "ما أَنزَلنا عَلَيكَ القُرءانَ لِتَشقىٰ"
    },
    {
      "index": "3",
      "text": "إِلّا تَذكِرَةً لِمَن يَخشىٰ"
    },
    {
      "index": "4",
      "text": "تَنزيلًا مِمَّن خَلَقَ الأَرضَ وَالسَّمـٰوٰتِ العُلَى"
    },
    {
      "index": "5",
      "text": "الرَّحمـٰنُ عَلَى العَرشِ استَوىٰ"
    },
    {
      "index": "6",
      "text": "لَهُ ما فِى السَّمـٰوٰتِ وَما فِى الأَرضِ وَما بَينَهُما وَما تَحتَ الثَّرىٰ"
    },
    {
      "index": "7",
      "text": "وَإِن تَجهَر بِالقَولِ فَإِنَّهُ يَعلَمُ السِّرَّ وَأَخفَى"
    },
    {
      "index": "8",
      "text": "اللَّهُ لا إِلـٰهَ إِلّا هُوَ ۖ لَهُ الأَسماءُ الحُسنىٰ"
    },
    {
      "index": "9",
      "text": "وَهَل أَتىٰكَ حَديثُ موسىٰ"
    },
    {
      "index": "10",
      "text": "إِذ رَءا نارًا فَقالَ لِأَهلِهِ امكُثوا إِنّى ءانَستُ نارًا لَعَلّى ءاتيكُم مِنها بِقَبَسٍ أَو أَجِدُ عَلَى النّارِ هُدًى"
    },
    {
      "index": "11",
      "text": "فَلَمّا أَتىٰها نودِىَ يـٰموسىٰ"
    },
    {
      "index": "12",
      "text": "إِنّى أَنا۠ رَبُّكَ فَاخلَع نَعلَيكَ ۖ إِنَّكَ بِالوادِ المُقَدَّسِ طُوًى"
    },
    {
      "index": "13",
      "text": "وَأَنَا اختَرتُكَ فَاستَمِع لِما يوحىٰ"
    },
    {
      "index": "14",
      "text": "إِنَّنى أَنَا اللَّهُ لا إِلـٰهَ إِلّا أَنا۠ فَاعبُدنى وَأَقِمِ الصَّلوٰةَ لِذِكرى"
    },
    {
      "index": "15",
      "text": "إِنَّ السّاعَةَ ءاتِيَةٌ أَكادُ أُخفيها لِتُجزىٰ كُلُّ نَفسٍ بِما تَسعىٰ"
    },
    {
      "index": "16",
      "text": "فَلا يَصُدَّنَّكَ عَنها مَن لا يُؤمِنُ بِها وَاتَّبَعَ هَوىٰهُ فَتَردىٰ"
    },
    {
      "index": "17",
      "text": "وَما تِلكَ بِيَمينِكَ يـٰموسىٰ"
    },
    {
      "index": "18",
      "text": "قالَ هِىَ عَصاىَ أَتَوَكَّؤُا۟ عَلَيها وَأَهُشُّ بِها عَلىٰ غَنَمى وَلِىَ فيها مَـٔارِبُ أُخرىٰ"
    },
    {
      "index": "19",
      "text": "قالَ أَلقِها يـٰموسىٰ"
    },
    {
      "index": "20",
      "text": "فَأَلقىٰها فَإِذا هِىَ حَيَّةٌ تَسعىٰ"
    },
    {
      "index": "21",
      "text": "قالَ خُذها وَلا تَخَف ۖ سَنُعيدُها سيرَتَهَا الأولىٰ"
    },
    {
      "index": "22",
      "text": "وَاضمُم يَدَكَ إِلىٰ جَناحِكَ تَخرُج بَيضاءَ مِن غَيرِ سوءٍ ءايَةً أُخرىٰ"
    },
    {
      "index": "23",
      "text": "لِنُرِيَكَ مِن ءايـٰتِنَا الكُبرَى"
    },
    {
      "index": "24",
      "text": "اذهَب إِلىٰ فِرعَونَ إِنَّهُ طَغىٰ"
    },
    {
      "index": "25",
      "text": "قالَ رَبِّ اشرَح لى صَدرى"
    },
    {
      "index": "26",
      "text": "وَيَسِّر لى أَمرى"
    },
    {
      "index": "27",
      "text": "وَاحلُل عُقدَةً مِن لِسانى"
    },
    {
      "index": "28",
      "text": "يَفقَهوا قَولى"
    },
    {
      "index": "29",
      "text": "وَاجعَل لى وَزيرًا مِن أَهلى"
    },
    {
      "index": "30",
      "text": "هـٰرونَ أَخِى"
    },
    {
      "index": "31",
      "text": "اشدُد بِهِ أَزرى"
    },
    {
      "index": "32",
      "text": "وَأَشرِكهُ فى أَمرى"
    },
    {
      "index": "33",
      "text": "كَى نُسَبِّحَكَ كَثيرًا"
    },
    {
      "index": "34",
      "text": "وَنَذكُرَكَ كَثيرًا"
    },
    {
      "index": "35",
      "text": "إِنَّكَ كُنتَ بِنا بَصيرًا"
    },
    {
      "index": "36",
      "text": "قالَ قَد أوتيتَ سُؤلَكَ يـٰموسىٰ"
    },
    {
      "index": "37",
      "text": "وَلَقَد مَنَنّا عَلَيكَ مَرَّةً أُخرىٰ"
    },
    {
      "index": "38",
      "text": "إِذ أَوحَينا إِلىٰ أُمِّكَ ما يوحىٰ"
    },
    {
      "index": "39",
      "text": "أَنِ اقذِفيهِ فِى التّابوتِ فَاقذِفيهِ فِى اليَمِّ فَليُلقِهِ اليَمُّ بِالسّاحِلِ يَأخُذهُ عَدُوٌّ لى وَعَدُوٌّ لَهُ ۚ وَأَلقَيتُ عَلَيكَ مَحَبَّةً مِنّى وَلِتُصنَعَ عَلىٰ عَينى"
    },
    {
      "index": "40",
      "text": "إِذ تَمشى أُختُكَ فَتَقولُ هَل أَدُلُّكُم عَلىٰ مَن يَكفُلُهُ ۖ فَرَجَعنـٰكَ إِلىٰ أُمِّكَ كَى تَقَرَّ عَينُها وَلا تَحزَنَ ۚ وَقَتَلتَ نَفسًا فَنَجَّينـٰكَ مِنَ الغَمِّ وَفَتَنّـٰكَ فُتونًا ۚ فَلَبِثتَ سِنينَ فى أَهلِ مَديَنَ ثُمَّ جِئتَ عَلىٰ قَدَرٍ يـٰموسىٰ"
    },
    {
      "index": "41",
      "text": "وَاصطَنَعتُكَ لِنَفسِى"
    },
    {
      "index": "42",
      "text": "اذهَب أَنتَ وَأَخوكَ بِـٔايـٰتى وَلا تَنِيا فى ذِكرِى"
    },
    {
      "index": "43",
      "text": "اذهَبا إِلىٰ فِرعَونَ إِنَّهُ طَغىٰ"
    },
    {
      "index": "44",
      "text": "فَقولا لَهُ قَولًا لَيِّنًا لَعَلَّهُ يَتَذَكَّرُ أَو يَخشىٰ"
    },
    {
      "index": "45",
      "text": "قالا رَبَّنا إِنَّنا نَخافُ أَن يَفرُطَ عَلَينا أَو أَن يَطغىٰ"
    },
    {
      "index": "46",
      "text": "قالَ لا تَخافا ۖ إِنَّنى مَعَكُما أَسمَعُ وَأَرىٰ"
    },
    {
      "index": "47",
      "text": "فَأتِياهُ فَقولا إِنّا رَسولا رَبِّكَ فَأَرسِل مَعَنا بَنى إِسرٰءيلَ وَلا تُعَذِّبهُم ۖ قَد جِئنـٰكَ بِـٔايَةٍ مِن رَبِّكَ ۖ وَالسَّلـٰمُ عَلىٰ مَنِ اتَّبَعَ الهُدىٰ"
    },
    {
      "index": "48",
      "text": "إِنّا قَد أوحِىَ إِلَينا أَنَّ العَذابَ عَلىٰ مَن كَذَّبَ وَتَوَلّىٰ"
    },
    {
      "index": "49",
      "text": "قالَ فَمَن رَبُّكُما يـٰموسىٰ"
    },
    {
      "index": "50",
      "text": "قالَ رَبُّنَا الَّذى أَعطىٰ كُلَّ شَىءٍ خَلقَهُ ثُمَّ هَدىٰ"
    },
    {
      "index": "51",
      "text": "قالَ فَما بالُ القُرونِ الأولىٰ"
    },
    {
      "index": "52",
      "text": "قالَ عِلمُها عِندَ رَبّى فى كِتـٰبٍ ۖ لا يَضِلُّ رَبّى وَلا يَنسَى"
    },
    {
      "index": "53",
      "text": "الَّذى جَعَلَ لَكُمُ الأَرضَ مَهدًا وَسَلَكَ لَكُم فيها سُبُلًا وَأَنزَلَ مِنَ السَّماءِ ماءً فَأَخرَجنا بِهِ أَزوٰجًا مِن نَباتٍ شَتّىٰ"
    },
    {
      "index": "54",
      "text": "كُلوا وَارعَوا أَنعـٰمَكُم ۗ إِنَّ فى ذٰلِكَ لَـٔايـٰتٍ لِأُولِى النُّهىٰ"
    },
    {
      "index": "55",
      "text": "۞ مِنها خَلَقنـٰكُم وَفيها نُعيدُكُم وَمِنها نُخرِجُكُم تارَةً أُخرىٰ"
    },
    {
      "index": "56",
      "text": "وَلَقَد أَرَينـٰهُ ءايـٰتِنا كُلَّها فَكَذَّبَ وَأَبىٰ"
    },
    {
      "index": "57",
      "text": "قالَ أَجِئتَنا لِتُخرِجَنا مِن أَرضِنا بِسِحرِكَ يـٰموسىٰ"
    },
    {
      "index": "58",
      "text": "فَلَنَأتِيَنَّكَ بِسِحرٍ مِثلِهِ فَاجعَل بَينَنا وَبَينَكَ مَوعِدًا لا نُخلِفُهُ نَحنُ وَلا أَنتَ مَكانًا سُوًى"
    },
    {
      "index": "59",
      "text": "قالَ مَوعِدُكُم يَومُ الزّينَةِ وَأَن يُحشَرَ النّاسُ ضُحًى"
    },
    {
      "index": "60",
      "text": "فَتَوَلّىٰ فِرعَونُ فَجَمَعَ كَيدَهُ ثُمَّ أَتىٰ"
    },
    {
      "index": "61",
      "text": "قالَ لَهُم موسىٰ وَيلَكُم لا تَفتَروا عَلَى اللَّهِ كَذِبًا فَيُسحِتَكُم بِعَذابٍ ۖ وَقَد خابَ مَنِ افتَرىٰ"
    },
    {
      "index": "62",
      "text": "فَتَنـٰزَعوا أَمرَهُم بَينَهُم وَأَسَرُّوا النَّجوىٰ"
    },
    {
      "index": "63",
      "text": "قالوا إِن هـٰذٰنِ لَسـٰحِرٰنِ يُريدانِ أَن يُخرِجاكُم مِن أَرضِكُم بِسِحرِهِما وَيَذهَبا بِطَريقَتِكُمُ المُثلىٰ"
    },
    {
      "index": "64",
      "text": "فَأَجمِعوا كَيدَكُم ثُمَّ ائتوا صَفًّا ۚ وَقَد أَفلَحَ اليَومَ مَنِ استَعلىٰ"
    },
    {
      "index": "65",
      "text": "قالوا يـٰموسىٰ إِمّا أَن تُلقِىَ وَإِمّا أَن نَكونَ أَوَّلَ مَن أَلقىٰ"
    },
    {
      "index": "66",
      "text": "قالَ بَل أَلقوا ۖ فَإِذا حِبالُهُم وَعِصِيُّهُم يُخَيَّلُ إِلَيهِ مِن سِحرِهِم أَنَّها تَسعىٰ"
    },
    {
      "index": "67",
      "text": "فَأَوجَسَ فى نَفسِهِ خيفَةً موسىٰ"
    },
    {
      "index": "68",
      "text": "قُلنا لا تَخَف إِنَّكَ أَنتَ الأَعلىٰ"
    },
    {
      "index": "69",
      "text": "وَأَلقِ ما فى يَمينِكَ تَلقَف ما صَنَعوا ۖ إِنَّما صَنَعوا كَيدُ سـٰحِرٍ ۖ وَلا يُفلِحُ السّاحِرُ حَيثُ أَتىٰ"
    },
    {
      "index": "70",
      "text": "فَأُلقِىَ السَّحَرَةُ سُجَّدًا قالوا ءامَنّا بِرَبِّ هـٰرونَ وَموسىٰ"
    },
    {
      "index": "71",
      "text": "قالَ ءامَنتُم لَهُ قَبلَ أَن ءاذَنَ لَكُم ۖ إِنَّهُ لَكَبيرُكُمُ الَّذى عَلَّمَكُمُ السِّحرَ ۖ فَلَأُقَطِّعَنَّ أَيدِيَكُم وَأَرجُلَكُم مِن خِلـٰفٍ وَلَأُصَلِّبَنَّكُم فى جُذوعِ النَّخلِ وَلَتَعلَمُنَّ أَيُّنا أَشَدُّ عَذابًا وَأَبقىٰ"
    },
    {
      "index": "72",
      "text": "قالوا لَن نُؤثِرَكَ عَلىٰ ما جاءَنا مِنَ البَيِّنـٰتِ وَالَّذى فَطَرَنا ۖ فَاقضِ ما أَنتَ قاضٍ ۖ إِنَّما تَقضى هـٰذِهِ الحَيوٰةَ الدُّنيا"
    },
    {
      "index": "73",
      "text": "إِنّا ءامَنّا بِرَبِّنا لِيَغفِرَ لَنا خَطـٰيـٰنا وَما أَكرَهتَنا عَلَيهِ مِنَ السِّحرِ ۗ وَاللَّهُ خَيرٌ وَأَبقىٰ"
    },
    {
      "index": "74",
      "text": "إِنَّهُ مَن يَأتِ رَبَّهُ مُجرِمًا فَإِنَّ لَهُ جَهَنَّمَ لا يَموتُ فيها وَلا يَحيىٰ"
    },
    {
      "index": "75",
      "text": "وَمَن يَأتِهِ مُؤمِنًا قَد عَمِلَ الصّـٰلِحـٰتِ فَأُولـٰئِكَ لَهُمُ الدَّرَجـٰتُ العُلىٰ"
    },
    {
      "index": "76",
      "text": "جَنّـٰتُ عَدنٍ تَجرى مِن تَحتِهَا الأَنهـٰرُ خـٰلِدينَ فيها ۚ وَذٰلِكَ جَزاءُ مَن تَزَكّىٰ"
    },
    {
      "index": "77",
      "text": "وَلَقَد أَوحَينا إِلىٰ موسىٰ أَن أَسرِ بِعِبادى فَاضرِب لَهُم طَريقًا فِى البَحرِ يَبَسًا لا تَخـٰفُ دَرَكًا وَلا تَخشىٰ"
    },
    {
      "index": "78",
      "text": "فَأَتبَعَهُم فِرعَونُ بِجُنودِهِ فَغَشِيَهُم مِنَ اليَمِّ ما غَشِيَهُم"
    },
    {
      "index": "79",
      "text": "وَأَضَلَّ فِرعَونُ قَومَهُ وَما هَدىٰ"
    },
    {
      "index": "80",
      "text": "يـٰبَنى إِسرٰءيلَ قَد أَنجَينـٰكُم مِن عَدُوِّكُم وَوٰعَدنـٰكُم جانِبَ الطّورِ الأَيمَنَ وَنَزَّلنا عَلَيكُمُ المَنَّ وَالسَّلوىٰ"
    },
    {
      "index": "81",
      "text": "كُلوا مِن طَيِّبـٰتِ ما رَزَقنـٰكُم وَلا تَطغَوا فيهِ فَيَحِلَّ عَلَيكُم غَضَبى ۖ وَمَن يَحلِل عَلَيهِ غَضَبى فَقَد هَوىٰ"
    },
    {
      "index": "82",
      "text": "وَإِنّى لَغَفّارٌ لِمَن تابَ وَءامَنَ وَعَمِلَ صـٰلِحًا ثُمَّ اهتَدىٰ"
    },
    {
      "index": "83",
      "text": "۞ وَما أَعجَلَكَ عَن قَومِكَ يـٰموسىٰ"
    },
    {
      "index": "84",
      "text": "قالَ هُم أُولاءِ عَلىٰ أَثَرى وَعَجِلتُ إِلَيكَ رَبِّ لِتَرضىٰ"
    },
    {
      "index": "85",
      "text": "قالَ فَإِنّا قَد فَتَنّا قَومَكَ مِن بَعدِكَ وَأَضَلَّهُمُ السّامِرِىُّ"
    },
    {
      "index": "86",
      "text": "فَرَجَعَ موسىٰ إِلىٰ قَومِهِ غَضبـٰنَ أَسِفًا ۚ قالَ يـٰقَومِ أَلَم يَعِدكُم رَبُّكُم وَعدًا حَسَنًا ۚ أَفَطالَ عَلَيكُمُ العَهدُ أَم أَرَدتُم أَن يَحِلَّ عَلَيكُم غَضَبٌ مِن رَبِّكُم فَأَخلَفتُم مَوعِدى"
    },
    {
      "index": "87",
      "text": "قالوا ما أَخلَفنا مَوعِدَكَ بِمَلكِنا وَلـٰكِنّا حُمِّلنا أَوزارًا مِن زينَةِ القَومِ فَقَذَفنـٰها فَكَذٰلِكَ أَلقَى السّامِرِىُّ"
    },
    {
      "index": "88",
      "text": "فَأَخرَجَ لَهُم عِجلًا جَسَدًا لَهُ خُوارٌ فَقالوا هـٰذا إِلـٰهُكُم وَإِلـٰهُ موسىٰ فَنَسِىَ"
    },
    {
      "index": "89",
      "text": "أَفَلا يَرَونَ أَلّا يَرجِعُ إِلَيهِم قَولًا وَلا يَملِكُ لَهُم ضَرًّا وَلا نَفعًا"
    },
    {
      "index": "90",
      "text": "وَلَقَد قالَ لَهُم هـٰرونُ مِن قَبلُ يـٰقَومِ إِنَّما فُتِنتُم بِهِ ۖ وَإِنَّ رَبَّكُمُ الرَّحمـٰنُ فَاتَّبِعونى وَأَطيعوا أَمرى"
    },
    {
      "index": "91",
      "text": "قالوا لَن نَبرَحَ عَلَيهِ عـٰكِفينَ حَتّىٰ يَرجِعَ إِلَينا موسىٰ"
    },
    {
      "index": "92",
      "text": "قالَ يـٰهـٰرونُ ما مَنَعَكَ إِذ رَأَيتَهُم ضَلّوا"
    },
    {
      "index": "93",
      "text": "أَلّا تَتَّبِعَنِ ۖ أَفَعَصَيتَ أَمرى"
    },
    {
      "index": "94",
      "text": "قالَ يَبنَؤُمَّ لا تَأخُذ بِلِحيَتى وَلا بِرَأسى ۖ إِنّى خَشيتُ أَن تَقولَ فَرَّقتَ بَينَ بَنى إِسرٰءيلَ وَلَم تَرقُب قَولى"
    },
    {
      "index": "95",
      "text": "قالَ فَما خَطبُكَ يـٰسـٰمِرِىُّ"
    },
    {
      "index": "96",
      "text": "قالَ بَصُرتُ بِما لَم يَبصُروا بِهِ فَقَبَضتُ قَبضَةً مِن أَثَرِ الرَّسولِ فَنَبَذتُها وَكَذٰلِكَ سَوَّلَت لى نَفسى"
    },
    {
      "index": "97",
      "text": "قالَ فَاذهَب فَإِنَّ لَكَ فِى الحَيوٰةِ أَن تَقولَ لا مِساسَ ۖ وَإِنَّ لَكَ مَوعِدًا لَن تُخلَفَهُ ۖ وَانظُر إِلىٰ إِلـٰهِكَ الَّذى ظَلتَ عَلَيهِ عاكِفًا ۖ لَنُحَرِّقَنَّهُ ثُمَّ لَنَنسِفَنَّهُ فِى اليَمِّ نَسفًا"
    },
    {
      "index": "98",
      "text": "إِنَّما إِلـٰهُكُمُ اللَّهُ الَّذى لا إِلـٰهَ إِلّا هُوَ ۚ وَسِعَ كُلَّ شَىءٍ عِلمًا"
    },
    {
      "index": "99",
      "text": "كَذٰلِكَ نَقُصُّ عَلَيكَ مِن أَنباءِ ما قَد سَبَقَ ۚ وَقَد ءاتَينـٰكَ مِن لَدُنّا ذِكرًا"
    },
    {
      "index": "100",
      "text": "مَن أَعرَضَ عَنهُ فَإِنَّهُ يَحمِلُ يَومَ القِيـٰمَةِ وِزرًا"
    },
    {
      "index": "101",
      "text": "خـٰلِدينَ فيهِ ۖ وَساءَ لَهُم يَومَ القِيـٰمَةِ حِملًا"
    },
    {
      "index": "102",
      "text": "يَومَ يُنفَخُ فِى الصّورِ ۚ وَنَحشُرُ المُجرِمينَ يَومَئِذٍ زُرقًا"
    },
    {
      "index": "103",
      "text": "يَتَخـٰفَتونَ بَينَهُم إِن لَبِثتُم إِلّا عَشرًا"
    },
    {
      "index": "104",
      "text": "نَحنُ أَعلَمُ بِما يَقولونَ إِذ يَقولُ أَمثَلُهُم طَريقَةً إِن لَبِثتُم إِلّا يَومًا"
    },
    {
      "index": "105",
      "text": "وَيَسـَٔلونَكَ عَنِ الجِبالِ فَقُل يَنسِفُها رَبّى نَسفًا"
    },
    {
      "index": "106",
      "text": "فَيَذَرُها قاعًا صَفصَفًا"
    },
    {
      "index": "107",
      "text": "لا تَرىٰ فيها عِوَجًا وَلا أَمتًا"
    },
    {
      "index": "108",
      "text": "يَومَئِذٍ يَتَّبِعونَ الدّاعِىَ لا عِوَجَ لَهُ ۖ وَخَشَعَتِ الأَصواتُ لِلرَّحمـٰنِ فَلا تَسمَعُ إِلّا هَمسًا"
    },
    {
      "index": "109",
      "text": "يَومَئِذٍ لا تَنفَعُ الشَّفـٰعَةُ إِلّا مَن أَذِنَ لَهُ الرَّحمـٰنُ وَرَضِىَ لَهُ قَولًا"
    },
    {
      "index": "110",
      "text": "يَعلَمُ ما بَينَ أَيديهِم وَما خَلفَهُم وَلا يُحيطونَ بِهِ عِلمًا"
    },
    {
      "index": "111",
      "text": "۞ وَعَنَتِ الوُجوهُ لِلحَىِّ القَيّومِ ۖ وَقَد خابَ مَن حَمَلَ ظُلمًا"
    },
    {
      "index": "112",
      "text": "وَمَن يَعمَل مِنَ الصّـٰلِحـٰتِ وَهُوَ مُؤمِنٌ فَلا يَخافُ ظُلمًا وَلا هَضمًا"
    },
    {
      "index": "113",
      "text": "وَكَذٰلِكَ أَنزَلنـٰهُ قُرءانًا عَرَبِيًّا وَصَرَّفنا فيهِ مِنَ الوَعيدِ لَعَلَّهُم يَتَّقونَ أَو يُحدِثُ لَهُم ذِكرًا"
    },
    {
      "index": "114",
      "text": "فَتَعـٰلَى اللَّهُ المَلِكُ الحَقُّ ۗ وَلا تَعجَل بِالقُرءانِ مِن قَبلِ أَن يُقضىٰ إِلَيكَ وَحيُهُ ۖ وَقُل رَبِّ زِدنى عِلمًا"
    },
    {
      "index": "115",
      "text": "وَلَقَد عَهِدنا إِلىٰ ءادَمَ مِن قَبلُ فَنَسِىَ وَلَم نَجِد لَهُ عَزمًا"
    },
    {
      "index": "116",
      "text": "وَإِذ قُلنا لِلمَلـٰئِكَةِ اسجُدوا لِـٔادَمَ فَسَجَدوا إِلّا إِبليسَ أَبىٰ"
    },
    {
      "index": "117",
      "text": "فَقُلنا يـٰـٔادَمُ إِنَّ هـٰذا عَدُوٌّ لَكَ وَلِزَوجِكَ فَلا يُخرِجَنَّكُما مِنَ الجَنَّةِ فَتَشقىٰ"
    },
    {
      "index": "118",
      "text": "إِنَّ لَكَ أَلّا تَجوعَ فيها وَلا تَعرىٰ"
    },
    {
      "index": "119",
      "text": "وَأَنَّكَ لا تَظمَؤُا۟ فيها وَلا تَضحىٰ"
    },
    {
      "index": "120",
      "text": "فَوَسوَسَ إِلَيهِ الشَّيطـٰنُ قالَ يـٰـٔادَمُ هَل أَدُلُّكَ عَلىٰ شَجَرَةِ الخُلدِ وَمُلكٍ لا يَبلىٰ"
    },
    {
      "index": "121",
      "text": "فَأَكَلا مِنها فَبَدَت لَهُما سَوءٰتُهُما وَطَفِقا يَخصِفانِ عَلَيهِما مِن وَرَقِ الجَنَّةِ ۚ وَعَصىٰ ءادَمُ رَبَّهُ فَغَوىٰ"
    },
    {
      "index": "122",
      "text": "ثُمَّ اجتَبـٰهُ رَبُّهُ فَتابَ عَلَيهِ وَهَدىٰ"
    },
    {
      "index": "123",
      "text": "قالَ اهبِطا مِنها جَميعًا ۖ بَعضُكُم لِبَعضٍ عَدُوٌّ ۖ فَإِمّا يَأتِيَنَّكُم مِنّى هُدًى فَمَنِ اتَّبَعَ هُداىَ فَلا يَضِلُّ وَلا يَشقىٰ"
    },
    {
      "index": "124",
      "text": "وَمَن أَعرَضَ عَن ذِكرى فَإِنَّ لَهُ مَعيشَةً ضَنكًا وَنَحشُرُهُ يَومَ القِيـٰمَةِ أَعمىٰ"
    },
    {
      "index": "125",
      "text": "قالَ رَبِّ لِمَ حَشَرتَنى أَعمىٰ وَقَد كُنتُ بَصيرًا"
    },
    {
      "index": "126",
      "text": "قالَ كَذٰلِكَ أَتَتكَ ءايـٰتُنا فَنَسيتَها ۖ وَكَذٰلِكَ اليَومَ تُنسىٰ"
    },
    {
      "index": "127",
      "text": "وَكَذٰلِكَ نَجزى مَن أَسرَفَ وَلَم يُؤمِن بِـٔايـٰتِ رَبِّهِ ۚ وَلَعَذابُ الـٔاخِرَةِ أَشَدُّ وَأَبقىٰ"
    },
    {
      "index": "128",
      "text": "أَفَلَم يَهدِ لَهُم كَم أَهلَكنا قَبلَهُم مِنَ القُرونِ يَمشونَ فى مَسـٰكِنِهِم ۗ إِنَّ فى ذٰلِكَ لَـٔايـٰتٍ لِأُولِى النُّهىٰ"
    },
    {
      "index": "129",
      "text": "وَلَولا كَلِمَةٌ سَبَقَت مِن رَبِّكَ لَكانَ لِزامًا وَأَجَلٌ مُسَمًّى"
    },
    {
      "index": "130",
      "text": "فَاصبِر عَلىٰ ما يَقولونَ وَسَبِّح بِحَمدِ رَبِّكَ قَبلَ طُلوعِ الشَّمسِ وَقَبلَ غُروبِها ۖ وَمِن ءانائِ الَّيلِ فَسَبِّح وَأَطرافَ النَّهارِ لَعَلَّكَ تَرضىٰ"
    },
    {
      "index": "131",
      "text": "وَلا تَمُدَّنَّ عَينَيكَ إِلىٰ ما مَتَّعنا بِهِ أَزوٰجًا مِنهُم زَهرَةَ الحَيوٰةِ الدُّنيا لِنَفتِنَهُم فيهِ ۚ وَرِزقُ رَبِّكَ خَيرٌ وَأَبقىٰ"
    },
    {
      "index": "132",
      "text": "وَأمُر أَهلَكَ بِالصَّلوٰةِ وَاصطَبِر عَلَيها ۖ لا نَسـَٔلُكَ رِزقًا ۖ نَحنُ نَرزُقُكَ ۗ وَالعـٰقِبَةُ لِلتَّقوىٰ"
    },
    {
      "index": "133",
      "text": "وَقالوا لَولا يَأتينا بِـٔايَةٍ مِن رَبِّهِ ۚ أَوَلَم تَأتِهِم بَيِّنَةُ ما فِى الصُّحُفِ الأولىٰ"
    },
    {
      "index": "134",
      "text": "وَلَو أَنّا أَهلَكنـٰهُم بِعَذابٍ مِن قَبلِهِ لَقالوا رَبَّنا لَولا أَرسَلتَ إِلَينا رَسولًا فَنَتَّبِعَ ءايـٰتِكَ مِن قَبلِ أَن نَذِلَّ وَنَخزىٰ"
    },
    {
      "index": "135",
      "text": "قُل كُلٌّ مُتَرَبِّصٌ فَتَرَبَّصوا ۖ فَسَتَعلَمونَ مَن أَصحـٰبُ الصِّرٰطِ السَّوِىِّ وَمَنِ اهتَدىٰ"
    }
  ],
  "index": "20",
  "name": "طه",
  "copyright": "# PLEASE DO NOT REMOVE OR CHANGE THIS COPYRIGHT BLOCK \n#==================================================================== \n#\n#  Tanzil Quran Text (Uthmani Minimal, Version 1.1)\n#  Copyright (C) 2007-2022 Tanzil Project\n#  License: Creative Commons Attribution 3.0\n#\n#  This copy of the Quran text is carefully produced, highly \n#  verified and continuously monitored by a group of specialists \n#  at Tanzil Project.\n#\n#  TERMS OF USE:\n#\n#  - Permission is granted to copy and distribute verbatim copies \n#    of this text, but CHANGING IT IS NOT ALLOWED.\n#\n#  - This Quran text can be used in any website or application, \n#    provided that its source (Tanzil Project) is clearly indicated, \n#    and a link is made to tanzil.net to enable users to keep\n#    track of changes.\n#\n#  - This copyright notice shall be included in all verbatim copies \n#    of the text, and shall be reproduced appropriately in all files \n#    derived from or containing substantial portion of this text.\n#\n#  Please check updates at: http://tanzil.net/updates/\n#\n#====================================================================\n",
  "type": "uthmani-min",
  "version": "1.1"
}