{
  "aya": [
    {
      "index": "1",
      "text": "أَلَم تَرَ كَيفَ فَعَلَ رَبُّكَ بِأَصحـٰبِ الفيلِ",
      "bismillah": "بِسمِ اللَّهِ الرَّحمـٰنِ الرَّحيمِ"
    },
    {
      "index": "2",
      "text": "أَلَم يَجعَل كَيدَهُم فى تَضليلٍ"
    },
    {
      "index": "3",
      "text": "وَأَرسَلَ عَلَيهِم طَيرًا أَبابيلَ"
    },
    {
      "index": "4",
      "text": "تَرميهِم بِحِجارَةٍ مِن سِجّيلٍ"
    },
    {
      "index": "5",
      "text": "فَجَعَلَهُم كَعَصفٍ مَأكولٍ"
    }
  ],
  "index": "105",
  "name": "الفيل",
  "copyright": "# PLEASE DO NOT REMOVE OR CHANGE THIS COPYRIGHT BLOCK \n#==================================================================== \n#\n#  Tanzil Quran Text (Uthmani Minimal, Version 1.1)\n#  Copyright (C) 2007-2022 Tanzil Project\n#  License: Creative Commons Attribution 3.0\n#\n#  This copy of the Quran text is carefully produced, highly \n#  verified and continuously monitored by a group of specialists \n#  at Tanzil Project.\n#\n#  TERMS OF USE:\n#\n#  - Permission is granted to copy and distribute verbatim copies \n#    of this text, but CHANGING IT IS NOT ALLOWED.\n#\n#  - This Quran text can be used in any website or application, \n#    provided that its source (Tanzil Project) is clearly indicated, \n#    and a link is made to tanzil.net to enable users to keep\n#    track of changes.\n#\n#  - This copyright notice shall be included in all verbatim copies \n#    of the text, and shall be reproduced appropriately in all files \n#    derived from or containing substantial portion of this text.\n#\n#  Please check updates at: http://tanzil.net/updates/\n#\n#====================================================================\n",
  "type": "uthmani-min",
  "version": "1.1"
}