{
  "aya": [
    {
      "index": "1",
      "text": "وَالشَّمْسِ وَضُحَاهَا",
      "bismillah": "بِسْمِ اللَّهِ الرَّحْمَـٰنِ الرَّحِيمِ"
    },
    {
      "index": "2",
      "text": "وَالْقَمَرِ إِذَا تَلَاهَا"
    },
    {
      "index": "3",
      "text": "وَالنَّهَارِ إِذَا جَلَّاهَا"
    },
    {
      "index": "4",
      "text": "وَاللَّيْلِ إِذَا يَغْشَاهَا"
    },
    {
      "index": "5",
      "text": "وَالسَّمَاءِ وَمَا بَنَاهَا"
    },
    {
      "index": "6",
      "text": "وَالْأَرْضِ وَمَا طَحَاهَا"
    },
    {
      "index": "7",
      "text": "وَنَفْسٍ وَمَا سَوَّاهَا"
    },
    {
      "index": "8",
      "text": "فَأَلْهَمَهَا فُجُورَهَا وَتَقْوَاهَا"
    },
    {
      "index": "9",
      "text": "قَدْ أَفْلَحَ مَن زَكَّاهَا"
    },
    {
      "index": "10",
      "text": "وَقَدْ خَابَ مَن دَسَّاهَا"
    },
    {
      "index": "11",
      "text": "كَذَّبَتْ ثَمُودُ بِطَغْوَاهَا"
    },
    {
      "index": "12",
      "text": "إِذِ انبَعَثَ أَشْقَاهَا"
    },
    {
      "index": "13",
      "text": "فَقَالَ لَهُمْ رَسُولُ اللَّهِ نَاقَةَ اللَّهِ وَسُقْيَاهَا"
    },
    {
      "index": "14",
      "text": "فَكَذَّبُوهُ فَعَقَرُوهَا فَدَمْدَمَ عَلَيْهِمْ رَبُّهُم بِذَنبِهِمْ فَسَوَّاهَا"
    },
    {
      "index": "15",
      "text": "وَلَا يَخَافُ عُقْبَاهَا"
    }
  ],
  "index": "91",
  "name": "الشمس",
  "copyright": "# PLEASE DO NOT REMOVE OR CHANGE THIS COPYRIGHT BLOCK \n#==================================================================== \n#\n#  Tanzil Quran Text (Simple, Version 1.1)\n#  Copyright (C) 2007-2022 Tanzil Project\n#  License: Creative Commons Attribution 3.0\n#\n#  This copy of the Quran text is carefully produced, highly \n#  verified and continuously monitored by a group of specialists \n#  at Tanzil Project.\n#\n#  TERMS OF USE:\n#\n#  - Permission is granted to copy and distribute verbatim copies \n#    of this text, but CHANGING IT IS NOT ALLOWED.\n#\n#  - This Quran text can be used in any website or application, \n#    provided that its source (Tanzil Project) is clearly indicated, \n#    and a link is made to tanzil.net to enable users to keep\n#    track of changes.\n#\n#  - This copyright notice shall be included in all verbatim copies \n#    of the text, and shall be reproduced appropriately in all files \n#    derived from or containing substantial portion of this text.\n#\n#  Please check updates at: http://tanzil.net/updates/\n#\n#====================================================================\n",
  "type": "simple",
  "version": "1.1"
}