{
  "aya": [
    {
      "index": "1",
      "text": "الم",
      "bismillah": "بسم الله الرحمن الرحيم"
    },
    {
      "index": "2",
      "text": "غلبت الروم"
    },
    {
      "index": "3",
      "text": "في أدنى الأرض وهم من بعد غلبهم سيغلبون"
    },
    {
      "index": "4",
      "text": "في بضع سنين ۗ لله الأمر من قبل ومن بعد ۚ ويومئذ يفرح المؤمنون"
    },
    {
      "index": "5",
      "text": "بنصر الله ۚ ينصر من يشاء ۖ وهو العزيز الرحيم"
    },
    {
      "index": "6",
      "text": "وعد الله ۖ لا يخلف الله وعده ولكن أكثر الناس لا يعلمون"
    },
    {
      "index": "7",
      "text": "يعلمون ظاهرا من الحياة الدنيا وهم عن الآخرة هم غافلون"
    },
    {
      "index": "8",
      "text": "أولم يتفكروا في أنفسهم ۗ ما خلق الله السماوات والأرض وما بينهما إلا بالحق وأجل مسمى ۗ وإن كثيرا من الناس بلقاء ربهم لكافرون"
    },
    {
      "index": "9",
      "text": "أولم يسيروا في الأرض فينظروا كيف كان عاقبة الذين من قبلهم ۚ كانوا أشد منهم قوة وأثاروا الأرض وعمروها أكثر مما عمروها وجاءتهم رسلهم بالبينات ۖ فما كان الله ليظلمهم ولكن كانوا أنفسهم يظلمون"
    },
    {
      "index": "10",
      "text": "ثم كان عاقبة الذين أساءوا السوأى أن كذبوا بآيات الله وكانوا بها يستهزئون"
    },
    {
      "index": "11",
      "text": "الله يبدأ الخلق ثم يعيده ثم إليه ترجعون"
    },
    {
      "index": "12",
      "text": "ويوم تقوم الساعة يبلس المجرمون"
    },
    {
      "index": "13",
      "text": "ولم يكن لهم من شركائهم شفعاء وكانوا بشركائهم كافرين"
    },
    {
      "index": "14",
      "text": "ويوم تقوم الساعة يومئذ يتفرقون"
    },
    {
      "index": "15",
      "text": "فأما الذين آمنوا وعملوا الصالحات فهم في روضة يحبرون"
    },
    {
      "index": "16",
      "text": "وأما الذين كفروا وكذبوا بآياتنا ولقاء الآخرة فأولئك في العذاب محضرون"
    },
    {
      "index": "17",
      "text": "فسبحان الله حين تمسون وحين تصبحون"
    },
    {
      "index": "18",
      "text": "وله الحمد في السماوات والأرض وعشيا وحين تظهرون"
    },
    {
      "index": "19",
      "text": "يخرج الحي من الميت ويخرج الميت من الحي ويحيي الأرض بعد موتها ۚ وكذلك تخرجون"
    },
    {
      "index": "20",
      "text": "ومن آياته أن خلقكم من تراب ثم إذا أنتم بشر تنتشرون"
    },
    {
      "index": "21",
      "text": "ومن آياته أن خلق لكم من أنفسكم أزواجا لتسكنوا إليها وجعل بينكم مودة ورحمة ۚ إن في ذلك لآيات لقوم يتفكرون"
    },
    {
      "index": "22",
      "text": "ومن آياته خلق السماوات والأرض واختلاف ألسنتكم وألوانكم ۚ إن في ذلك لآيات للعالمين"
    },
    {
      "index": "23",
      "text": "ومن آياته منامكم بالليل والنهار وابتغاؤكم من فضله ۚ إن في ذلك لآيات لقوم يسمعون"
    },
    {
      "index": "24",
      "text": "ومن آياته يريكم البرق خوفا وطمعا وينزل من السماء ماء فيحيي به الأرض بعد موتها ۚ إن في ذلك لآيات لقوم يعقلون"
    },
    {
      "index": "25",
      "text": "ومن آياته أن تقوم السماء والأرض بأمره ۚ ثم إذا دعاكم دعوة من الأرض إذا أنتم تخرجون"
    },
    {
      "index": "26",
      "text": "وله من في السماوات والأرض ۖ كل له قانتون"
    },
    {
      "index": "27",
      "text": "وهو الذي يبدأ الخلق ثم يعيده وهو أهون عليه ۚ وله المثل الأعلى في السماوات والأرض ۚ وهو العزيز الحكيم"
    },
    {
      "index": "28",
      "text": "ضرب لكم مثلا من أنفسكم ۖ هل لكم من ما ملكت أيمانكم من شركاء في ما رزقناكم فأنتم فيه سواء تخافونهم كخيفتكم أنفسكم ۚ كذلك نفصل الآيات لقوم يعقلون"
    },
    {
      "index": "29",
      "text": "بل اتبع الذين ظلموا أهواءهم بغير علم ۖ فمن يهدي من أضل الله ۖ وما لهم من ناصرين"
    },
    {
      "index": "30",
      "text": "فأقم وجهك للدين حنيفا ۚ فطرت الله التي فطر الناس عليها ۚ لا تبديل لخلق الله ۚ ذلك الدين القيم ولكن أكثر الناس لا يعلمون"
    },
    {
      "index": "31",
      "text": "۞ منيبين إليه واتقوه وأقيموا الصلاة ولا تكونوا من المشركين"
    },
    {
      "index": "32",
      "text": "من الذين فرقوا دينهم وكانوا شيعا ۖ كل حزب بما لديهم فرحون"
    },
    {
      "index": "33",
      "text": "وإذا مس الناس ضر دعوا ربهم منيبين إليه ثم إذا أذاقهم منه رحمة إذا فريق منهم بربهم يشركون"
    },
    {
      "index": "34",
      "text": "ليكفروا بما آتيناهم ۚ فتمتعوا فسوف تعلمون"
    },
    {
      "index": "35",
      "text": "أم أنزلنا عليهم سلطانا فهو يتكلم بما كانوا به يشركون"
    },
    {
      "index": "36",
      "text": "وإذا أذقنا الناس رحمة فرحوا بها ۖ وإن تصبهم سيئة بما قدمت أيديهم إذا هم يقنطون"
    },
    {
      "index": "37",
      "text": "أولم يروا أن الله يبسط الرزق لمن يشاء ويقدر ۚ إن في ذلك لآيات لقوم يؤمنون"
    },
    {
      "index": "38",
      "text": "فآت ذا القربى حقه والمسكين وابن السبيل ۚ ذلك خير للذين يريدون وجه الله ۖ وأولئك هم المفلحون"
    },
    {
      "index": "39",
      "text": "وما آتيتم من ربا ليربو في أموال الناس فلا يربو عند الله ۖ وما آتيتم من زكاة تريدون وجه الله فأولئك هم المضعفون"
    },
    {
      "index": "40",
      "text": "الله الذي خلقكم ثم رزقكم ثم يميتكم ثم يحييكم ۖ هل من شركائكم من يفعل من ذلكم من شيء ۚ سبحانه وتعالى عما يشركون"
    },
    {
      "index": "41",
      "text": "ظهر الفساد في البر والبحر بما كسبت أيدي الناس ليذيقهم بعض الذي عملوا لعلهم يرجعون"
    },
    {
      "index": "42",
      "text": "قل سيروا في الأرض فانظروا كيف كان عاقبة الذين من قبل ۚ كان أكثرهم مشركين"
    },
    {
      "index": "43",
      "text": "فأقم وجهك للدين القيم من قبل أن يأتي يوم لا مرد له من الله ۖ يومئذ يصدعون"
    },
    {
      "index": "44",
      "text": "من كفر فعليه كفره ۖ ومن عمل صالحا فلأنفسهم يمهدون"
    },
    {
      "index": "45",
      "text": "ليجزي الذين آمنوا وعملوا الصالحات من فضله ۚ إنه لا يحب الكافرين"
    },
    {
      "index": "46",
      "text": "ومن آياته أن يرسل الرياح مبشرات وليذيقكم من رحمته ولتجري الفلك بأمره ولتبتغوا من فضله ولعلكم تشكرون"
    },
    {
      "index": "47",
      "text": "ولقد أرسلنا من قبلك رسلا إلى قومهم فجاءوهم بالبينات فانتقمنا من الذين أجرموا ۖ وكان حقا علينا نصر المؤمنين"
    },
    {
      "index": "48",
      "text": "الله الذي يرسل الرياح فتثير سحابا فيبسطه في السماء كيف يشاء ويجعله كسفا فترى الودق يخرج من خلاله ۖ فإذا أصاب به من يشاء من عباده إذا هم يستبشرون"
    },
    {
      "index": "49",
      "text": "وإن كانوا من قبل أن ينزل عليهم من قبله لمبلسين"
    },
    {
      "index": "50",
      "text": "فانظر إلى آثار رحمت الله كيف يحيي الأرض بعد موتها ۚ إن ذلك لمحيي الموتى ۖ وهو على كل شيء قدير"
    },
    {
      "index": "51",
      "text": "ولئن أرسلنا ريحا فرأوه مصفرا لظلوا من بعده يكفرون"
    },
    {
      "index": "52",
      "text": "فإنك لا تسمع الموتى ولا تسمع الصم الدعاء إذا ولوا مدبرين"
    },
    {
      "index": "53",
      "text": "وما أنت بهاد العمي عن ضلالتهم ۖ إن تسمع إلا من يؤمن بآياتنا فهم مسلمون"
    },
    {
      "index": "54",
      "text": "۞ الله الذي خلقكم من ضعف ثم جعل من بعد ضعف قوة ثم جعل من بعد قوة ضعفا وشيبة ۚ يخلق ما يشاء ۖ وهو العليم القدير"
    },
    {
      "index": "55",
      "text": "ويوم تقوم الساعة يقسم المجرمون ما لبثوا غير ساعة ۚ كذلك كانوا يؤفكون"
    },
    {
      "index": "56",
      "text": "وقال الذين أوتوا العلم والإيمان لقد لبثتم في كتاب الله إلى يوم البعث ۖ فهذا يوم البعث ولكنكم كنتم لا تعلمون"
    },
    {
      "index": "57",
      "text": "فيومئذ لا ينفع الذين ظلموا معذرتهم ولا هم يستعتبون"
    },
    {
      "index": "58",
      "text": "ولقد ضربنا للناس في هذا القرآن من كل مثل ۚ ولئن جئتهم بآية ليقولن الذين كفروا إن أنتم إلا مبطلون"
    },
    {
      "index": "59",
      "text": "كذلك يطبع الله على قلوب الذين لا يعلمون"
    },
    {
      "index": "60",
      "text": "فاصبر إن وعد الله حق ۖ ولا يستخفنك الذين لا يوقنون"
    }
  ],
  "index": "30",
  "name": "الروم",
  "copyright": "# PLEASE DO NOT REMOVE OR CHANGE THIS COPYRIGHT BLOCK \n#==================================================================== \n#\n#  Tanzil Quran Text (Simple Clean, Version 1.1)\n#  Copyright (C) 2007-2022 Tanzil Project\n#  License: Creative Commons Attribution 3.0\n#\n#  This copy of the Quran text is carefully produced, highly \n#  verified and continuously monitored by a group of specialists \n#  at Tanzil Project.\n#\n#  TERMS OF USE:\n#\n#  - Permission is granted to copy and distribute verbatim copies \n#    of this text, but CHANGING IT IS NOT ALLOWED.\n#\n#  - This Quran text can be used in any website or application, \n#    provided that its source (Tanzil Project) is clearly indicated, \n#    and a link is made to tanzil.net to enable users to keep\n#    track of changes.\n#\n#  - This copyright notice shall be included in all verbatim copies \n#    of the text, and shall be reproduced appropriately in all files \n#    derived from or containing substantial portion of this text.\n#\n#  Please check updates at: http://tanzil.net/updates/\n#\n#====================================================================\n",
  "type": "simple-clean",
  "version": "1.1"
}