{
  "aya": [
    {
      "index": "1",
      "text": "يس",
      "bismillah": "بِسمِ اللَّهِ الرَّحمـٰنِ الرَّحيمِ"
    },
    {
      "index": "2",
      "text": "وَالقُرآنِ الحَكيمِ"
    },
    {
      "index": "3",
      "text": "إِنَّكَ لَمِنَ المُرسَلينَ"
    },
    {
      "index": "4",
      "text": "عَلىٰ صِراطٍ مُستَقيمٍ"
    },
    {
      "index": "5",
      "text": "تَنزيلَ العَزيزِ الرَّحيمِ"
    },
    {
      "index": "6",
      "text": "لِتُنذِرَ قَومًا ما أُنذِرَ آباؤُهُم فَهُم غافِلونَ"
    },
    {
      "index": "7",
      "text": "لَقَد حَقَّ القَولُ عَلىٰ أَكثَرِهِم فَهُم لا يُؤمِنونَ"
    },
    {
      "index": "8",
      "text": "إِنّا جَعَلنا في أَعناقِهِم أَغلالًا فَهِيَ إِلَى الأَذقانِ فَهُم مُقمَحونَ"
    },
    {
      "index": "9",
      "text": "وَجَعَلنا مِن بَينِ أَيديهِم سَدًّا وَمِن خَلفِهِم سَدًّا فَأَغشَيناهُم فَهُم لا يُبصِرونَ"
    },
    {
      "index": "10",
      "text": "وَسَواءٌ عَلَيهِم أَأَنذَرتَهُم أَم لَم تُنذِرهُم لا يُؤمِنونَ"
    },
    {
      "index": "11",
      "text": "إِنَّما تُنذِرُ مَنِ اتَّبَعَ الذِّكرَ وَخَشِيَ الرَّحمـٰنَ بِالغَيبِ ۖ فَبَشِّرهُ بِمَغفِرَةٍ وَأَجرٍ كَريمٍ"
    },
    {
      "index": "12",
      "text": "إِنّا نَحنُ نُحيِي المَوتىٰ وَنَكتُبُ ما قَدَّموا وَآثارَهُم ۚ وَكُلَّ شَيءٍ أَحصَيناهُ في إِمامٍ مُبينٍ"
    },
    {
      "index": "13",
      "text": "وَاضرِب لَهُم مَثَلًا أَصحابَ القَريَةِ إِذ جاءَهَا المُرسَلونَ"
    },
    {
      "index": "14",
      "text": "إِذ أَرسَلنا إِلَيهِمُ اثنَينِ فَكَذَّبوهُما فَعَزَّزنا بِثالِثٍ فَقالوا إِنّا إِلَيكُم مُرسَلونَ"
    },
    {
      "index": "15",
      "text": "قالوا ما أَنتُم إِلّا بَشَرٌ مِثلُنا وَما أَنزَلَ الرَّحمـٰنُ مِن شَيءٍ إِن أَنتُم إِلّا تَكذِبونَ"
    },
    {
      "index": "16",
      "text": "قالوا رَبُّنا يَعلَمُ إِنّا إِلَيكُم لَمُرسَلونَ"
    },
    {
      "index": "17",
      "text": "وَما عَلَينا إِلَّا البَلاغُ المُبينُ"
    },
    {
      "index": "18",
      "text": "قالوا إِنّا تَطَيَّرنا بِكُم ۖ لَئِن لَم تَنتَهوا لَنَرجُمَنَّكُم وَلَيَمَسَّنَّكُم مِنّا عَذابٌ أَليمٌ"
    },
    {
      "index": "19",
      "text": "قالوا طائِرُكُم مَعَكُم ۚ أَئِن ذُكِّرتُم ۚ بَل أَنتُم قَومٌ مُسرِفونَ"
    },
    {
      "index": "20",
      "text": "وَجاءَ مِن أَقصَى المَدينَةِ رَجُلٌ يَسعىٰ قالَ يا قَومِ اتَّبِعُوا المُرسَلينَ"
    },
    {
      "index": "21",
      "text": "اتَّبِعوا مَن لا يَسأَلُكُم أَجرًا وَهُم مُهتَدونَ"
    },
    {
      "index": "22",
      "text": "وَما لِيَ لا أَعبُدُ الَّذي فَطَرَني وَإِلَيهِ تُرجَعونَ"
    },
    {
      "index": "23",
      "text": "أَأَتَّخِذُ مِن دونِهِ آلِهَةً إِن يُرِدنِ الرَّحمـٰنُ بِضُرٍّ لا تُغنِ عَنّي شَفاعَتُهُم شَيئًا وَلا يُنقِذونِ"
    },
    {
      "index": "24",
      "text": "إِنّي إِذًا لَفي ضَلالٍ مُبينٍ"
    },
    {
      "index": "25",
      "text": "إِنّي آمَنتُ بِرَبِّكُم فَاسمَعونِ"
    },
    {
      "index": "26",
      "text": "قيلَ ادخُلِ الجَنَّةَ ۖ قالَ يا لَيتَ قَومي يَعلَمونَ"
    },
    {
      "index": "27",
      "text": "بِما غَفَرَ لي رَبّي وَجَعَلَني مِنَ المُكرَمينَ"
    },
    {
      "index": "28",
      "text": "۞ وَما أَنزَلنا عَلىٰ قَومِهِ مِن بَعدِهِ مِن جُندٍ مِنَ السَّماءِ وَما كُنّا مُنزِلينَ"
    },
    {
      "index": "29",
      "text": "إِن كانَت إِلّا صَيحَةً واحِدَةً فَإِذا هُم خامِدونَ"
    },
    {
      "index": "30",
      "text": "يا حَسرَةً عَلَى العِبادِ ۚ ما يَأتيهِم مِن رَسولٍ إِلّا كانوا بِهِ يَستَهزِئونَ"
    },
    {
      "index": "31",
      "text": "أَلَم يَرَوا كَم أَهلَكنا قَبلَهُم مِنَ القُرونِ أَنَّهُم إِلَيهِم لا يَرجِعونَ"
    },
    {
      "index": "32",
      "text": "وَإِن كُلٌّ لَمّا جَميعٌ لَدَينا مُحضَرونَ"
    },
    {
      "index": "33",
      "text": "وَآيَةٌ لَهُمُ الأَرضُ المَيتَةُ أَحيَيناها وَأَخرَجنا مِنها حَبًّا فَمِنهُ يَأكُلونَ"
    },
    {
      "index": "34",
      "text": "وَجَعَلنا فيها جَنّاتٍ مِن نَخيلٍ وَأَعنابٍ وَفَجَّرنا فيها مِنَ العُيونِ"
    },
    {
      "index": "35",
      "text": "لِيَأكُلوا مِن ثَمَرِهِ وَما عَمِلَتهُ أَيديهِم ۖ أَفَلا يَشكُرونَ"
    },
    {
      "index": "36",
      "text": "سُبحانَ الَّذي خَلَقَ الأَزواجَ كُلَّها مِمّا تُنبِتُ الأَرضُ وَمِن أَنفُسِهِم وَمِمّا لا يَعلَمونَ"
    },
    {
      "index": "37",
      "text": "وَآيَةٌ لَهُمُ اللَّيلُ نَسلَخُ مِنهُ النَّهارَ فَإِذا هُم مُظلِمونَ"
    },
    {
      "index": "38",
      "text": "وَالشَّمسُ تَجري لِمُستَقَرٍّ لَها ۚ ذٰلِكَ تَقديرُ العَزيزِ العَليمِ"
    },
    {
      "index": "39",
      "text": "وَالقَمَرَ قَدَّرناهُ مَنازِلَ حَتّىٰ عادَ كَالعُرجونِ القَديمِ"
    },
    {
      "index": "40",
      "text": "لَا الشَّمسُ يَنبَغي لَها أَن تُدرِكَ القَمَرَ وَلَا اللَّيلُ سابِقُ النَّهارِ ۚ وَكُلٌّ في فَلَكٍ يَسبَحونَ"
    },
    {
      "index": "41",
      "text": "وَآيَةٌ لَهُم أَنّا حَمَلنا ذُرِّيَّتَهُم فِي الفُلكِ المَشحونِ"
    },
    {
      "index": "42",
      "text": "وَخَلَقنا لَهُم مِن مِثلِهِ ما يَركَبونَ"
    },
    {
      "index": "43",
      "text": "وَإِن نَشَأ نُغرِقهُم فَلا صَريخَ لَهُم وَلا هُم يُنقَذونَ"
    },
    {
      "index": "44",
      "text": "إِلّا رَحمَةً مِنّا وَمَتاعًا إِلىٰ حينٍ"
    },
    {
      "index": "45",
      "text": "وَإِذا قيلَ لَهُمُ اتَّقوا ما بَينَ أَيديكُم وَما خَلفَكُم لَعَلَّكُم تُرحَمونَ"
    },
    {
      "index": "46",
      "text": "وَما تَأتيهِم مِن آيَةٍ مِن آياتِ رَبِّهِم إِلّا كانوا عَنها مُعرِضينَ"
    },
    {
      "index": "47",
      "text": "وَإِذا قيلَ لَهُم أَنفِقوا مِمّا رَزَقَكُمُ اللَّهُ قالَ الَّذينَ كَفَروا لِلَّذينَ آمَنوا أَنُطعِمُ مَن لَو يَشاءُ اللَّهُ أَطعَمَهُ إِن أَنتُم إِلّا في ضَلالٍ مُبينٍ"
    },
    {
      "index": "48",
      "text": "وَيَقولونَ مَتىٰ هـٰذَا الوَعدُ إِن كُنتُم صادِقينَ"
    },
    {
      "index": "49",
      "text": "ما يَنظُرونَ إِلّا صَيحَةً واحِدَةً تَأخُذُهُم وَهُم يَخِصِّمونَ"
    },
    {
      "index": "50",
      "text": "فَلا يَستَطيعونَ تَوصِيَةً وَلا إِلىٰ أَهلِهِم يَرجِعونَ"
    },
    {
      "index": "51",
      "text": "وَنُفِخَ فِي الصّورِ فَإِذا هُم مِنَ الأَجداثِ إِلىٰ رَبِّهِم يَنسِلونَ"
    },
    {
      "index": "52",
      "text": "قالوا يا وَيلَنا مَن بَعَثَنا مِن مَرقَدِنا ۜ ۗ هـٰذا ما وَعَدَ الرَّحمـٰنُ وَصَدَقَ المُرسَلونَ"
    },
    {
      "index": "53",
      "text": "إِن كانَت إِلّا صَيحَةً واحِدَةً فَإِذا هُم جَميعٌ لَدَينا مُحضَرونَ"
    },
    {
      "index": "54",
      "text": "فَاليَومَ لا تُظلَمُ نَفسٌ شَيئًا وَلا تُجزَونَ إِلّا ما كُنتُم تَعمَلونَ"
    },
    {
      "index": "55",
      "text": "إِنَّ أَصحابَ الجَنَّةِ اليَومَ في شُغُلٍ فاكِهونَ"
    },
    {
      "index": "56",
      "text": "هُم وَأَزواجُهُم في ظِلالٍ عَلَى الأَرائِكِ مُتَّكِئونَ"
    },
    {
      "index": "57",
      "text": "لَهُم فيها فاكِهَةٌ وَلَهُم ما يَدَّعونَ"
    },
    {
      "index": "58",
      "text": "سَلامٌ قَولًا مِن رَبٍّ رَحيمٍ"
    },
    {
      "index": "59",
      "text": "وَامتازُوا اليَومَ أَيُّهَا المُجرِمونَ"
    },
    {
      "index": "60",
      "text": "۞ أَلَم أَعهَد إِلَيكُم يا بَني آدَمَ أَن لا تَعبُدُوا الشَّيطانَ ۖ إِنَّهُ لَكُم عَدُوٌّ مُبينٌ"
    },
    {
      "index": "61",
      "text": "وَأَنِ اعبُدوني ۚ هـٰذا صِراطٌ مُستَقيمٌ"
    },
    {
      "index": "62",
      "text": "وَلَقَد أَضَلَّ مِنكُم جِبِلًّا كَثيرًا ۖ أَفَلَم تَكونوا تَعقِلونَ"
    },
    {
      "index": "63",
      "text": "هـٰذِهِ جَهَنَّمُ الَّتي كُنتُم توعَدونَ"
    },
    {
      "index": "64",
      "text": "اصلَوهَا اليَومَ بِما كُنتُم تَكفُرونَ"
    },
    {
      "index": "65",
      "text": "اليَومَ نَختِمُ عَلىٰ أَفواهِهِم وَتُكَلِّمُنا أَيديهِم وَتَشهَدُ أَرجُلُهُم بِما كانوا يَكسِبونَ"
    },
    {
      "index": "66",
      "text": "وَلَو نَشاءُ لَطَمَسنا عَلىٰ أَعيُنِهِم فَاستَبَقُوا الصِّراطَ فَأَنّىٰ يُبصِرونَ"
    },
    {
      "index": "67",
      "text": "وَلَو نَشاءُ لَمَسَخناهُم عَلىٰ مَكانَتِهِم فَمَا استَطاعوا مُضِيًّا وَلا يَرجِعونَ"
    },
    {
      "index": "68",
      "text": "وَمَن نُعَمِّرهُ نُنَكِّسهُ فِي الخَلقِ ۖ أَفَلا يَعقِلونَ"
    },
    {
      "index": "69",
      "text": "وَما عَلَّمناهُ الشِّعرَ وَما يَنبَغي لَهُ ۚ إِن هُوَ إِلّا ذِكرٌ وَقُرآنٌ مُبينٌ"
    },
    {
      "index": "70",
      "text": "لِيُنذِرَ مَن كانَ حَيًّا وَيَحِقَّ القَولُ عَلَى الكافِرينَ"
    },
    {
      "index": "71",
      "text": "أَوَلَم يَرَوا أَنّا خَلَقنا لَهُم مِمّا عَمِلَت أَيدينا أَنعامًا فَهُم لَها مالِكونَ"
    },
    {
      "index": "72",
      "text": "وَذَلَّلناها لَهُم فَمِنها رَكوبُهُم وَمِنها يَأكُلونَ"
    },
    {
      "index": "73",
      "text": "وَلَهُم فيها مَنافِعُ وَمَشارِبُ ۖ أَفَلا يَشكُرونَ"
    },
    {
      "index": "74",
      "text": "وَاتَّخَذوا مِن دونِ اللَّهِ آلِهَةً لَعَلَّهُم يُنصَرونَ"
    },
    {
      "index": "75",
      "text": "لا يَستَطيعونَ نَصرَهُم وَهُم لَهُم جُندٌ مُحضَرونَ"
    },
    {
      "index": "76",
      "text": "فَلا يَحزُنكَ قَولُهُم ۘ إِنّا نَعلَمُ ما يُسِرّونَ وَما يُعلِنونَ"
    },
    {
      "index": "77",
      "text": "أَوَلَم يَرَ الإِنسانُ أَنّا خَلَقناهُ مِن نُطفَةٍ فَإِذا هُوَ خَصيمٌ مُبينٌ"
    },
    {
      "index": "78",
      "text": "وَضَرَبَ لَنا مَثَلًا وَنَسِيَ خَلقَهُ ۖ قالَ مَن يُحيِي العِظامَ وَهِيَ رَميمٌ"
    },
    {
      "index": "79",
      "text": "قُل يُحييهَا الَّذي أَنشَأَها أَوَّلَ مَرَّةٍ ۖ وَهُوَ بِكُلِّ خَلقٍ عَليمٌ"
    },
    {
      "index": "80",
      "text": "الَّذي جَعَلَ لَكُم مِنَ الشَّجَرِ الأَخضَرِ نارًا فَإِذا أَنتُم مِنهُ توقِدونَ"
    },
    {
      "index": "81",
      "text": "أَوَلَيسَ الَّذي خَلَقَ السَّماواتِ وَالأَرضَ بِقادِرٍ عَلىٰ أَن يَخلُقَ مِثلَهُم ۚ بَلىٰ وَهُوَ الخَلّاقُ العَليمُ"
    },
    {
      "index": "82",
      "text": "إِنَّما أَمرُهُ إِذا أَرادَ شَيئًا أَن يَقولَ لَهُ كُن فَيَكونُ"
    },
    {
      "index": "83",
      "text": "فَسُبحانَ الَّذي بِيَدِهِ مَلَكوتُ كُلِّ شَيءٍ وَإِلَيهِ تُرجَعونَ"
    }
  ],
  "index": "36",
  "name": "يس",
  "copyright": "# PLEASE DO NOT REMOVE OR CHANGE THIS COPYRIGHT BLOCK \n#==================================================================== \n#\n#  Tanzil Quran Text (Simple Minimal, Version 1.1)\n#  Copyright (C) 2007-2022 Tanzil Project\n#  License: Creative Commons Attribution 3.0\n#\n#  This copy of the Quran text is carefully produced, highly \n#  verified and continuously monitored by a group of specialists \n#  at Tanzil Project.\n#\n#  TERMS OF USE:\n#\n#  - Permission is granted to copy and distribute verbatim copies \n#    of this text, but CHANGING IT IS NOT ALLOWED.\n#\n#  - This Quran text can be used in any website or application, \n#    provided that its source (Tanzil Project) is clearly indicated, \n#    and a link is made to tanzil.net to enable users to keep\n#    track of changes.\n#\n#  - This copyright notice shall be included in all verbatim copies \n#    of the text, and shall be reproduced appropriately in all files \n#    derived from or containing substantial portion of this text.\n#\n#  Please check updates at: http://tanzil.net/updates/\n#\n#====================================================================\n",
  "type": "simple-min",
  "version": "1.1"
}