{
  "aya": [
    {
      "index": "1",
      "text": "حم",
      "bismillah": "بِسمِ اللَّهِ الرَّحمـٰنِ الرَّحيمِ"
    },
    {
      "index": "2",
      "text": "عسق"
    },
    {
      "index": "3",
      "text": "كَذٰلِكَ يوحي إِلَيكَ وَإِلَى الَّذينَ مِن قَبلِكَ اللَّهُ العَزيزُ الحَكيمُ"
    },
    {
      "index": "4",
      "text": "لَهُ ما فِي السَّماواتِ وَما فِي الأَرضِ ۖ وَهُوَ العَلِيُّ العَظيمُ"
    },
    {
      "index": "5",
      "text": "تَكادُ السَّماواتُ يَتَفَطَّرنَ مِن فَوقِهِنَّ ۚ وَالمَلائِكَةُ يُسَبِّحونَ بِحَمدِ رَبِّهِم وَيَستَغفِرونَ لِمَن فِي الأَرضِ ۗ أَلا إِنَّ اللَّهَ هُوَ الغَفورُ الرَّحيمُ"
    },
    {
      "index": "6",
      "text": "وَالَّذينَ اتَّخَذوا مِن دونِهِ أَولِياءَ اللَّهُ حَفيظٌ عَلَيهِم وَما أَنتَ عَلَيهِم بِوَكيلٍ"
    },
    {
      "index": "7",
      "text": "وَكَذٰلِكَ أَوحَينا إِلَيكَ قُرآنًا عَرَبِيًّا لِتُنذِرَ أُمَّ القُرىٰ وَمَن حَولَها وَتُنذِرَ يَومَ الجَمعِ لا رَيبَ فيهِ ۚ فَريقٌ فِي الجَنَّةِ وَفَريقٌ فِي السَّعيرِ"
    },
    {
      "index": "8",
      "text": "وَلَو شاءَ اللَّهُ لَجَعَلَهُم أُمَّةً واحِدَةً وَلـٰكِن يُدخِلُ مَن يَشاءُ في رَحمَتِهِ ۚ وَالظّالِمونَ ما لَهُم مِن وَلِيٍّ وَلا نَصيرٍ"
    },
    {
      "index": "9",
      "text": "أَمِ اتَّخَذوا مِن دونِهِ أَولِياءَ ۖ فَاللَّهُ هُوَ الوَلِيُّ وَهُوَ يُحيِي المَوتىٰ وَهُوَ عَلىٰ كُلِّ شَيءٍ قَديرٌ"
    },
    {
      "index": "10",
      "text": "وَمَا اختَلَفتُم فيهِ مِن شَيءٍ فَحُكمُهُ إِلَى اللَّهِ ۚ ذٰلِكُمُ اللَّهُ رَبّي عَلَيهِ تَوَكَّلتُ وَإِلَيهِ أُنيبُ"
    },
    {
      "index": "11",
      "text": "فاطِرُ السَّماواتِ وَالأَرضِ ۚ جَعَلَ لَكُم مِن أَنفُسِكُم أَزواجًا وَمِنَ الأَنعامِ أَزواجًا ۖ يَذرَؤُكُم فيهِ ۚ لَيسَ كَمِثلِهِ شَيءٌ ۖ وَهُوَ السَّميعُ البَصيرُ"
    },
    {
      "index": "12",
      "text": "لَهُ مَقاليدُ السَّماواتِ وَالأَرضِ ۖ يَبسُطُ الرِّزقَ لِمَن يَشاءُ وَيَقدِرُ ۚ إِنَّهُ بِكُلِّ شَيءٍ عَليمٌ"
    },
    {
      "index": "13",
      "text": "۞ شَرَعَ لَكُم مِنَ الدّينِ ما وَصّىٰ بِهِ نوحًا وَالَّذي أَوحَينا إِلَيكَ وَما وَصَّينا بِهِ إِبراهيمَ وَموسىٰ وَعيسىٰ ۖ أَن أَقيمُوا الدّينَ وَلا تَتَفَرَّقوا فيهِ ۚ كَبُرَ عَلَى المُشرِكينَ ما تَدعوهُم إِلَيهِ ۚ اللَّهُ يَجتَبي إِلَيهِ مَن يَشاءُ وَيَهدي إِلَيهِ مَن يُنيبُ"
    },
    {
      "index": "14",
      "text": "وَما تَفَرَّقوا إِلّا مِن بَعدِ ما جاءَهُمُ العِلمُ بَغيًا بَينَهُم ۚ وَلَولا كَلِمَةٌ سَبَقَت مِن رَبِّكَ إِلىٰ أَجَلٍ مُسَمًّى لَقُضِيَ بَينَهُم ۚ وَإِنَّ الَّذينَ أورِثُوا الكِتابَ مِن بَعدِهِم لَفي شَكٍّ مِنهُ مُريبٍ"
    },
    {
      "index": "15",
      "text": "فَلِذٰلِكَ فَادعُ ۖ وَاستَقِم كَما أُمِرتَ ۖ وَلا تَتَّبِع أَهواءَهُم ۖ وَقُل آمَنتُ بِما أَنزَلَ اللَّهُ مِن كِتابٍ ۖ وَأُمِرتُ لِأَعدِلَ بَينَكُمُ ۖ اللَّهُ رَبُّنا وَرَبُّكُم ۖ لَنا أَعمالُنا وَلَكُم أَعمالُكُم ۖ لا حُجَّةَ بَينَنا وَبَينَكُمُ ۖ اللَّهُ يَجمَعُ بَينَنا ۖ وَإِلَيهِ المَصيرُ"
    },
    {
      "index": "16",
      "text": "وَالَّذينَ يُحاجّونَ فِي اللَّهِ مِن بَعدِ مَا استُجيبَ لَهُ حُجَّتُهُم داحِضَةٌ عِندَ رَبِّهِم وَعَلَيهِم غَضَبٌ وَلَهُم عَذابٌ شَديدٌ"
    },
    {
      "index": "17",
      "text": "اللَّهُ الَّذي أَنزَلَ الكِتابَ بِالحَقِّ وَالميزانَ ۗ وَما يُدريكَ لَعَلَّ السّاعَةَ قَريبٌ"
    },
    {
      "index": "18",
      "text": "يَستَعجِلُ بِهَا الَّذينَ لا يُؤمِنونَ بِها ۖ وَالَّذينَ آمَنوا مُشفِقونَ مِنها وَيَعلَمونَ أَنَّهَا الحَقُّ ۗ أَلا إِنَّ الَّذينَ يُمارونَ فِي السّاعَةِ لَفي ضَلالٍ بَعيدٍ"
    },
    {
      "index": "19",
      "text": "اللَّهُ لَطيفٌ بِعِبادِهِ يَرزُقُ مَن يَشاءُ ۖ وَهُوَ القَوِيُّ العَزيزُ"
    },
    {
      "index": "20",
      "text": "مَن كانَ يُريدُ حَرثَ الآخِرَةِ نَزِد لَهُ في حَرثِهِ ۖ وَمَن كانَ يُريدُ حَرثَ الدُّنيا نُؤتِهِ مِنها وَما لَهُ فِي الآخِرَةِ مِن نَصيبٍ"
    },
    {
      "index": "21",
      "text": "أَم لَهُم شُرَكاءُ شَرَعوا لَهُم مِنَ الدّينِ ما لَم يَأذَن بِهِ اللَّهُ ۚ وَلَولا كَلِمَةُ الفَصلِ لَقُضِيَ بَينَهُم ۗ وَإِنَّ الظّالِمينَ لَهُم عَذابٌ أَليمٌ"
    },
    {
      "index": "22",
      "text": "تَرَى الظّالِمينَ مُشفِقينَ مِمّا كَسَبوا وَهُوَ واقِعٌ بِهِم ۗ وَالَّذينَ آمَنوا وَعَمِلُوا الصّالِحاتِ في رَوضاتِ الجَنّاتِ ۖ لَهُم ما يَشاءونَ عِندَ رَبِّهِم ۚ ذٰلِكَ هُوَ الفَضلُ الكَبيرُ"
    },
    {
      "index": "23",
      "text": "ذٰلِكَ الَّذي يُبَشِّرُ اللَّهُ عِبادَهُ الَّذينَ آمَنوا وَعَمِلُوا الصّالِحاتِ ۗ قُل لا أَسأَلُكُم عَلَيهِ أَجرًا إِلَّا المَوَدَّةَ فِي القُربىٰ ۗ وَمَن يَقتَرِف حَسَنَةً نَزِد لَهُ فيها حُسنًا ۚ إِنَّ اللَّهَ غَفورٌ شَكورٌ"
    },
    {
      "index": "24",
      "text": "أَم يَقولونَ افتَرىٰ عَلَى اللَّهِ كَذِبًا ۖ فَإِن يَشَإِ اللَّهُ يَختِم عَلىٰ قَلبِكَ ۗ وَيَمحُ اللَّهُ الباطِلَ وَيُحِقُّ الحَقَّ بِكَلِماتِهِ ۚ إِنَّهُ عَليمٌ بِذاتِ الصُّدورِ"
    },
    {
      "index": "25",
      "text": "وَهُوَ الَّذي يَقبَلُ التَّوبَةَ عَن عِبادِهِ وَيَعفو عَنِ السَّيِّئَاتِ وَيَعلَمُ ما تَفعَلونَ"
    },
    {
      "index": "26",
      "text": "وَيَستَجيبُ الَّذينَ آمَنوا وَعَمِلُوا الصّالِحاتِ وَيَزيدُهُم مِن فَضلِهِ ۚ وَالكافِرونَ لَهُم عَذابٌ شَديدٌ"
    },
    {
      "index": "27",
      "text": "۞ وَلَو بَسَطَ اللَّهُ الرِّزقَ لِعِبادِهِ لَبَغَوا فِي الأَرضِ وَلـٰكِن يُنَزِّلُ بِقَدَرٍ ما يَشاءُ ۚ إِنَّهُ بِعِبادِهِ خَبيرٌ بَصيرٌ"
    },
    {
      "index": "28",
      "text": "وَهُوَ الَّذي يُنَزِّلُ الغَيثَ مِن بَعدِ ما قَنَطوا وَيَنشُرُ رَحمَتَهُ ۚ وَهُوَ الوَلِيُّ الحَميدُ"
    },
    {
      "index": "29",
      "text": "وَمِن آياتِهِ خَلقُ السَّماواتِ وَالأَرضِ وَما بَثَّ فيهِما مِن دابَّةٍ ۚ وَهُوَ عَلىٰ جَمعِهِم إِذا يَشاءُ قَديرٌ"
    },
    {
      "index": "30",
      "text": "وَما أَصابَكُم مِن مُصيبَةٍ فَبِما كَسَبَت أَيديكُم وَيَعفو عَن كَثيرٍ"
    },
    {
      "index": "31",
      "text": "وَما أَنتُم بِمُعجِزينَ فِي الأَرضِ ۖ وَما لَكُم مِن دونِ اللَّهِ مِن وَلِيٍّ وَلا نَصيرٍ"
    },
    {
      "index": "32",
      "text": "وَمِن آياتِهِ الجَوارِ فِي البَحرِ كَالأَعلامِ"
    },
    {
      "index": "33",
      "text": "إِن يَشَأ يُسكِنِ الرّيحَ فَيَظلَلنَ رَواكِدَ عَلىٰ ظَهرِهِ ۚ إِنَّ في ذٰلِكَ لَآياتٍ لِكُلِّ صَبّارٍ شَكورٍ"
    },
    {
      "index": "34",
      "text": "أَو يوبِقهُنَّ بِما كَسَبوا وَيَعفُ عَن كَثيرٍ"
    },
    {
      "index": "35",
      "text": "وَيَعلَمَ الَّذينَ يُجادِلونَ في آياتِنا ما لَهُم مِن مَحيصٍ"
    },
    {
      "index": "36",
      "text": "فَما أوتيتُم مِن شَيءٍ فَمَتاعُ الحَياةِ الدُّنيا ۖ وَما عِندَ اللَّهِ خَيرٌ وَأَبقىٰ لِلَّذينَ آمَنوا وَعَلىٰ رَبِّهِم يَتَوَكَّلونَ"
    },
    {
      "index": "37",
      "text": "وَالَّذينَ يَجتَنِبونَ كَبائِرَ الإِثمِ وَالفَواحِشَ وَإِذا ما غَضِبوا هُم يَغفِرونَ"
    },
    {
      "index": "38",
      "text": "وَالَّذينَ استَجابوا لِرَبِّهِم وَأَقامُوا الصَّلاةَ وَأَمرُهُم شورىٰ بَينَهُم وَمِمّا رَزَقناهُم يُنفِقونَ"
    },
    {
      "index": "39",
      "text": "وَالَّذينَ إِذا أَصابَهُمُ البَغيُ هُم يَنتَصِرونَ"
    },
    {
      "index": "40",
      "text": "وَجَزاءُ سَيِّئَةٍ سَيِّئَةٌ مِثلُها ۖ فَمَن عَفا وَأَصلَحَ فَأَجرُهُ عَلَى اللَّهِ ۚ إِنَّهُ لا يُحِبُّ الظّالِمينَ"
    },
    {
      "index": "41",
      "text": "وَلَمَنِ انتَصَرَ بَعدَ ظُلمِهِ فَأُولـٰئِكَ ما عَلَيهِم مِن سَبيلٍ"
    },
    {
      "index": "42",
      "text": "إِنَّمَا السَّبيلُ عَلَى الَّذينَ يَظلِمونَ النّاسَ وَيَبغونَ فِي الأَرضِ بِغَيرِ الحَقِّ ۚ أُولـٰئِكَ لَهُم عَذابٌ أَليمٌ"
    },
    {
      "index": "43",
      "text": "وَلَمَن صَبَرَ وَغَفَرَ إِنَّ ذٰلِكَ لَمِن عَزمِ الأُمورِ"
    },
    {
      "index": "44",
      "text": "وَمَن يُضلِلِ اللَّهُ فَما لَهُ مِن وَلِيٍّ مِن بَعدِهِ ۗ وَتَرَى الظّالِمينَ لَمّا رَأَوُا العَذابَ يَقولونَ هَل إِلىٰ مَرَدٍّ مِن سَبيلٍ"
    },
    {
      "index": "45",
      "text": "وَتَراهُم يُعرَضونَ عَلَيها خاشِعينَ مِنَ الذُّلِّ يَنظُرونَ مِن طَرفٍ خَفِيٍّ ۗ وَقالَ الَّذينَ آمَنوا إِنَّ الخاسِرينَ الَّذينَ خَسِروا أَنفُسَهُم وَأَهليهِم يَومَ القِيامَةِ ۗ أَلا إِنَّ الظّالِمينَ في عَذابٍ مُقيمٍ"
    },
    {
      "index": "46",
      "text": "وَما كانَ لَهُم مِن أَولِياءَ يَنصُرونَهُم مِن دونِ اللَّهِ ۗ وَمَن يُضلِلِ اللَّهُ فَما لَهُ مِن سَبيلٍ"
    },
    {
      "index": "47",
      "text": "استَجيبوا لِرَبِّكُم مِن قَبلِ أَن يَأتِيَ يَومٌ لا مَرَدَّ لَهُ مِنَ اللَّهِ ۚ ما لَكُم مِن مَلجَإٍ يَومَئِذٍ وَما لَكُم مِن نَكيرٍ"
    },
    {
      "index": "48",
      "text": "فَإِن أَعرَضوا فَما أَرسَلناكَ عَلَيهِم حَفيظًا ۖ إِن عَلَيكَ إِلَّا البَلاغُ ۗ وَإِنّا إِذا أَذَقنَا الإِنسانَ مِنّا رَحمَةً فَرِحَ بِها ۖ وَإِن تُصِبهُم سَيِّئَةٌ بِما قَدَّمَت أَيديهِم فَإِنَّ الإِنسانَ كَفورٌ"
    },
    {
      "index": "49",
      "text": "لِلَّهِ مُلكُ السَّماواتِ وَالأَرضِ ۚ يَخلُقُ ما يَشاءُ ۚ يَهَبُ لِمَن يَشاءُ إِناثًا وَيَهَبُ لِمَن يَشاءُ الذُّكورَ"
    },
    {
      "index": "50",
      "text": "أَو يُزَوِّجُهُم ذُكرانًا وَإِناثًا ۖ وَيَجعَلُ مَن يَشاءُ عَقيمًا ۚ إِنَّهُ عَليمٌ قَديرٌ"
    },
    {
      "index": "51",
      "text": "۞ وَما كانَ لِبَشَرٍ أَن يُكَلِّمَهُ اللَّهُ إِلّا وَحيًا أَو مِن وَراءِ حِجابٍ أَو يُرسِلَ رَسولًا فَيوحِيَ بِإِذنِهِ ما يَشاءُ ۚ إِنَّهُ عَلِيٌّ حَكيمٌ"
    },
    {
      "index": "52",
      "text": "وَكَذٰلِكَ أَوحَينا إِلَيكَ روحًا مِن أَمرِنا ۚ ما كُنتَ تَدري مَا الكِتابُ وَلَا الإيمانُ وَلـٰكِن جَعَلناهُ نورًا نَهدي بِهِ مَن نَشاءُ مِن عِبادِنا ۚ وَإِنَّكَ لَتَهدي إِلىٰ صِراطٍ مُستَقيمٍ"
    },
    {
      "index": "53",
      "text": "صِراطِ اللَّهِ الَّذي لَهُ ما فِي السَّماواتِ وَما فِي الأَرضِ ۗ أَلا إِلَى اللَّهِ تَصيرُ الأُمورُ"
    }
  ],
  "index": "42",
  "name": "الشورى",
  "copyright": "# PLEASE DO NOT REMOVE OR CHANGE THIS COPYRIGHT BLOCK \n#==================================================================== \n#\n#  Tanzil Quran Text (Simple Minimal, Version 1.1)\n#  Copyright (C) 2007-2022 Tanzil Project\n#  License: Creative Commons Attribution 3.0\n#\n#  This copy of the Quran text is carefully produced, highly \n#  verified and continuously monitored by a group of specialists \n#  at Tanzil Project.\n#\n#  TERMS OF USE:\n#\n#  - Permission is granted to copy and distribute verbatim copies \n#    of this text, but CHANGING IT IS NOT ALLOWED.\n#\n#  - This Quran text can be used in any website or application, \n#    provided that its source (Tanzil Project) is clearly indicated, \n#    and a link is made to tanzil.net to enable users to keep\n#    track of changes.\n#\n#  - This copyright notice shall be included in all verbatim copies \n#    of the text, and shall be reproduced appropriately in all files \n#    derived from or containing substantial portion of this text.\n#\n#  Please check updates at: http://tanzil.net/updates/\n#\n#====================================================================\n",
  "type": "simple-min",
  "version": "1.1"
}