{
  "aya": [
    {
      "index": "1",
      "text": "يا أَيُّهَا النّاسُ اتَّقوا رَبَّكُمُ الَّذي خَلَقَكُم مِن نَفسٍ واحِدَةٍ وَخَلَقَ مِنها زَوجَها وَبَثَّ مِنهُما رِجالًا كَثيرًا وَنِساءً ۚ وَاتَّقُوا اللَّهَ الَّذي تَساءَلونَ بِهِ وَالأَرحامَ ۚ إِنَّ اللَّهَ كانَ عَلَيكُم رَقيبًا",
      "bismillah": "بِسمِ اللَّهِ الرَّحمـٰنِ الرَّحيمِ"
    },
    {
      "index": "2",
      "text": "وَآتُوا اليَتامىٰ أَموالَهُم ۖ وَلا تَتَبَدَّلُوا الخَبيثَ بِالطَّيِّبِ ۖ وَلا تَأكُلوا أَموالَهُم إِلىٰ أَموالِكُم ۚ إِنَّهُ كانَ حوبًا كَبيرًا"
    },
    {
      "index": "3",
      "text": "وَإِن خِفتُم أَلّا تُقسِطوا فِي اليَتامىٰ فَانكِحوا ما طابَ لَكُم مِنَ النِّساءِ مَثنىٰ وَثُلاثَ وَرُباعَ ۖ فَإِن خِفتُم أَلّا تَعدِلوا فَواحِدَةً أَو ما مَلَكَت أَيمانُكُم ۚ ذٰلِكَ أَدنىٰ أَلّا تَعولوا"
    },
    {
      "index": "4",
      "text": "وَآتُوا النِّساءَ صَدُقاتِهِنَّ نِحلَةً ۚ فَإِن طِبنَ لَكُم عَن شَيءٍ مِنهُ نَفسًا فَكُلوهُ هَنيئًا مَريئًا"
    },
    {
      "index": "5",
      "text": "وَلا تُؤتُوا السُّفَهاءَ أَموالَكُمُ الَّتي جَعَلَ اللَّهُ لَكُم قِيامًا وَارزُقوهُم فيها وَاكسوهُم وَقولوا لَهُم قَولًا مَعروفًا"
    },
    {
      "index": "6",
      "text": "وَابتَلُوا اليَتامىٰ حَتّىٰ إِذا بَلَغُوا النِّكاحَ فَإِن آنَستُم مِنهُم رُشدًا فَادفَعوا إِلَيهِم أَموالَهُم ۖ وَلا تَأكُلوها إِسرافًا وَبِدارًا أَن يَكبَروا ۚ وَمَن كانَ غَنِيًّا فَليَستَعفِف ۖ وَمَن كانَ فَقيرًا فَليَأكُل بِالمَعروفِ ۚ فَإِذا دَفَعتُم إِلَيهِم أَموالَهُم فَأَشهِدوا عَلَيهِم ۚ وَكَفىٰ بِاللَّهِ حَسيبًا"
    },
    {
      "index": "7",
      "text": "لِلرِّجالِ نَصيبٌ مِمّا تَرَكَ الوالِدانِ وَالأَقرَبونَ وَلِلنِّساءِ نَصيبٌ مِمّا تَرَكَ الوالِدانِ وَالأَقرَبونَ مِمّا قَلَّ مِنهُ أَو كَثُرَ ۚ نَصيبًا مَفروضًا"
    },
    {
      "index": "8",
      "text": "وَإِذا حَضَرَ القِسمَةَ أُولُو القُربىٰ وَاليَتامىٰ وَالمَساكينُ فَارزُقوهُم مِنهُ وَقولوا لَهُم قَولًا مَعروفًا"
    },
    {
      "index": "9",
      "text": "وَليَخشَ الَّذينَ لَو تَرَكوا مِن خَلفِهِم ذُرِّيَّةً ضِعافًا خافوا عَلَيهِم فَليَتَّقُوا اللَّهَ وَليَقولوا قَولًا سَديدًا"
    },
    {
      "index": "10",
      "text": "إِنَّ الَّذينَ يَأكُلونَ أَموالَ اليَتامىٰ ظُلمًا إِنَّما يَأكُلونَ في بُطونِهِم نارًا ۖ وَسَيَصلَونَ سَعيرًا"
    },
    {
      "index": "11",
      "text": "يوصيكُمُ اللَّهُ في أَولادِكُم ۖ لِلذَّكَرِ مِثلُ حَظِّ الأُنثَيَينِ ۚ فَإِن كُنَّ نِساءً فَوقَ اثنَتَينِ فَلَهُنَّ ثُلُثا ما تَرَكَ ۖ وَإِن كانَت واحِدَةً فَلَهَا النِّصفُ ۚ وَلِأَبَوَيهِ لِكُلِّ واحِدٍ مِنهُمَا السُّدُسُ مِمّا تَرَكَ إِن كانَ لَهُ وَلَدٌ ۚ فَإِن لَم يَكُن لَهُ وَلَدٌ وَوَرِثَهُ أَبَواهُ فَلِأُمِّهِ الثُّلُثُ ۚ فَإِن كانَ لَهُ إِخوَةٌ فَلِأُمِّهِ السُّدُسُ ۚ مِن بَعدِ وَصِيَّةٍ يوصي بِها أَو دَينٍ ۗ آباؤُكُم وَأَبناؤُكُم لا تَدرونَ أَيُّهُم أَقرَبُ لَكُم نَفعًا ۚ فَريضَةً مِنَ اللَّهِ ۗ إِنَّ اللَّهَ كانَ عَليمًا حَكيمًا"
    },
    {
      "index": "12",
      "text": "۞ وَلَكُم نِصفُ ما تَرَكَ أَزواجُكُم إِن لَم يَكُن لَهُنَّ وَلَدٌ ۚ فَإِن كانَ لَهُنَّ وَلَدٌ فَلَكُمُ الرُّبُعُ مِمّا تَرَكنَ ۚ مِن بَعدِ وَصِيَّةٍ يوصينَ بِها أَو دَينٍ ۚ وَلَهُنَّ الرُّبُعُ مِمّا تَرَكتُم إِن لَم يَكُن لَكُم وَلَدٌ ۚ فَإِن كانَ لَكُم وَلَدٌ فَلَهُنَّ الثُّمُنُ مِمّا تَرَكتُم ۚ مِن بَعدِ وَصِيَّةٍ توصونَ بِها أَو دَينٍ ۗ وَإِن كانَ رَجُلٌ يورَثُ كَلالَةً أَوِ امرَأَةٌ وَلَهُ أَخٌ أَو أُختٌ فَلِكُلِّ واحِدٍ مِنهُمَا السُّدُسُ ۚ فَإِن كانوا أَكثَرَ مِن ذٰلِكَ فَهُم شُرَكاءُ فِي الثُّلُثِ ۚ مِن بَعدِ وَصِيَّةٍ يوصىٰ بِها أَو دَينٍ غَيرَ مُضارٍّ ۚ وَصِيَّةً مِنَ اللَّهِ ۗ وَاللَّهُ عَليمٌ حَليمٌ"
    },
    {
      "index": "13",
      "text": "تِلكَ حُدودُ اللَّهِ ۚ وَمَن يُطِعِ اللَّهَ وَرَسولَهُ يُدخِلهُ جَنّاتٍ تَجري مِن تَحتِهَا الأَنهارُ خالِدينَ فيها ۚ وَذٰلِكَ الفَوزُ العَظيمُ"
    },
    {
      "index": "14",
      "text": "وَمَن يَعصِ اللَّهَ وَرَسولَهُ وَيَتَعَدَّ حُدودَهُ يُدخِلهُ نارًا خالِدًا فيها وَلَهُ عَذابٌ مُهينٌ"
    },
    {
      "index": "15",
      "text": "وَاللّاتي يَأتينَ الفاحِشَةَ مِن نِسائِكُم فَاستَشهِدوا عَلَيهِنَّ أَربَعَةً مِنكُم ۖ فَإِن شَهِدوا فَأَمسِكوهُنَّ فِي البُيوتِ حَتّىٰ يَتَوَفّاهُنَّ المَوتُ أَو يَجعَلَ اللَّهُ لَهُنَّ سَبيلًا"
    },
    {
      "index": "16",
      "text": "وَاللَّذانِ يَأتِيانِها مِنكُم فَآذوهُما ۖ فَإِن تابا وَأَصلَحا فَأَعرِضوا عَنهُما ۗ إِنَّ اللَّهَ كانَ تَوّابًا رَحيمًا"
    },
    {
      "index": "17",
      "text": "إِنَّمَا التَّوبَةُ عَلَى اللَّهِ لِلَّذينَ يَعمَلونَ السّوءَ بِجَهالَةٍ ثُمَّ يَتوبونَ مِن قَريبٍ فَأُولـٰئِكَ يَتوبُ اللَّهُ عَلَيهِم ۗ وَكانَ اللَّهُ عَليمًا حَكيمًا"
    },
    {
      "index": "18",
      "text": "وَلَيسَتِ التَّوبَةُ لِلَّذينَ يَعمَلونَ السَّيِّئَاتِ حَتّىٰ إِذا حَضَرَ أَحَدَهُمُ المَوتُ قالَ إِنّي تُبتُ الآنَ وَلَا الَّذينَ يَموتونَ وَهُم كُفّارٌ ۚ أُولـٰئِكَ أَعتَدنا لَهُم عَذابًا أَليمًا"
    },
    {
      "index": "19",
      "text": "يا أَيُّهَا الَّذينَ آمَنوا لا يَحِلُّ لَكُم أَن تَرِثُوا النِّساءَ كَرهًا ۖ وَلا تَعضُلوهُنَّ لِتَذهَبوا بِبَعضِ ما آتَيتُموهُنَّ إِلّا أَن يَأتينَ بِفاحِشَةٍ مُبَيِّنَةٍ ۚ وَعاشِروهُنَّ بِالمَعروفِ ۚ فَإِن كَرِهتُموهُنَّ فَعَسىٰ أَن تَكرَهوا شَيئًا وَيَجعَلَ اللَّهُ فيهِ خَيرًا كَثيرًا"
    },
    {
      "index": "20",
      "text": "وَإِن أَرَدتُمُ استِبدالَ زَوجٍ مَكانَ زَوجٍ وَآتَيتُم إِحداهُنَّ قِنطارًا فَلا تَأخُذوا مِنهُ شَيئًا ۚ أَتَأخُذونَهُ بُهتانًا وَإِثمًا مُبينًا"
    },
    {
      "index": "21",
      "text": "وَكَيفَ تَأخُذونَهُ وَقَد أَفضىٰ بَعضُكُم إِلىٰ بَعضٍ وَأَخَذنَ مِنكُم ميثاقًا غَليظًا"
    },
    {
      "index": "22",
      "text": "وَلا تَنكِحوا ما نَكَحَ آباؤُكُم مِنَ النِّساءِ إِلّا ما قَد سَلَفَ ۚ إِنَّهُ كانَ فاحِشَةً وَمَقتًا وَساءَ سَبيلًا"
    },
    {
      "index": "23",
      "text": "حُرِّمَت عَلَيكُم أُمَّهاتُكُم وَبَناتُكُم وَأَخَواتُكُم وَعَمّاتُكُم وَخالاتُكُم وَبَناتُ الأَخِ وَبَناتُ الأُختِ وَأُمَّهاتُكُمُ اللّاتي أَرضَعنَكُم وَأَخَواتُكُم مِنَ الرَّضاعَةِ وَأُمَّهاتُ نِسائِكُم وَرَبائِبُكُمُ اللّاتي في حُجورِكُم مِن نِسائِكُمُ اللّاتي دَخَلتُم بِهِنَّ فَإِن لَم تَكونوا دَخَلتُم بِهِنَّ فَلا جُناحَ عَلَيكُم وَحَلائِلُ أَبنائِكُمُ الَّذينَ مِن أَصلابِكُم وَأَن تَجمَعوا بَينَ الأُختَينِ إِلّا ما قَد سَلَفَ ۗ إِنَّ اللَّهَ كانَ غَفورًا رَحيمًا"
    },
    {
      "index": "24",
      "text": "۞ وَالمُحصَناتُ مِنَ النِّساءِ إِلّا ما مَلَكَت أَيمانُكُم ۖ كِتابَ اللَّهِ عَلَيكُم ۚ وَأُحِلَّ لَكُم ما وَراءَ ذٰلِكُم أَن تَبتَغوا بِأَموالِكُم مُحصِنينَ غَيرَ مُسافِحينَ ۚ فَمَا استَمتَعتُم بِهِ مِنهُنَّ فَآتوهُنَّ أُجورَهُنَّ فَريضَةً ۚ وَلا جُناحَ عَلَيكُم فيما تَراضَيتُم بِهِ مِن بَعدِ الفَريضَةِ ۚ إِنَّ اللَّهَ كانَ عَليمًا حَكيمًا"
    },
    {
      "index": "25",
      "text": "وَمَن لَم يَستَطِع مِنكُم طَولًا أَن يَنكِحَ المُحصَناتِ المُؤمِناتِ فَمِن ما مَلَكَت أَيمانُكُم مِن فَتَياتِكُمُ المُؤمِناتِ ۚ وَاللَّهُ أَعلَمُ بِإيمانِكُم ۚ بَعضُكُم مِن بَعضٍ ۚ فَانكِحوهُنَّ بِإِذنِ أَهلِهِنَّ وَآتوهُنَّ أُجورَهُنَّ بِالمَعروفِ مُحصَناتٍ غَيرَ مُسافِحاتٍ وَلا مُتَّخِذاتِ أَخدانٍ ۚ فَإِذا أُحصِنَّ فَإِن أَتَينَ بِفاحِشَةٍ فَعَلَيهِنَّ نِصفُ ما عَلَى المُحصَناتِ مِنَ العَذابِ ۚ ذٰلِكَ لِمَن خَشِيَ العَنَتَ مِنكُم ۚ وَأَن تَصبِروا خَيرٌ لَكُم ۗ وَاللَّهُ غَفورٌ رَحيمٌ"
    },
    {
      "index": "26",
      "text": "يُريدُ اللَّهُ لِيُبَيِّنَ لَكُم وَيَهدِيَكُم سُنَنَ الَّذينَ مِن قَبلِكُم وَيَتوبَ عَلَيكُم ۗ وَاللَّهُ عَليمٌ حَكيمٌ"
    },
    {
      "index": "27",
      "text": "وَاللَّهُ يُريدُ أَن يَتوبَ عَلَيكُم وَيُريدُ الَّذينَ يَتَّبِعونَ الشَّهَواتِ أَن تَميلوا مَيلًا عَظيمًا"
    },
    {
      "index": "28",
      "text": "يُريدُ اللَّهُ أَن يُخَفِّفَ عَنكُم ۚ وَخُلِقَ الإِنسانُ ضَعيفًا"
    },
    {
      "index": "29",
      "text": "يا أَيُّهَا الَّذينَ آمَنوا لا تَأكُلوا أَموالَكُم بَينَكُم بِالباطِلِ إِلّا أَن تَكونَ تِجارَةً عَن تَراضٍ مِنكُم ۚ وَلا تَقتُلوا أَنفُسَكُم ۚ إِنَّ اللَّهَ كانَ بِكُم رَحيمًا"
    },
    {
      "index": "30",
      "text": "وَمَن يَفعَل ذٰلِكَ عُدوانًا وَظُلمًا فَسَوفَ نُصليهِ نارًا ۚ وَكانَ ذٰلِكَ عَلَى اللَّهِ يَسيرًا"
    },
    {
      "index": "31",
      "text": "إِن تَجتَنِبوا كَبائِرَ ما تُنهَونَ عَنهُ نُكَفِّر عَنكُم سَيِّئَاتِكُم وَنُدخِلكُم مُدخَلًا كَريمًا"
    },
    {
      "index": "32",
      "text": "وَلا تَتَمَنَّوا ما فَضَّلَ اللَّهُ بِهِ بَعضَكُم عَلىٰ بَعضٍ ۚ لِلرِّجالِ نَصيبٌ مِمَّا اكتَسَبوا ۖ وَلِلنِّساءِ نَصيبٌ مِمَّا اكتَسَبنَ ۚ وَاسأَلُوا اللَّهَ مِن فَضلِهِ ۗ إِنَّ اللَّهَ كانَ بِكُلِّ شَيءٍ عَليمًا"
    },
    {
      "index": "33",
      "text": "وَلِكُلٍّ جَعَلنا مَوالِيَ مِمّا تَرَكَ الوالِدانِ وَالأَقرَبونَ ۚ وَالَّذينَ عَقَدَت أَيمانُكُم فَآتوهُم نَصيبَهُم ۚ إِنَّ اللَّهَ كانَ عَلىٰ كُلِّ شَيءٍ شَهيدًا"
    },
    {
      "index": "34",
      "text": "الرِّجالُ قَوّامونَ عَلَى النِّساءِ بِما فَضَّلَ اللَّهُ بَعضَهُم عَلىٰ بَعضٍ وَبِما أَنفَقوا مِن أَموالِهِم ۚ فَالصّالِحاتُ قانِتاتٌ حافِظاتٌ لِلغَيبِ بِما حَفِظَ اللَّهُ ۚ وَاللّاتي تَخافونَ نُشوزَهُنَّ فَعِظوهُنَّ وَاهجُروهُنَّ فِي المَضاجِعِ وَاضرِبوهُنَّ ۖ فَإِن أَطَعنَكُم فَلا تَبغوا عَلَيهِنَّ سَبيلًا ۗ إِنَّ اللَّهَ كانَ عَلِيًّا كَبيرًا"
    },
    {
      "index": "35",
      "text": "وَإِن خِفتُم شِقاقَ بَينِهِما فَابعَثوا حَكَمًا مِن أَهلِهِ وَحَكَمًا مِن أَهلِها إِن يُريدا إِصلاحًا يُوَفِّقِ اللَّهُ بَينَهُما ۗ إِنَّ اللَّهَ كانَ عَليمًا خَبيرًا"
    },
    {
      "index": "36",
      "text": "۞ وَاعبُدُوا اللَّهَ وَلا تُشرِكوا بِهِ شَيئًا ۖ وَبِالوالِدَينِ إِحسانًا وَبِذِي القُربىٰ وَاليَتامىٰ وَالمَساكينِ وَالجارِ ذِي القُربىٰ وَالجارِ الجُنُبِ وَالصّاحِبِ بِالجَنبِ وَابنِ السَّبيلِ وَما مَلَكَت أَيمانُكُم ۗ إِنَّ اللَّهَ لا يُحِبُّ مَن كانَ مُختالًا فَخورًا"
    },
    {
      "index": "37",
      "text": "الَّذينَ يَبخَلونَ وَيَأمُرونَ النّاسَ بِالبُخلِ وَيَكتُمونَ ما آتاهُمُ اللَّهُ مِن فَضلِهِ ۗ وَأَعتَدنا لِلكافِرينَ عَذابًا مُهينًا"
    },
    {
      "index": "38",
      "text": "وَالَّذينَ يُنفِقونَ أَموالَهُم رِئَاءَ النّاسِ وَلا يُؤمِنونَ بِاللَّهِ وَلا بِاليَومِ الآخِرِ ۗ وَمَن يَكُنِ الشَّيطانُ لَهُ قَرينًا فَساءَ قَرينًا"
    },
    {
      "index": "39",
      "text": "وَماذا عَلَيهِم لَو آمَنوا بِاللَّهِ وَاليَومِ الآخِرِ وَأَنفَقوا مِمّا رَزَقَهُمُ اللَّهُ ۚ وَكانَ اللَّهُ بِهِم عَليمًا"
    },
    {
      "index": "40",
      "text": "إِنَّ اللَّهَ لا يَظلِمُ مِثقالَ ذَرَّةٍ ۖ وَإِن تَكُ حَسَنَةً يُضاعِفها وَيُؤتِ مِن لَدُنهُ أَجرًا عَظيمًا"
    },
    {
      "index": "41",
      "text": "فَكَيفَ إِذا جِئنا مِن كُلِّ أُمَّةٍ بِشَهيدٍ وَجِئنا بِكَ عَلىٰ هـٰؤُلاءِ شَهيدًا"
    },
    {
      "index": "42",
      "text": "يَومَئِذٍ يَوَدُّ الَّذينَ كَفَروا وَعَصَوُا الرَّسولَ لَو تُسَوّىٰ بِهِمُ الأَرضُ وَلا يَكتُمونَ اللَّهَ حَديثًا"
    },
    {
      "index": "43",
      "text": "يا أَيُّهَا الَّذينَ آمَنوا لا تَقرَبُوا الصَّلاةَ وَأَنتُم سُكارىٰ حَتّىٰ تَعلَموا ما تَقولونَ وَلا جُنُبًا إِلّا عابِري سَبيلٍ حَتّىٰ تَغتَسِلوا ۚ وَإِن كُنتُم مَرضىٰ أَو عَلىٰ سَفَرٍ أَو جاءَ أَحَدٌ مِنكُم مِنَ الغائِطِ أَو لامَستُمُ النِّساءَ فَلَم تَجِدوا ماءً فَتَيَمَّموا صَعيدًا طَيِّبًا فَامسَحوا بِوُجوهِكُم وَأَيديكُم ۗ إِنَّ اللَّهَ كانَ عَفُوًّا غَفورًا"
    },
    {
      "index": "44",
      "text": "أَلَم تَرَ إِلَى الَّذينَ أوتوا نَصيبًا مِنَ الكِتابِ يَشتَرونَ الضَّلالَةَ وَيُريدونَ أَن تَضِلُّوا السَّبيلَ"
    },
    {
      "index": "45",
      "text": "وَاللَّهُ أَعلَمُ بِأَعدائِكُم ۚ وَكَفىٰ بِاللَّهِ وَلِيًّا وَكَفىٰ بِاللَّهِ نَصيرًا"
    },
    {
      "index": "46",
      "text": "مِنَ الَّذينَ هادوا يُحَرِّفونَ الكَلِمَ عَن مَواضِعِهِ وَيَقولونَ سَمِعنا وَعَصَينا وَاسمَع غَيرَ مُسمَعٍ وَراعِنا لَيًّا بِأَلسِنَتِهِم وَطَعنًا فِي الدّينِ ۚ وَلَو أَنَّهُم قالوا سَمِعنا وَأَطَعنا وَاسمَع وَانظُرنا لَكانَ خَيرًا لَهُم وَأَقوَمَ وَلـٰكِن لَعَنَهُمُ اللَّهُ بِكُفرِهِم فَلا يُؤمِنونَ إِلّا قَليلًا"
    },
    {
      "index": "47",
      "text": "يا أَيُّهَا الَّذينَ أوتُوا الكِتابَ آمِنوا بِما نَزَّلنا مُصَدِّقًا لِما مَعَكُم مِن قَبلِ أَن نَطمِسَ وُجوهًا فَنَرُدَّها عَلىٰ أَدبارِها أَو نَلعَنَهُم كَما لَعَنّا أَصحابَ السَّبتِ ۚ وَكانَ أَمرُ اللَّهِ مَفعولًا"
    },
    {
      "index": "48",
      "text": "إِنَّ اللَّهَ لا يَغفِرُ أَن يُشرَكَ بِهِ وَيَغفِرُ ما دونَ ذٰلِكَ لِمَن يَشاءُ ۚ وَمَن يُشرِك بِاللَّهِ فَقَدِ افتَرىٰ إِثمًا عَظيمًا"
    },
    {
      "index": "49",
      "text": "أَلَم تَرَ إِلَى الَّذينَ يُزَكّونَ أَنفُسَهُم ۚ بَلِ اللَّهُ يُزَكّي مَن يَشاءُ وَلا يُظلَمونَ فَتيلًا"
    },
    {
      "index": "50",
      "text": "انظُر كَيفَ يَفتَرونَ عَلَى اللَّهِ الكَذِبَ ۖ وَكَفىٰ بِهِ إِثمًا مُبينًا"
    },
    {
      "index": "51",
      "text": "أَلَم تَرَ إِلَى الَّذينَ أوتوا نَصيبًا مِنَ الكِتابِ يُؤمِنونَ بِالجِبتِ وَالطّاغوتِ وَيَقولونَ لِلَّذينَ كَفَروا هـٰؤُلاءِ أَهدىٰ مِنَ الَّذينَ آمَنوا سَبيلًا"
    },
    {
      "index": "52",
      "text": "أُولـٰئِكَ الَّذينَ لَعَنَهُمُ اللَّهُ ۖ وَمَن يَلعَنِ اللَّهُ فَلَن تَجِدَ لَهُ نَصيرًا"
    },
    {
      "index": "53",
      "text": "أَم لَهُم نَصيبٌ مِنَ المُلكِ فَإِذًا لا يُؤتونَ النّاسَ نَقيرًا"
    },
    {
      "index": "54",
      "text": "أَم يَحسُدونَ النّاسَ عَلىٰ ما آتاهُمُ اللَّهُ مِن فَضلِهِ ۖ فَقَد آتَينا آلَ إِبراهيمَ الكِتابَ وَالحِكمَةَ وَآتَيناهُم مُلكًا عَظيمًا"
    },
    {
      "index": "55",
      "text": "فَمِنهُم مَن آمَنَ بِهِ وَمِنهُم مَن صَدَّ عَنهُ ۚ وَكَفىٰ بِجَهَنَّمَ سَعيرًا"
    },
    {
      "index": "56",
      "text": "إِنَّ الَّذينَ كَفَروا بِآياتِنا سَوفَ نُصليهِم نارًا كُلَّما نَضِجَت جُلودُهُم بَدَّلناهُم جُلودًا غَيرَها لِيَذوقُوا العَذابَ ۗ إِنَّ اللَّهَ كانَ عَزيزًا حَكيمًا"
    },
    {
      "index": "57",
      "text": "وَالَّذينَ آمَنوا وَعَمِلُوا الصّالِحاتِ سَنُدخِلُهُم جَنّاتٍ تَجري مِن تَحتِهَا الأَنهارُ خالِدينَ فيها أَبَدًا ۖ لَهُم فيها أَزواجٌ مُطَهَّرَةٌ ۖ وَنُدخِلُهُم ظِلًّا ظَليلًا"
    },
    {
      "index": "58",
      "text": "۞ إِنَّ اللَّهَ يَأمُرُكُم أَن تُؤَدُّوا الأَماناتِ إِلىٰ أَهلِها وَإِذا حَكَمتُم بَينَ النّاسِ أَن تَحكُموا بِالعَدلِ ۚ إِنَّ اللَّهَ نِعِمّا يَعِظُكُم بِهِ ۗ إِنَّ اللَّهَ كانَ سَميعًا بَصيرًا"
    },
    {
      "index": "59",
      "text": "يا أَيُّهَا الَّذينَ آمَنوا أَطيعُوا اللَّهَ وَأَطيعُوا الرَّسولَ وَأُولِي الأَمرِ مِنكُم ۖ فَإِن تَنازَعتُم في شَيءٍ فَرُدّوهُ إِلَى اللَّهِ وَالرَّسولِ إِن كُنتُم تُؤمِنونَ بِاللَّهِ وَاليَومِ الآخِرِ ۚ ذٰلِكَ خَيرٌ وَأَحسَنُ تَأويلًا"
    },
    {
      "index": "60",
      "text": "أَلَم تَرَ إِلَى الَّذينَ يَزعُمونَ أَنَّهُم آمَنوا بِما أُنزِلَ إِلَيكَ وَما أُنزِلَ مِن قَبلِكَ يُريدونَ أَن يَتَحاكَموا إِلَى الطّاغوتِ وَقَد أُمِروا أَن يَكفُروا بِهِ وَيُريدُ الشَّيطانُ أَن يُضِلَّهُم ضَلالًا بَعيدًا"
    },
    {
      "index": "61",
      "text": "وَإِذا قيلَ لَهُم تَعالَوا إِلىٰ ما أَنزَلَ اللَّهُ وَإِلَى الرَّسولِ رَأَيتَ المُنافِقينَ يَصُدّونَ عَنكَ صُدودًا"
    },
    {
      "index": "62",
      "text": "فَكَيفَ إِذا أَصابَتهُم مُصيبَةٌ بِما قَدَّمَت أَيديهِم ثُمَّ جاءوكَ يَحلِفونَ بِاللَّهِ إِن أَرَدنا إِلّا إِحسانًا وَتَوفيقًا"
    },
    {
      "index": "63",
      "text": "أُولـٰئِكَ الَّذينَ يَعلَمُ اللَّهُ ما في قُلوبِهِم فَأَعرِض عَنهُم وَعِظهُم وَقُل لَهُم في أَنفُسِهِم قَولًا بَليغًا"
    },
    {
      "index": "64",
      "text": "وَما أَرسَلنا مِن رَسولٍ إِلّا لِيُطاعَ بِإِذنِ اللَّهِ ۚ وَلَو أَنَّهُم إِذ ظَلَموا أَنفُسَهُم جاءوكَ فَاستَغفَرُوا اللَّهَ وَاستَغفَرَ لَهُمُ الرَّسولُ لَوَجَدُوا اللَّهَ تَوّابًا رَحيمًا"
    },
    {
      "index": "65",
      "text": "فَلا وَرَبِّكَ لا يُؤمِنونَ حَتّىٰ يُحَكِّموكَ فيما شَجَرَ بَينَهُم ثُمَّ لا يَجِدوا في أَنفُسِهِم حَرَجًا مِمّا قَضَيتَ وَيُسَلِّموا تَسليمًا"
    },
    {
      "index": "66",
      "text": "وَلَو أَنّا كَتَبنا عَلَيهِم أَنِ اقتُلوا أَنفُسَكُم أَوِ اخرُجوا مِن دِيارِكُم ما فَعَلوهُ إِلّا قَليلٌ مِنهُم ۖ وَلَو أَنَّهُم فَعَلوا ما يوعَظونَ بِهِ لَكانَ خَيرًا لَهُم وَأَشَدَّ تَثبيتًا"
    },
    {
      "index": "67",
      "text": "وَإِذًا لَآتَيناهُم مِن لَدُنّا أَجرًا عَظيمًا"
    },
    {
      "index": "68",
      "text": "وَلَهَدَيناهُم صِراطًا مُستَقيمًا"
    },
    {
      "index": "69",
      "text": "وَمَن يُطِعِ اللَّهَ وَالرَّسولَ فَأُولـٰئِكَ مَعَ الَّذينَ أَنعَمَ اللَّهُ عَلَيهِم مِنَ النَّبِيّينَ وَالصِّدّيقينَ وَالشُّهَداءِ وَالصّالِحينَ ۚ وَحَسُنَ أُولـٰئِكَ رَفيقًا"
    },
    {
      "index": "70",
      "text": "ذٰلِكَ الفَضلُ مِنَ اللَّهِ ۚ وَكَفىٰ بِاللَّهِ عَليمًا"
    },
    {
      "index": "71",
      "text": "يا أَيُّهَا الَّذينَ آمَنوا خُذوا حِذرَكُم فَانفِروا ثُباتٍ أَوِ انفِروا جَميعًا"
    },
    {
      "index": "72",
      "text": "وَإِنَّ مِنكُم لَمَن لَيُبَطِّئَنَّ فَإِن أَصابَتكُم مُصيبَةٌ قالَ قَد أَنعَمَ اللَّهُ عَلَيَّ إِذ لَم أَكُن مَعَهُم شَهيدًا"
    },
    {
      "index": "73",
      "text": "وَلَئِن أَصابَكُم فَضلٌ مِنَ اللَّهِ لَيَقولَنَّ كَأَن لَم تَكُن بَينَكُم وَبَينَهُ مَوَدَّةٌ يا لَيتَني كُنتُ مَعَهُم فَأَفوزَ فَوزًا عَظيمًا"
    },
    {
      "index": "74",
      "text": "۞ فَليُقاتِل في سَبيلِ اللَّهِ الَّذينَ يَشرونَ الحَياةَ الدُّنيا بِالآخِرَةِ ۚ وَمَن يُقاتِل في سَبيلِ اللَّهِ فَيُقتَل أَو يَغلِب فَسَوفَ نُؤتيهِ أَجرًا عَظيمًا"
    },
    {
      "index": "75",
      "text": "وَما لَكُم لا تُقاتِلونَ في سَبيلِ اللَّهِ وَالمُستَضعَفينَ مِنَ الرِّجالِ وَالنِّساءِ وَالوِلدانِ الَّذينَ يَقولونَ رَبَّنا أَخرِجنا مِن هـٰذِهِ القَريَةِ الظّالِمِ أَهلُها وَاجعَل لَنا مِن لَدُنكَ وَلِيًّا وَاجعَل لَنا مِن لَدُنكَ نَصيرًا"
    },
    {
      "index": "76",
      "text": "الَّذينَ آمَنوا يُقاتِلونَ في سَبيلِ اللَّهِ ۖ وَالَّذينَ كَفَروا يُقاتِلونَ في سَبيلِ الطّاغوتِ فَقاتِلوا أَولِياءَ الشَّيطانِ ۖ إِنَّ كَيدَ الشَّيطانِ كانَ ضَعيفًا"
    },
    {
      "index": "77",
      "text": "أَلَم تَرَ إِلَى الَّذينَ قيلَ لَهُم كُفّوا أَيدِيَكُم وَأَقيمُوا الصَّلاةَ وَآتُوا الزَّكاةَ فَلَمّا كُتِبَ عَلَيهِمُ القِتالُ إِذا فَريقٌ مِنهُم يَخشَونَ النّاسَ كَخَشيَةِ اللَّهِ أَو أَشَدَّ خَشيَةً ۚ وَقالوا رَبَّنا لِمَ كَتَبتَ عَلَينَا القِتالَ لَولا أَخَّرتَنا إِلىٰ أَجَلٍ قَريبٍ ۗ قُل مَتاعُ الدُّنيا قَليلٌ وَالآخِرَةُ خَيرٌ لِمَنِ اتَّقىٰ وَلا تُظلَمونَ فَتيلًا"
    },
    {
      "index": "78",
      "text": "أَينَما تَكونوا يُدرِككُمُ المَوتُ وَلَو كُنتُم في بُروجٍ مُشَيَّدَةٍ ۗ وَإِن تُصِبهُم حَسَنَةٌ يَقولوا هـٰذِهِ مِن عِندِ اللَّهِ ۖ وَإِن تُصِبهُم سَيِّئَةٌ يَقولوا هـٰذِهِ مِن عِندِكَ ۚ قُل كُلٌّ مِن عِندِ اللَّهِ ۖ فَمالِ هـٰؤُلاءِ القَومِ لا يَكادونَ يَفقَهونَ حَديثًا"
    },
    {
      "index": "79",
      "text": "ما أَصابَكَ مِن حَسَنَةٍ فَمِنَ اللَّهِ ۖ وَما أَصابَكَ مِن سَيِّئَةٍ فَمِن نَفسِكَ ۚ وَأَرسَلناكَ لِلنّاسِ رَسولًا ۚ وَكَفىٰ بِاللَّهِ شَهيدًا"
    },
    {
      "index": "80",
      "text": "مَن يُطِعِ الرَّسولَ فَقَد أَطاعَ اللَّهَ ۖ وَمَن تَوَلّىٰ فَما أَرسَلناكَ عَلَيهِم حَفيظًا"
    },
    {
      "index": "81",
      "text": "وَيَقولونَ طاعَةٌ فَإِذا بَرَزوا مِن عِندِكَ بَيَّتَ طائِفَةٌ مِنهُم غَيرَ الَّذي تَقولُ ۖ وَاللَّهُ يَكتُبُ ما يُبَيِّتونَ ۖ فَأَعرِض عَنهُم وَتَوَكَّل عَلَى اللَّهِ ۚ وَكَفىٰ بِاللَّهِ وَكيلًا"
    },
    {
      "index": "82",
      "text": "أَفَلا يَتَدَبَّرونَ القُرآنَ ۚ وَلَو كانَ مِن عِندِ غَيرِ اللَّهِ لَوَجَدوا فيهِ اختِلافًا كَثيرًا"
    },
    {
      "index": "83",
      "text": "وَإِذا جاءَهُم أَمرٌ مِنَ الأَمنِ أَوِ الخَوفِ أَذاعوا بِهِ ۖ وَلَو رَدّوهُ إِلَى الرَّسولِ وَإِلىٰ أُولِي الأَمرِ مِنهُم لَعَلِمَهُ الَّذينَ يَستَنبِطونَهُ مِنهُم ۗ وَلَولا فَضلُ اللَّهِ عَلَيكُم وَرَحمَتُهُ لَاتَّبَعتُمُ الشَّيطانَ إِلّا قَليلًا"
    },
    {
      "index": "84",
      "text": "فَقاتِل في سَبيلِ اللَّهِ لا تُكَلَّفُ إِلّا نَفسَكَ ۚ وَحَرِّضِ المُؤمِنينَ ۖ عَسَى اللَّهُ أَن يَكُفَّ بَأسَ الَّذينَ كَفَروا ۚ وَاللَّهُ أَشَدُّ بَأسًا وَأَشَدُّ تَنكيلًا"
    },
    {
      "index": "85",
      "text": "مَن يَشفَع شَفاعَةً حَسَنَةً يَكُن لَهُ نَصيبٌ مِنها ۖ وَمَن يَشفَع شَفاعَةً سَيِّئَةً يَكُن لَهُ كِفلٌ مِنها ۗ وَكانَ اللَّهُ عَلىٰ كُلِّ شَيءٍ مُقيتًا"
    },
    {
      "index": "86",
      "text": "وَإِذا حُيّيتُم بِتَحِيَّةٍ فَحَيّوا بِأَحسَنَ مِنها أَو رُدّوها ۗ إِنَّ اللَّهَ كانَ عَلىٰ كُلِّ شَيءٍ حَسيبًا"
    },
    {
      "index": "87",
      "text": "اللَّهُ لا إِلـٰهَ إِلّا هُوَ ۚ لَيَجمَعَنَّكُم إِلىٰ يَومِ القِيامَةِ لا رَيبَ فيهِ ۗ وَمَن أَصدَقُ مِنَ اللَّهِ حَديثًا"
    },
    {
      "index": "88",
      "text": "۞ فَما لَكُم فِي المُنافِقينَ فِئَتَينِ وَاللَّهُ أَركَسَهُم بِما كَسَبوا ۚ أَتُريدونَ أَن تَهدوا مَن أَضَلَّ اللَّهُ ۖ وَمَن يُضلِلِ اللَّهُ فَلَن تَجِدَ لَهُ سَبيلًا"
    },
    {
      "index": "89",
      "text": "وَدّوا لَو تَكفُرونَ كَما كَفَروا فَتَكونونَ سَواءً ۖ فَلا تَتَّخِذوا مِنهُم أَولِياءَ حَتّىٰ يُهاجِروا في سَبيلِ اللَّهِ ۚ فَإِن تَوَلَّوا فَخُذوهُم وَاقتُلوهُم حَيثُ وَجَدتُموهُم ۖ وَلا تَتَّخِذوا مِنهُم وَلِيًّا وَلا نَصيرًا"
    },
    {
      "index": "90",
      "text": "إِلَّا الَّذينَ يَصِلونَ إِلىٰ قَومٍ بَينَكُم وَبَينَهُم ميثاقٌ أَو جاءوكُم حَصِرَت صُدورُهُم أَن يُقاتِلوكُم أَو يُقاتِلوا قَومَهُم ۚ وَلَو شاءَ اللَّهُ لَسَلَّطَهُم عَلَيكُم فَلَقاتَلوكُم ۚ فَإِنِ اعتَزَلوكُم فَلَم يُقاتِلوكُم وَأَلقَوا إِلَيكُمُ السَّلَمَ فَما جَعَلَ اللَّهُ لَكُم عَلَيهِم سَبيلًا"
    },
    {
      "index": "91",
      "text": "سَتَجِدونَ آخَرينَ يُريدونَ أَن يَأمَنوكُم وَيَأمَنوا قَومَهُم كُلَّ ما رُدّوا إِلَى الفِتنَةِ أُركِسوا فيها ۚ فَإِن لَم يَعتَزِلوكُم وَيُلقوا إِلَيكُمُ السَّلَمَ وَيَكُفّوا أَيدِيَهُم فَخُذوهُم وَاقتُلوهُم حَيثُ ثَقِفتُموهُم ۚ وَأُولـٰئِكُم جَعَلنا لَكُم عَلَيهِم سُلطانًا مُبينًا"
    },
    {
      "index": "92",
      "text": "وَما كانَ لِمُؤمِنٍ أَن يَقتُلَ مُؤمِنًا إِلّا خَطَأً ۚ وَمَن قَتَلَ مُؤمِنًا خَطَأً فَتَحريرُ رَقَبَةٍ مُؤمِنَةٍ وَدِيَةٌ مُسَلَّمَةٌ إِلىٰ أَهلِهِ إِلّا أَن يَصَّدَّقوا ۚ فَإِن كانَ مِن قَومٍ عَدُوٍّ لَكُم وَهُوَ مُؤمِنٌ فَتَحريرُ رَقَبَةٍ مُؤمِنَةٍ ۖ وَإِن كانَ مِن قَومٍ بَينَكُم وَبَينَهُم ميثاقٌ فَدِيَةٌ مُسَلَّمَةٌ إِلىٰ أَهلِهِ وَتَحريرُ رَقَبَةٍ مُؤمِنَةٍ ۖ فَمَن لَم يَجِد فَصِيامُ شَهرَينِ مُتَتابِعَينِ تَوبَةً مِنَ اللَّهِ ۗ وَكانَ اللَّهُ عَليمًا حَكيمًا"
    },
    {
      "index": "93",
      "text": "وَمَن يَقتُل مُؤمِنًا مُتَعَمِّدًا فَجَزاؤُهُ جَهَنَّمُ خالِدًا فيها وَغَضِبَ اللَّهُ عَلَيهِ وَلَعَنَهُ وَأَعَدَّ لَهُ عَذابًا عَظيمًا"
    },
    {
      "index": "94",
      "text": "يا أَيُّهَا الَّذينَ آمَنوا إِذا ضَرَبتُم في سَبيلِ اللَّهِ فَتَبَيَّنوا وَلا تَقولوا لِمَن أَلقىٰ إِلَيكُمُ السَّلامَ لَستَ مُؤمِنًا تَبتَغونَ عَرَضَ الحَياةِ الدُّنيا فَعِندَ اللَّهِ مَغانِمُ كَثيرَةٌ ۚ كَذٰلِكَ كُنتُم مِن قَبلُ فَمَنَّ اللَّهُ عَلَيكُم فَتَبَيَّنوا ۚ إِنَّ اللَّهَ كانَ بِما تَعمَلونَ خَبيرًا"
    },
    {
      "index": "95",
      "text": "لا يَستَوِي القاعِدونَ مِنَ المُؤمِنينَ غَيرُ أُولِي الضَّرَرِ وَالمُجاهِدونَ في سَبيلِ اللَّهِ بِأَموالِهِم وَأَنفُسِهِم ۚ فَضَّلَ اللَّهُ المُجاهِدينَ بِأَموالِهِم وَأَنفُسِهِم عَلَى القاعِدينَ دَرَجَةً ۚ وَكُلًّا وَعَدَ اللَّهُ الحُسنىٰ ۚ وَفَضَّلَ اللَّهُ المُجاهِدينَ عَلَى القاعِدينَ أَجرًا عَظيمًا"
    },
    {
      "index": "96",
      "text": "دَرَجاتٍ مِنهُ وَمَغفِرَةً وَرَحمَةً ۚ وَكانَ اللَّهُ غَفورًا رَحيمًا"
    },
    {
      "index": "97",
      "text": "إِنَّ الَّذينَ تَوَفّاهُمُ المَلائِكَةُ ظالِمي أَنفُسِهِم قالوا فيمَ كُنتُم ۖ قالوا كُنّا مُستَضعَفينَ فِي الأَرضِ ۚ قالوا أَلَم تَكُن أَرضُ اللَّهِ واسِعَةً فَتُهاجِروا فيها ۚ فَأُولـٰئِكَ مَأواهُم جَهَنَّمُ ۖ وَساءَت مَصيرًا"
    },
    {
      "index": "98",
      "text": "إِلَّا المُستَضعَفينَ مِنَ الرِّجالِ وَالنِّساءِ وَالوِلدانِ لا يَستَطيعونَ حيلَةً وَلا يَهتَدونَ سَبيلًا"
    },
    {
      "index": "99",
      "text": "فَأُولـٰئِكَ عَسَى اللَّهُ أَن يَعفُوَ عَنهُم ۚ وَكانَ اللَّهُ عَفُوًّا غَفورًا"
    },
    {
      "index": "100",
      "text": "۞ وَمَن يُهاجِر في سَبيلِ اللَّهِ يَجِد فِي الأَرضِ مُراغَمًا كَثيرًا وَسَعَةً ۚ وَمَن يَخرُج مِن بَيتِهِ مُهاجِرًا إِلَى اللَّهِ وَرَسولِهِ ثُمَّ يُدرِكهُ المَوتُ فَقَد وَقَعَ أَجرُهُ عَلَى اللَّهِ ۗ وَكانَ اللَّهُ غَفورًا رَحيمًا"
    },
    {
      "index": "101",
      "text": "وَإِذا ضَرَبتُم فِي الأَرضِ فَلَيسَ عَلَيكُم جُناحٌ أَن تَقصُروا مِنَ الصَّلاةِ إِن خِفتُم أَن يَفتِنَكُمُ الَّذينَ كَفَروا ۚ إِنَّ الكافِرينَ كانوا لَكُم عَدُوًّا مُبينًا"
    },
    {
      "index": "102",
      "text": "وَإِذا كُنتَ فيهِم فَأَقَمتَ لَهُمُ الصَّلاةَ فَلتَقُم طائِفَةٌ مِنهُم مَعَكَ وَليَأخُذوا أَسلِحَتَهُم فَإِذا سَجَدوا فَليَكونوا مِن وَرائِكُم وَلتَأتِ طائِفَةٌ أُخرىٰ لَم يُصَلّوا فَليُصَلّوا مَعَكَ وَليَأخُذوا حِذرَهُم وَأَسلِحَتَهُم ۗ وَدَّ الَّذينَ كَفَروا لَو تَغفُلونَ عَن أَسلِحَتِكُم وَأَمتِعَتِكُم فَيَميلونَ عَلَيكُم مَيلَةً واحِدَةً ۚ وَلا جُناحَ عَلَيكُم إِن كانَ بِكُم أَذًى مِن مَطَرٍ أَو كُنتُم مَرضىٰ أَن تَضَعوا أَسلِحَتَكُم ۖ وَخُذوا حِذرَكُم ۗ إِنَّ اللَّهَ أَعَدَّ لِلكافِرينَ عَذابًا مُهينًا"
    },
    {
      "index": "103",
      "text": "فَإِذا قَضَيتُمُ الصَّلاةَ فَاذكُرُوا اللَّهَ قِيامًا وَقُعودًا وَعَلىٰ جُنوبِكُم ۚ فَإِذَا اطمَأنَنتُم فَأَقيمُوا الصَّلاةَ ۚ إِنَّ الصَّلاةَ كانَت عَلَى المُؤمِنينَ كِتابًا مَوقوتًا"
    },
    {
      "index": "104",
      "text": "وَلا تَهِنوا فِي ابتِغاءِ القَومِ ۖ إِن تَكونوا تَألَمونَ فَإِنَّهُم يَألَمونَ كَما تَألَمونَ ۖ وَتَرجونَ مِنَ اللَّهِ ما لا يَرجونَ ۗ وَكانَ اللَّهُ عَليمًا حَكيمًا"
    },
    {
      "index": "105",
      "text": "إِنّا أَنزَلنا إِلَيكَ الكِتابَ بِالحَقِّ لِتَحكُمَ بَينَ النّاسِ بِما أَراكَ اللَّهُ ۚ وَلا تَكُن لِلخائِنينَ خَصيمًا"
    },
    {
      "index": "106",
      "text": "وَاستَغفِرِ اللَّهَ ۖ إِنَّ اللَّهَ كانَ غَفورًا رَحيمًا"
    },
    {
      "index": "107",
      "text": "وَلا تُجادِل عَنِ الَّذينَ يَختانونَ أَنفُسَهُم ۚ إِنَّ اللَّهَ لا يُحِبُّ مَن كانَ خَوّانًا أَثيمًا"
    },
    {
      "index": "108",
      "text": "يَستَخفونَ مِنَ النّاسِ وَلا يَستَخفونَ مِنَ اللَّهِ وَهُوَ مَعَهُم إِذ يُبَيِّتونَ ما لا يَرضىٰ مِنَ القَولِ ۚ وَكانَ اللَّهُ بِما يَعمَلونَ مُحيطًا"
    },
    {
      "index": "109",
      "text": "ها أَنتُم هـٰؤُلاءِ جادَلتُم عَنهُم فِي الحَياةِ الدُّنيا فَمَن يُجادِلُ اللَّهَ عَنهُم يَومَ القِيامَةِ أَم مَن يَكونُ عَلَيهِم وَكيلًا"
    },
    {
      "index": "110",
      "text": "وَمَن يَعمَل سوءًا أَو يَظلِم نَفسَهُ ثُمَّ يَستَغفِرِ اللَّهَ يَجِدِ اللَّهَ غَفورًا رَحيمًا"
    },
    {
      "index": "111",
      "text": "وَمَن يَكسِب إِثمًا فَإِنَّما يَكسِبُهُ عَلىٰ نَفسِهِ ۚ وَكانَ اللَّهُ عَليمًا حَكيمًا"
    },
    {
      "index": "112",
      "text": "وَمَن يَكسِب خَطيئَةً أَو إِثمًا ثُمَّ يَرمِ بِهِ بَريئًا فَقَدِ احتَمَلَ بُهتانًا وَإِثمًا مُبينًا"
    },
    {
      "index": "113",
      "text": "وَلَولا فَضلُ اللَّهِ عَلَيكَ وَرَحمَتُهُ لَهَمَّت طائِفَةٌ مِنهُم أَن يُضِلّوكَ وَما يُضِلّونَ إِلّا أَنفُسَهُم ۖ وَما يَضُرّونَكَ مِن شَيءٍ ۚ وَأَنزَلَ اللَّهُ عَلَيكَ الكِتابَ وَالحِكمَةَ وَعَلَّمَكَ ما لَم تَكُن تَعلَمُ ۚ وَكانَ فَضلُ اللَّهِ عَلَيكَ عَظيمًا"
    },
    {
      "index": "114",
      "text": "۞ لا خَيرَ في كَثيرٍ مِن نَجواهُم إِلّا مَن أَمَرَ بِصَدَقَةٍ أَو مَعروفٍ أَو إِصلاحٍ بَينَ النّاسِ ۚ وَمَن يَفعَل ذٰلِكَ ابتِغاءَ مَرضاتِ اللَّهِ فَسَوفَ نُؤتيهِ أَجرًا عَظيمًا"
    },
    {
      "index": "115",
      "text": "وَمَن يُشاقِقِ الرَّسولَ مِن بَعدِ ما تَبَيَّنَ لَهُ الهُدىٰ وَيَتَّبِع غَيرَ سَبيلِ المُؤمِنينَ نُوَلِّهِ ما تَوَلّىٰ وَنُصلِهِ جَهَنَّمَ ۖ وَساءَت مَصيرًا"
    },
    {
      "index": "116",
      "text": "إِنَّ اللَّهَ لا يَغفِرُ أَن يُشرَكَ بِهِ وَيَغفِرُ ما دونَ ذٰلِكَ لِمَن يَشاءُ ۚ وَمَن يُشرِك بِاللَّهِ فَقَد ضَلَّ ضَلالًا بَعيدًا"
    },
    {
      "index": "117",
      "text": "إِن يَدعونَ مِن دونِهِ إِلّا إِناثًا وَإِن يَدعونَ إِلّا شَيطانًا مَريدًا"
    },
    {
      "index": "118",
      "text": "لَعَنَهُ اللَّهُ ۘ وَقالَ لَأَتَّخِذَنَّ مِن عِبادِكَ نَصيبًا مَفروضًا"
    },
    {
      "index": "119",
      "text": "وَلَأُضِلَّنَّهُم وَلَأُمَنِّيَنَّهُم وَلَآمُرَنَّهُم فَلَيُبَتِّكُنَّ آذانَ الأَنعامِ وَلَآمُرَنَّهُم فَلَيُغَيِّرُنَّ خَلقَ اللَّهِ ۚ وَمَن يَتَّخِذِ الشَّيطانَ وَلِيًّا مِن دونِ اللَّهِ فَقَد خَسِرَ خُسرانًا مُبينًا"
    },
    {
      "index": "120",
      "text": "يَعِدُهُم وَيُمَنّيهِم ۖ وَما يَعِدُهُمُ الشَّيطانُ إِلّا غُرورًا"
    },
    {
      "index": "121",
      "text": "أُولـٰئِكَ مَأواهُم جَهَنَّمُ وَلا يَجِدونَ عَنها مَحيصًا"
    },
    {
      "index": "122",
      "text": "وَالَّذينَ آمَنوا وَعَمِلُوا الصّالِحاتِ سَنُدخِلُهُم جَنّاتٍ تَجري مِن تَحتِهَا الأَنهارُ خالِدينَ فيها أَبَدًا ۖ وَعدَ اللَّهِ حَقًّا ۚ وَمَن أَصدَقُ مِنَ اللَّهِ قيلًا"
    },
    {
      "index": "123",
      "text": "لَيسَ بِأَمانِيِّكُم وَلا أَمانِيِّ أَهلِ الكِتابِ ۗ مَن يَعمَل سوءًا يُجزَ بِهِ وَلا يَجِد لَهُ مِن دونِ اللَّهِ وَلِيًّا وَلا نَصيرًا"
    },
    {
      "index": "124",
      "text": "وَمَن يَعمَل مِنَ الصّالِحاتِ مِن ذَكَرٍ أَو أُنثىٰ وَهُوَ مُؤمِنٌ فَأُولـٰئِكَ يَدخُلونَ الجَنَّةَ وَلا يُظلَمونَ نَقيرًا"
    },
    {
      "index": "125",
      "text": "وَمَن أَحسَنُ دينًا مِمَّن أَسلَمَ وَجهَهُ لِلَّهِ وَهُوَ مُحسِنٌ وَاتَّبَعَ مِلَّةَ إِبراهيمَ حَنيفًا ۗ وَاتَّخَذَ اللَّهُ إِبراهيمَ خَليلًا"
    },
    {
      "index": "126",
      "text": "وَلِلَّهِ ما فِي السَّماواتِ وَما فِي الأَرضِ ۚ وَكانَ اللَّهُ بِكُلِّ شَيءٍ مُحيطًا"
    },
    {
      "index": "127",
      "text": "وَيَستَفتونَكَ فِي النِّساءِ ۖ قُلِ اللَّهُ يُفتيكُم فيهِنَّ وَما يُتلىٰ عَلَيكُم فِي الكِتابِ في يَتامَى النِّساءِ اللّاتي لا تُؤتونَهُنَّ ما كُتِبَ لَهُنَّ وَتَرغَبونَ أَن تَنكِحوهُنَّ وَالمُستَضعَفينَ مِنَ الوِلدانِ وَأَن تَقوموا لِليَتامىٰ بِالقِسطِ ۚ وَما تَفعَلوا مِن خَيرٍ فَإِنَّ اللَّهَ كانَ بِهِ عَليمًا"
    },
    {
      "index": "128",
      "text": "وَإِنِ امرَأَةٌ خافَت مِن بَعلِها نُشوزًا أَو إِعراضًا فَلا جُناحَ عَلَيهِما أَن يُصلِحا بَينَهُما صُلحًا ۚ وَالصُّلحُ خَيرٌ ۗ وَأُحضِرَتِ الأَنفُسُ الشُّحَّ ۚ وَإِن تُحسِنوا وَتَتَّقوا فَإِنَّ اللَّهَ كانَ بِما تَعمَلونَ خَبيرًا"
    },
    {
      "index": "129",
      "text": "وَلَن تَستَطيعوا أَن تَعدِلوا بَينَ النِّساءِ وَلَو حَرَصتُم ۖ فَلا تَميلوا كُلَّ المَيلِ فَتَذَروها كَالمُعَلَّقَةِ ۚ وَإِن تُصلِحوا وَتَتَّقوا فَإِنَّ اللَّهَ كانَ غَفورًا رَحيمًا"
    },
    {
      "index": "130",
      "text": "وَإِن يَتَفَرَّقا يُغنِ اللَّهُ كُلًّا مِن سَعَتِهِ ۚ وَكانَ اللَّهُ واسِعًا حَكيمًا"
    },
    {
      "index": "131",
      "text": "وَلِلَّهِ ما فِي السَّماواتِ وَما فِي الأَرضِ ۗ وَلَقَد وَصَّينَا الَّذينَ أوتُوا الكِتابَ مِن قَبلِكُم وَإِيّاكُم أَنِ اتَّقُوا اللَّهَ ۚ وَإِن تَكفُروا فَإِنَّ لِلَّهِ ما فِي السَّماواتِ وَما فِي الأَرضِ ۚ وَكانَ اللَّهُ غَنِيًّا حَميدًا"
    },
    {
      "index": "132",
      "text": "وَلِلَّهِ ما فِي السَّماواتِ وَما فِي الأَرضِ ۚ وَكَفىٰ بِاللَّهِ وَكيلًا"
    },
    {
      "index": "133",
      "text": "إِن يَشَأ يُذهِبكُم أَيُّهَا النّاسُ وَيَأتِ بِآخَرينَ ۚ وَكانَ اللَّهُ عَلىٰ ذٰلِكَ قَديرًا"
    },
    {
      "index": "134",
      "text": "مَن كانَ يُريدُ ثَوابَ الدُّنيا فَعِندَ اللَّهِ ثَوابُ الدُّنيا وَالآخِرَةِ ۚ وَكانَ اللَّهُ سَميعًا بَصيرًا"
    },
    {
      "index": "135",
      "text": "۞ يا أَيُّهَا الَّذينَ آمَنوا كونوا قَوّامينَ بِالقِسطِ شُهَداءَ لِلَّهِ وَلَو عَلىٰ أَنفُسِكُم أَوِ الوالِدَينِ وَالأَقرَبينَ ۚ إِن يَكُن غَنِيًّا أَو فَقيرًا فَاللَّهُ أَولىٰ بِهِما ۖ فَلا تَتَّبِعُوا الهَوىٰ أَن تَعدِلوا ۚ وَإِن تَلووا أَو تُعرِضوا فَإِنَّ اللَّهَ كانَ بِما تَعمَلونَ خَبيرًا"
    },
    {
      "index": "136",
      "text": "يا أَيُّهَا الَّذينَ آمَنوا آمِنوا بِاللَّهِ وَرَسولِهِ وَالكِتابِ الَّذي نَزَّلَ عَلىٰ رَسولِهِ وَالكِتابِ الَّذي أَنزَلَ مِن قَبلُ ۚ وَمَن يَكفُر بِاللَّهِ وَمَلائِكَتِهِ وَكُتُبِهِ وَرُسُلِهِ وَاليَومِ الآخِرِ فَقَد ضَلَّ ضَلالًا بَعيدًا"
    },
    {
      "index": "137",
      "text": "إِنَّ الَّذينَ آمَنوا ثُمَّ كَفَروا ثُمَّ آمَنوا ثُمَّ كَفَروا ثُمَّ ازدادوا كُفرًا لَم يَكُنِ اللَّهُ لِيَغفِرَ لَهُم وَلا لِيَهدِيَهُم سَبيلًا"
    },
    {
      "index": "138",
      "text": "بَشِّرِ المُنافِقينَ بِأَنَّ لَهُم عَذابًا أَليمًا"
    },
    {
      "index": "139",
      "text": "الَّذينَ يَتَّخِذونَ الكافِرينَ أَولِياءَ مِن دونِ المُؤمِنينَ ۚ أَيَبتَغونَ عِندَهُمُ العِزَّةَ فَإِنَّ العِزَّةَ لِلَّهِ جَميعًا"
    },
    {
      "index": "140",
      "text": "وَقَد نَزَّلَ عَلَيكُم فِي الكِتابِ أَن إِذا سَمِعتُم آياتِ اللَّهِ يُكفَرُ بِها وَيُستَهزَأُ بِها فَلا تَقعُدوا مَعَهُم حَتّىٰ يَخوضوا في حَديثٍ غَيرِهِ ۚ إِنَّكُم إِذًا مِثلُهُم ۗ إِنَّ اللَّهَ جامِعُ المُنافِقينَ وَالكافِرينَ في جَهَنَّمَ جَميعًا"
    },
    {
      "index": "141",
      "text": "الَّذينَ يَتَرَبَّصونَ بِكُم فَإِن كانَ لَكُم فَتحٌ مِنَ اللَّهِ قالوا أَلَم نَكُن مَعَكُم وَإِن كانَ لِلكافِرينَ نَصيبٌ قالوا أَلَم نَستَحوِذ عَلَيكُم وَنَمنَعكُم مِنَ المُؤمِنينَ ۚ فَاللَّهُ يَحكُمُ بَينَكُم يَومَ القِيامَةِ ۗ وَلَن يَجعَلَ اللَّهُ لِلكافِرينَ عَلَى المُؤمِنينَ سَبيلًا"
    },
    {
      "index": "142",
      "text": "إِنَّ المُنافِقينَ يُخادِعونَ اللَّهَ وَهُوَ خادِعُهُم وَإِذا قاموا إِلَى الصَّلاةِ قاموا كُسالىٰ يُراءونَ النّاسَ وَلا يَذكُرونَ اللَّهَ إِلّا قَليلًا"
    },
    {
      "index": "143",
      "text": "مُذَبذَبينَ بَينَ ذٰلِكَ لا إِلىٰ هـٰؤُلاءِ وَلا إِلىٰ هـٰؤُلاءِ ۚ وَمَن يُضلِلِ اللَّهُ فَلَن تَجِدَ لَهُ سَبيلًا"
    },
    {
      "index": "144",
      "text": "يا أَيُّهَا الَّذينَ آمَنوا لا تَتَّخِذُوا الكافِرينَ أَولِياءَ مِن دونِ المُؤمِنينَ ۚ أَتُريدونَ أَن تَجعَلوا لِلَّهِ عَلَيكُم سُلطانًا مُبينًا"
    },
    {
      "index": "145",
      "text": "إِنَّ المُنافِقينَ فِي الدَّركِ الأَسفَلِ مِنَ النّارِ وَلَن تَجِدَ لَهُم نَصيرًا"
    },
    {
      "index": "146",
      "text": "إِلَّا الَّذينَ تابوا وَأَصلَحوا وَاعتَصَموا بِاللَّهِ وَأَخلَصوا دينَهُم لِلَّهِ فَأُولـٰئِكَ مَعَ المُؤمِنينَ ۖ وَسَوفَ يُؤتِ اللَّهُ المُؤمِنينَ أَجرًا عَظيمًا"
    },
    {
      "index": "147",
      "text": "ما يَفعَلُ اللَّهُ بِعَذابِكُم إِن شَكَرتُم وَآمَنتُم ۚ وَكانَ اللَّهُ شاكِرًا عَليمًا"
    },
    {
      "index": "148",
      "text": "۞ لا يُحِبُّ اللَّهُ الجَهرَ بِالسّوءِ مِنَ القَولِ إِلّا مَن ظُلِمَ ۚ وَكانَ اللَّهُ سَميعًا عَليمًا"
    },
    {
      "index": "149",
      "text": "إِن تُبدوا خَيرًا أَو تُخفوهُ أَو تَعفوا عَن سوءٍ فَإِنَّ اللَّهَ كانَ عَفُوًّا قَديرًا"
    },
    {
      "index": "150",
      "text": "إِنَّ الَّذينَ يَكفُرونَ بِاللَّهِ وَرُسُلِهِ وَيُريدونَ أَن يُفَرِّقوا بَينَ اللَّهِ وَرُسُلِهِ وَيَقولونَ نُؤمِنُ بِبَعضٍ وَنَكفُرُ بِبَعضٍ وَيُريدونَ أَن يَتَّخِذوا بَينَ ذٰلِكَ سَبيلًا"
    },
    {
      "index": "151",
      "text": "أُولـٰئِكَ هُمُ الكافِرونَ حَقًّا ۚ وَأَعتَدنا لِلكافِرينَ عَذابًا مُهينًا"
    },
    {
      "index": "152",
      "text": "وَالَّذينَ آمَنوا بِاللَّهِ وَرُسُلِهِ وَلَم يُفَرِّقوا بَينَ أَحَدٍ مِنهُم أُولـٰئِكَ سَوفَ يُؤتيهِم أُجورَهُم ۗ وَكانَ اللَّهُ غَفورًا رَحيمًا"
    },
    {
      "index": "153",
      "text": "يَسأَلُكَ أَهلُ الكِتابِ أَن تُنَزِّلَ عَلَيهِم كِتابًا مِنَ السَّماءِ ۚ فَقَد سَأَلوا موسىٰ أَكبَرَ مِن ذٰلِكَ فَقالوا أَرِنَا اللَّهَ جَهرَةً فَأَخَذَتهُمُ الصّاعِقَةُ بِظُلمِهِم ۚ ثُمَّ اتَّخَذُوا العِجلَ مِن بَعدِ ما جاءَتهُمُ البَيِّناتُ فَعَفَونا عَن ذٰلِكَ ۚ وَآتَينا موسىٰ سُلطانًا مُبينًا"
    },
    {
      "index": "154",
      "text": "وَرَفَعنا فَوقَهُمُ الطّورَ بِميثاقِهِم وَقُلنا لَهُمُ ادخُلُوا البابَ سُجَّدًا وَقُلنا لَهُم لا تَعدوا فِي السَّبتِ وَأَخَذنا مِنهُم ميثاقًا غَليظًا"
    },
    {
      "index": "155",
      "text": "فَبِما نَقضِهِم ميثاقَهُم وَكُفرِهِم بِآياتِ اللَّهِ وَقَتلِهِمُ الأَنبِياءَ بِغَيرِ حَقٍّ وَقَولِهِم قُلوبُنا غُلفٌ ۚ بَل طَبَعَ اللَّهُ عَلَيها بِكُفرِهِم فَلا يُؤمِنونَ إِلّا قَليلًا"
    },
    {
      "index": "156",
      "text": "وَبِكُفرِهِم وَقَولِهِم عَلىٰ مَريَمَ بُهتانًا عَظيمًا"
    },
    {
      "index": "157",
      "text": "وَقَولِهِم إِنّا قَتَلنَا المَسيحَ عيسَى ابنَ مَريَمَ رَسولَ اللَّهِ وَما قَتَلوهُ وَما صَلَبوهُ وَلـٰكِن شُبِّهَ لَهُم ۚ وَإِنَّ الَّذينَ اختَلَفوا فيهِ لَفي شَكٍّ مِنهُ ۚ ما لَهُم بِهِ مِن عِلمٍ إِلَّا اتِّباعَ الظَّنِّ ۚ وَما قَتَلوهُ يَقينًا"
    },
    {
      "index": "158",
      "text": "بَل رَفَعَهُ اللَّهُ إِلَيهِ ۚ وَكانَ اللَّهُ عَزيزًا حَكيمًا"
    },
    {
      "index": "159",
      "text": "وَإِن مِن أَهلِ الكِتابِ إِلّا لَيُؤمِنَنَّ بِهِ قَبلَ مَوتِهِ ۖ وَيَومَ القِيامَةِ يَكونُ عَلَيهِم شَهيدًا"
    },
    {
      "index": "160",
      "text": "فَبِظُلمٍ مِنَ الَّذينَ هادوا حَرَّمنا عَلَيهِم طَيِّباتٍ أُحِلَّت لَهُم وَبِصَدِّهِم عَن سَبيلِ اللَّهِ كَثيرًا"
    },
    {
      "index": "161",
      "text": "وَأَخذِهِمُ الرِّبا وَقَد نُهوا عَنهُ وَأَكلِهِم أَموالَ النّاسِ بِالباطِلِ ۚ وَأَعتَدنا لِلكافِرينَ مِنهُم عَذابًا أَليمًا"
    },
    {
      "index": "162",
      "text": "لـٰكِنِ الرّاسِخونَ فِي العِلمِ مِنهُم وَالمُؤمِنونَ يُؤمِنونَ بِما أُنزِلَ إِلَيكَ وَما أُنزِلَ مِن قَبلِكَ ۚ وَالمُقيمينَ الصَّلاةَ ۚ وَالمُؤتونَ الزَّكاةَ وَالمُؤمِنونَ بِاللَّهِ وَاليَومِ الآخِرِ أُولـٰئِكَ سَنُؤتيهِم أَجرًا عَظيمًا"
    },
    {
      "index": "163",
      "text": "۞ إِنّا أَوحَينا إِلَيكَ كَما أَوحَينا إِلىٰ نوحٍ وَالنَّبِيّينَ مِن بَعدِهِ ۚ وَأَوحَينا إِلىٰ إِبراهيمَ وَإِسماعيلَ وَإِسحاقَ وَيَعقوبَ وَالأَسباطِ وَعيسىٰ وَأَيّوبَ وَيونُسَ وَهارونَ وَسُلَيمانَ ۚ وَآتَينا داوودَ زَبورًا"
    },
    {
      "index": "164",
      "text": "وَرُسُلًا قَد قَصَصناهُم عَلَيكَ مِن قَبلُ وَرُسُلًا لَم نَقصُصهُم عَلَيكَ ۚ وَكَلَّمَ اللَّهُ موسىٰ تَكليمًا"
    },
    {
      "index": "165",
      "text": "رُسُلًا مُبَشِّرينَ وَمُنذِرينَ لِئَلّا يَكونَ لِلنّاسِ عَلَى اللَّهِ حُجَّةٌ بَعدَ الرُّسُلِ ۚ وَكانَ اللَّهُ عَزيزًا حَكيمًا"
    },
    {
      "index": "166",
      "text": "لـٰكِنِ اللَّهُ يَشهَدُ بِما أَنزَلَ إِلَيكَ ۖ أَنزَلَهُ بِعِلمِهِ ۖ وَالمَلائِكَةُ يَشهَدونَ ۚ وَكَفىٰ بِاللَّهِ شَهيدًا"
    },
    {
      "index": "167",
      "text": "إِنَّ الَّذينَ كَفَروا وَصَدّوا عَن سَبيلِ اللَّهِ قَد ضَلّوا ضَلالًا بَعيدًا"
    },
    {
      "index": "168",
      "text": "إِنَّ الَّذينَ كَفَروا وَظَلَموا لَم يَكُنِ اللَّهُ لِيَغفِرَ لَهُم وَلا لِيَهدِيَهُم طَريقًا"
    },
    {
      "index": "169",
      "text": "إِلّا طَريقَ جَهَنَّمَ خالِدينَ فيها أَبَدًا ۚ وَكانَ ذٰلِكَ عَلَى اللَّهِ يَسيرًا"
    },
    {
      "index": "170",
      "text": "يا أَيُّهَا النّاسُ قَد جاءَكُمُ الرَّسولُ بِالحَقِّ مِن رَبِّكُم فَآمِنوا خَيرًا لَكُم ۚ وَإِن تَكفُروا فَإِنَّ لِلَّهِ ما فِي السَّماواتِ وَالأَرضِ ۚ وَكانَ اللَّهُ عَليمًا حَكيمًا"
    },
    {
      "index": "171",
      "text": "يا أَهلَ الكِتابِ لا تَغلوا في دينِكُم وَلا تَقولوا عَلَى اللَّهِ إِلَّا الحَقَّ ۚ إِنَّمَا المَسيحُ عيسَى ابنُ مَريَمَ رَسولُ اللَّهِ وَكَلِمَتُهُ أَلقاها إِلىٰ مَريَمَ وَروحٌ مِنهُ ۖ فَآمِنوا بِاللَّهِ وَرُسُلِهِ ۖ وَلا تَقولوا ثَلاثَةٌ ۚ انتَهوا خَيرًا لَكُم ۚ إِنَّمَا اللَّهُ إِلـٰهٌ واحِدٌ ۖ سُبحانَهُ أَن يَكونَ لَهُ وَلَدٌ ۘ لَهُ ما فِي السَّماواتِ وَما فِي الأَرضِ ۗ وَكَفىٰ بِاللَّهِ وَكيلًا"
    },
    {
      "index": "172",
      "text": "لَن يَستَنكِفَ المَسيحُ أَن يَكونَ عَبدًا لِلَّهِ وَلَا المَلائِكَةُ المُقَرَّبونَ ۚ وَمَن يَستَنكِف عَن عِبادَتِهِ وَيَستَكبِر فَسَيَحشُرُهُم إِلَيهِ جَميعًا"
    },
    {
      "index": "173",
      "text": "فَأَمَّا الَّذينَ آمَنوا وَعَمِلُوا الصّالِحاتِ فَيُوَفّيهِم أُجورَهُم وَيَزيدُهُم مِن فَضلِهِ ۖ وَأَمَّا الَّذينَ استَنكَفوا وَاستَكبَروا فَيُعَذِّبُهُم عَذابًا أَليمًا وَلا يَجِدونَ لَهُم مِن دونِ اللَّهِ وَلِيًّا وَلا نَصيرًا"
    },
    {
      "index": "174",
      "text": "يا أَيُّهَا النّاسُ قَد جاءَكُم بُرهانٌ مِن رَبِّكُم وَأَنزَلنا إِلَيكُم نورًا مُبينًا"
    },
    {
      "index": "175",
      "text": "فَأَمَّا الَّذينَ آمَنوا بِاللَّهِ وَاعتَصَموا بِهِ فَسَيُدخِلُهُم في رَحمَةٍ مِنهُ وَفَضلٍ وَيَهديهِم إِلَيهِ صِراطًا مُستَقيمًا"
    },
    {
      "index": "176",
      "text": "يَستَفتونَكَ قُلِ اللَّهُ يُفتيكُم فِي الكَلالَةِ ۚ إِنِ امرُؤٌ هَلَكَ لَيسَ لَهُ وَلَدٌ وَلَهُ أُختٌ فَلَها نِصفُ ما تَرَكَ ۚ وَهُوَ يَرِثُها إِن لَم يَكُن لَها وَلَدٌ ۚ فَإِن كانَتَا اثنَتَينِ فَلَهُمَا الثُّلُثانِ مِمّا تَرَكَ ۚ وَإِن كانوا إِخوَةً رِجالًا وَنِساءً فَلِلذَّكَرِ مِثلُ حَظِّ الأُنثَيَينِ ۗ يُبَيِّنُ اللَّهُ لَكُم أَن تَضِلّوا ۗ وَاللَّهُ بِكُلِّ شَيءٍ عَليمٌ"
    }
  ],
  "index": "4",
  "name": "النساء",
  "copyright": "# PLEASE DO NOT REMOVE OR CHANGE THIS COPYRIGHT BLOCK \n#==================================================================== \n#\n#  Tanzil Quran Text (Simple Minimal, Version 1.1)\n#  Copyright (C) 2007-2022 Tanzil Project\n#  License: Creative Commons Attribution 3.0\n#\n#  This copy of the Quran text is carefully produced, highly \n#  verified and continuously monitored by a group of specialists \n#  at Tanzil Project.\n#\n#  TERMS OF USE:\n#\n#  - Permission is granted to copy and distribute verbatim copies \n#    of this text, but CHANGING IT IS NOT ALLOWED.\n#\n#  - This Quran text can be used in any website or application, \n#    provided that its source (Tanzil Project) is clearly indicated, \n#    and a link is made to tanzil.net to enable users to keep\n#    track of changes.\n#\n#  - This copyright notice shall be included in all verbatim copies \n#    of the text, and shall be reproduced appropriately in all files \n#    derived from or containing substantial portion of this text.\n#\n#  Please check updates at: http://tanzil.net/updates/\n#\n#====================================================================\n",
  "type": "simple-min",
  "version": "1.1"
}