{
  "aya": [
    {
      "index": "1",
      "text": "عَمَّ يَتَسَآءَلُونَ",
      "bismillah": "بِسْمِ ٱللَّهِ ٱلرَّحْمَـٰنِ ٱلرَّحِيمِ"
    },
    {
      "index": "2",
      "text": "عَنِ ٱلنَّبَإِ ٱلْعَظِيمِ"
    },
    {
      "index": "3",
      "text": "ٱلَّذِى هُمْ فِيهِ مُخْتَلِفُونَ"
    },
    {
      "index": "4",
      "text": "كَلَّا سَيَعْلَمُونَ"
    },
    {
      "index": "5",
      "text": "ثُمَّ كَلَّا سَيَعْلَمُونَ"
    },
    {
      "index": "6",
      "text": "أَلَمْ نَجْعَلِ ٱلْأَرْضَ مِهَـٰدًا"
    },
    {
      "index": "7",
      "text": "وَٱلْجِبَالَ أَوْتَادًا"
    },
    {
      "index": "8",
      "text": "وَخَلَقْنَـٰكُمْ أَزْوَٰجًا"
    },
    {
      "index": "9",
      "text": "وَجَعَلْنَا نَوْمَكُمْ سُبَاتًا"
    },
    {
      "index": "10",
      "text": "وَجَعَلْنَا ٱلَّيْلَ لِبَاسًا"
    },
    {
      "index": "11",
      "text": "وَجَعَلْنَا ٱلنَّهَارَ مَعَاشًا"
    },
    {
      "index": "12",
      "text": "وَبَنَيْنَا فَوْقَكُمْ سَبْعًا شِدَادًا"
    },
    {
      "index": "13",
      "text": "وَجَعَلْنَا سِرَاجًا وَهَّاجًا"
    },
    {
      "index": "14",
      "text": "وَأَنزَلْنَا مِنَ ٱلْمُعْصِرَٰتِ مَآءً ثَجَّاجًا"
    },
    {
      "index": "15",
      "text": "لِّنُخْرِجَ بِهِۦ حَبًّا وَنَبَاتًا"
    },
    {
      "index": "16",
      "text": "وَجَنَّـٰتٍ أَلْفَافًا"
    },
    {
      "index": "17",
      "text": "إِنَّ يَوْمَ ٱلْفَصْلِ كَانَ مِيقَـٰتًا"
    },
    {
      "index": "18",
      "text": "يَوْمَ يُنفَخُ فِى ٱلصُّورِ فَتَأْتُونَ أَفْوَاجًا"
    },
    {
      "index": "19",
      "text": "وَفُتِحَتِ ٱلسَّمَآءُ فَكَانَتْ أَبْوَٰبًا"
    },
    {
      "index": "20",
      "text": "وَسُيِّرَتِ ٱلْجِبَالُ فَكَانَتْ سَرَابًا"
    },
    {
      "index": "21",
      "text": "إِنَّ جَهَنَّمَ كَانَتْ مِرْصَادًا"
    },
    {
      "index": "22",
      "text": "لِّلطَّـٰغِينَ مَـَٔابًا"
    },
    {
      "index": "23",
      "text": "لَّـٰبِثِينَ فِيهَآ أَحْقَابًا"
    },
    {
      "index": "24",
      "text": "لَّا يَذُوقُونَ فِيهَا بَرْدًا وَلَا شَرَابًا"
    },
    {
      "index": "25",
      "text": "إِلَّا حَمِيمًا وَغَسَّاقًا"
    },
    {
      "index": "26",
      "text": "جَزَآءً وِفَاقًا"
    },
    {
      "index": "27",
      "text": "إِنَّهُمْ كَانُوا۟ لَا يَرْجُونَ حِسَابًا"
    },
    {
      "index": "28",
      "text": "وَكَذَّبُوا۟ بِـَٔايَـٰتِنَا كِذَّابًا"
    },
    {
      "index": "29",
      "text": "وَكُلَّ شَىْءٍ أَحْصَيْنَـٰهُ كِتَـٰبًا"
    },
    {
      "index": "30",
      "text": "فَذُوقُوا۟ فَلَن نَّزِيدَكُمْ إِلَّا عَذَابًا"
    },
    {
      "index": "31",
      "text": "إِنَّ لِلْمُتَّقِينَ مَفَازًا"
    },
    {
      "index": "32",
      "text": "حَدَآئِقَ وَأَعْنَـٰبًا"
    },
    {
      "index": "33",
      "text": "وَكَوَاعِبَ أَتْرَابًا"
    },
    {
      "index": "34",
      "text": "وَكَأْسًا دِهَاقًا"
    },
    {
      "index": "35",
      "text": "لَّا يَسْمَعُونَ فِيهَا لَغْوًا وَلَا كِذَّٰبًا"
    },
    {
      "index": "36",
      "text": "جَزَآءً مِّن رَّبِّكَ عَطَآءً حِسَابًا"
    },
    {
      "index": "37",
      "text": "رَّبِّ ٱلسَّمَـٰوَٰتِ وَٱلْأَرْضِ وَمَا بَيْنَهُمَا ٱلرَّحْمَـٰنِ ۖ لَا يَمْلِكُونَ مِنْهُ خِطَابًا"
    },
    {
      "index": "38",
      "text": "يَوْمَ يَقُومُ ٱلرُّوحُ وَٱلْمَلَـٰٓئِكَةُ صَفًّا ۖ لَّا يَتَكَلَّمُونَ إِلَّا مَنْ أَذِنَ لَهُ ٱلرَّحْمَـٰنُ وَقَالَ صَوَابًا"
    },
    {
      "index": "39",
      "text": "ذَٰلِكَ ٱلْيَوْمُ ٱلْحَقُّ ۖ فَمَن شَآءَ ٱتَّخَذَ إِلَىٰ رَبِّهِۦ مَـَٔابًا"
    },
    {
      "index": "40",
      "text": "إِنَّآ أَنذَرْنَـٰكُمْ عَذَابًا قَرِيبًا يَوْمَ يَنظُرُ ٱلْمَرْءُ مَا قَدَّمَتْ يَدَاهُ وَيَقُولُ ٱلْكَافِرُ يَـٰلَيْتَنِى كُنتُ تُرَٰبًۢا"
    }
  ],
  "index": "78",
  "name": "النبإ",
  "copyright": "# PLEASE DO NOT REMOVE OR CHANGE THIS COPYRIGHT BLOCK \n#==================================================================== \n#\n#  Tanzil Quran Text (Uthmani, Version 1.1)\n#  Copyright (C) 2007-2022 Tanzil Project\n#  License: Creative Commons Attribution 3.0\n#\n#  This copy of the Quran text is carefully produced, highly \n#  verified and continuously monitored by a group of specialists \n#  at Tanzil Project.\n#\n#  TERMS OF USE:\n#\n#  - Permission is granted to copy and distribute verbatim copies \n#    of this text, but CHANGING IT IS NOT ALLOWED.\n#\n#  - This Quran text can be used in any website or application, \n#    provided that its source (Tanzil Project) is clearly indicated, \n#    and a link is made to tanzil.net to enable users to keep\n#    track of changes.\n#\n#  - This copyright notice shall be included in all verbatim copies \n#    of the text, and shall be reproduced appropriately in all files \n#    derived from or containing substantial portion of this text.\n#\n#  Please check updates at: http://tanzil.net/updates/\n#\n#====================================================================\n",
  "type": "uthmani",
  "version": "1.1"
}