{
  "aya": [
    {
      "index": "1",
      "text": "والفجر",
      "bismillah": "بسم الله الرحمن الرحيم"
    },
    {
      "index": "2",
      "text": "وليال عشر"
    },
    {
      "index": "3",
      "text": "والشفع والوتر"
    },
    {
      "index": "4",
      "text": "والليل إذا يسر"
    },
    {
      "index": "5",
      "text": "هل في ذلك قسم لذي حجر"
    },
    {
      "index": "6",
      "text": "ألم تر كيف فعل ربك بعاد"
    },
    {
      "index": "7",
      "text": "إرم ذات العماد"
    },
    {
      "index": "8",
      "text": "التي لم يخلق مثلها في البلاد"
    },
    {
      "index": "9",
      "text": "وثمود الذين جابوا الصخر بالواد"
    },
    {
      "index": "10",
      "text": "وفرعون ذي الأوتاد"
    },
    {
      "index": "11",
      "text": "الذين طغوا في البلاد"
    },
    {
      "index": "12",
      "text": "فأكثروا فيها الفساد"
    },
    {
      "index": "13",
      "text": "فصب عليهم ربك سوط عذاب"
    },
    {
      "index": "14",
      "text": "إن ربك لبالمرصاد"
    },
    {
      "index": "15",
      "text": "فأما الإنسان إذا ما ابتلاه ربه فأكرمه ونعمه فيقول ربي أكرمن"
    },
    {
      "index": "16",
      "text": "وأما إذا ما ابتلاه فقدر عليه رزقه فيقول ربي أهانن"
    },
    {
      "index": "17",
      "text": "كلا ۖ بل لا تكرمون اليتيم"
    },
    {
      "index": "18",
      "text": "ولا تحاضون على طعام المسكين"
    },
    {
      "index": "19",
      "text": "وتأكلون التراث أكلا لما"
    },
    {
      "index": "20",
      "text": "وتحبون المال حبا جما"
    },
    {
      "index": "21",
      "text": "كلا إذا دكت الأرض دكا دكا"
    },
    {
      "index": "22",
      "text": "وجاء ربك والملك صفا صفا"
    },
    {
      "index": "23",
      "text": "وجيء يومئذ بجهنم ۚ يومئذ يتذكر الإنسان وأنى له الذكرى"
    },
    {
      "index": "24",
      "text": "يقول يا ليتني قدمت لحياتي"
    },
    {
      "index": "25",
      "text": "فيومئذ لا يعذب عذابه أحد"
    },
    {
      "index": "26",
      "text": "ولا يوثق وثاقه أحد"
    },
    {
      "index": "27",
      "text": "يا أيتها النفس المطمئنة"
    },
    {
      "index": "28",
      "text": "ارجعي إلى ربك راضية مرضية"
    },
    {
      "index": "29",
      "text": "فادخلي في عبادي"
    },
    {
      "index": "30",
      "text": "وادخلي جنتي"
    }
  ],
  "index": "89",
  "name": "الفجر",
  "copyright": "# PLEASE DO NOT REMOVE OR CHANGE THIS COPYRIGHT BLOCK \n#==================================================================== \n#\n#  Tanzil Quran Text (Simple Clean, Version 1.1)\n#  Copyright (C) 2007-2022 Tanzil Project\n#  License: Creative Commons Attribution 3.0\n#\n#  This copy of the Quran text is carefully produced, highly \n#  verified and continuously monitored by a group of specialists \n#  at Tanzil Project.\n#\n#  TERMS OF USE:\n#\n#  - Permission is granted to copy and distribute verbatim copies \n#    of this text, but CHANGING IT IS NOT ALLOWED.\n#\n#  - This Quran text can be used in any website or application, \n#    provided that its source (Tanzil Project) is clearly indicated, \n#    and a link is made to tanzil.net to enable users to keep\n#    track of changes.\n#\n#  - This copyright notice shall be included in all verbatim copies \n#    of the text, and shall be reproduced appropriately in all files \n#    derived from or containing substantial portion of this text.\n#\n#  Please check updates at: http://tanzil.net/updates/\n#\n#====================================================================\n",
  "type": "simple-clean",
  "version": "1.1"
}