{
  "aya": [
    {
      "index": "1",
      "text": "سُبحـٰنَ الَّذى أَسرىٰ بِعَبدِهِ لَيلًا مِنَ المَسجِدِ الحَرامِ إِلَى المَسجِدِ الأَقصَا الَّذى بـٰرَكنا حَولَهُ لِنُرِيَهُ مِن ءايـٰتِنا ۚ إِنَّهُ هُوَ السَّميعُ البَصيرُ",
      "bismillah": "بِسمِ اللَّهِ الرَّحمـٰنِ الرَّحيمِ"
    },
    {
      "index": "2",
      "text": "وَءاتَينا موسَى الكِتـٰبَ وَجَعَلنـٰهُ هُدًى لِبَنى إِسرٰءيلَ أَلّا تَتَّخِذوا مِن دونى وَكيلًا"
    },
    {
      "index": "3",
      "text": "ذُرِّيَّةَ مَن حَمَلنا مَعَ نوحٍ ۚ إِنَّهُ كانَ عَبدًا شَكورًا"
    },
    {
      "index": "4",
      "text": "وَقَضَينا إِلىٰ بَنى إِسرٰءيلَ فِى الكِتـٰبِ لَتُفسِدُنَّ فِى الأَرضِ مَرَّتَينِ وَلَتَعلُنَّ عُلُوًّا كَبيرًا"
    },
    {
      "index": "5",
      "text": "فَإِذا جاءَ وَعدُ أولىٰهُما بَعَثنا عَلَيكُم عِبادًا لَنا أُولى بَأسٍ شَديدٍ فَجاسوا خِلـٰلَ الدِّيارِ ۚ وَكانَ وَعدًا مَفعولًا"
    },
    {
      "index": "6",
      "text": "ثُمَّ رَدَدنا لَكُمُ الكَرَّةَ عَلَيهِم وَأَمدَدنـٰكُم بِأَموٰلٍ وَبَنينَ وَجَعَلنـٰكُم أَكثَرَ نَفيرًا"
    },
    {
      "index": "7",
      "text": "إِن أَحسَنتُم أَحسَنتُم لِأَنفُسِكُم ۖ وَإِن أَسَأتُم فَلَها ۚ فَإِذا جاءَ وَعدُ الـٔاخِرَةِ لِيَسـۥـٔوا وُجوهَكُم وَلِيَدخُلُوا المَسجِدَ كَما دَخَلوهُ أَوَّلَ مَرَّةٍ وَلِيُتَبِّروا ما عَلَوا تَتبيرًا"
    },
    {
      "index": "8",
      "text": "عَسىٰ رَبُّكُم أَن يَرحَمَكُم ۚ وَإِن عُدتُم عُدنا ۘ وَجَعَلنا جَهَنَّمَ لِلكـٰفِرينَ حَصيرًا"
    },
    {
      "index": "9",
      "text": "إِنَّ هـٰذَا القُرءانَ يَهدى لِلَّتى هِىَ أَقوَمُ وَيُبَشِّرُ المُؤمِنينَ الَّذينَ يَعمَلونَ الصّـٰلِحـٰتِ أَنَّ لَهُم أَجرًا كَبيرًا"
    },
    {
      "index": "10",
      "text": "وَأَنَّ الَّذينَ لا يُؤمِنونَ بِالـٔاخِرَةِ أَعتَدنا لَهُم عَذابًا أَليمًا"
    },
    {
      "index": "11",
      "text": "وَيَدعُ الإِنسـٰنُ بِالشَّرِّ دُعاءَهُ بِالخَيرِ ۖ وَكانَ الإِنسـٰنُ عَجولًا"
    },
    {
      "index": "12",
      "text": "وَجَعَلنَا الَّيلَ وَالنَّهارَ ءايَتَينِ ۖ فَمَحَونا ءايَةَ الَّيلِ وَجَعَلنا ءايَةَ النَّهارِ مُبصِرَةً لِتَبتَغوا فَضلًا مِن رَبِّكُم وَلِتَعلَموا عَدَدَ السِّنينَ وَالحِسابَ ۚ وَكُلَّ شَىءٍ فَصَّلنـٰهُ تَفصيلًا"
    },
    {
      "index": "13",
      "text": "وَكُلَّ إِنسـٰنٍ أَلزَمنـٰهُ طـٰئِرَهُ فى عُنُقِهِ ۖ وَنُخرِجُ لَهُ يَومَ القِيـٰمَةِ كِتـٰبًا يَلقىٰهُ مَنشورًا"
    },
    {
      "index": "14",
      "text": "اقرَأ كِتـٰبَكَ كَفىٰ بِنَفسِكَ اليَومَ عَلَيكَ حَسيبًا"
    },
    {
      "index": "15",
      "text": "مَنِ اهتَدىٰ فَإِنَّما يَهتَدى لِنَفسِهِ ۖ وَمَن ضَلَّ فَإِنَّما يَضِلُّ عَلَيها ۚ وَلا تَزِرُ وازِرَةٌ وِزرَ أُخرىٰ ۗ وَما كُنّا مُعَذِّبينَ حَتّىٰ نَبعَثَ رَسولًا"
    },
    {
      "index": "16",
      "text": "وَإِذا أَرَدنا أَن نُهلِكَ قَريَةً أَمَرنا مُترَفيها فَفَسَقوا فيها فَحَقَّ عَلَيهَا القَولُ فَدَمَّرنـٰها تَدميرًا"
    },
    {
      "index": "17",
      "text": "وَكَم أَهلَكنا مِنَ القُرونِ مِن بَعدِ نوحٍ ۗ وَكَفىٰ بِرَبِّكَ بِذُنوبِ عِبادِهِ خَبيرًا بَصيرًا"
    },
    {
      "index": "18",
      "text": "مَن كانَ يُريدُ العاجِلَةَ عَجَّلنا لَهُ فيها ما نَشاءُ لِمَن نُريدُ ثُمَّ جَعَلنا لَهُ جَهَنَّمَ يَصلىٰها مَذمومًا مَدحورًا"
    },
    {
      "index": "19",
      "text": "وَمَن أَرادَ الـٔاخِرَةَ وَسَعىٰ لَها سَعيَها وَهُوَ مُؤمِنٌ فَأُولـٰئِكَ كانَ سَعيُهُم مَشكورًا"
    },
    {
      "index": "20",
      "text": "كُلًّا نُمِدُّ هـٰؤُلاءِ وَهـٰؤُلاءِ مِن عَطاءِ رَبِّكَ ۚ وَما كانَ عَطاءُ رَبِّكَ مَحظورًا"
    },
    {
      "index": "21",
      "text": "انظُر كَيفَ فَضَّلنا بَعضَهُم عَلىٰ بَعضٍ ۚ وَلَلـٔاخِرَةُ أَكبَرُ دَرَجـٰتٍ وَأَكبَرُ تَفضيلًا"
    },
    {
      "index": "22",
      "text": "لا تَجعَل مَعَ اللَّهِ إِلـٰهًا ءاخَرَ فَتَقعُدَ مَذمومًا مَخذولًا"
    },
    {
      "index": "23",
      "text": "۞ وَقَضىٰ رَبُّكَ أَلّا تَعبُدوا إِلّا إِيّاهُ وَبِالوٰلِدَينِ إِحسـٰنًا ۚ إِمّا يَبلُغَنَّ عِندَكَ الكِبَرَ أَحَدُهُما أَو كِلاهُما فَلا تَقُل لَهُما أُفٍّ وَلا تَنهَرهُما وَقُل لَهُما قَولًا كَريمًا"
    },
    {
      "index": "24",
      "text": "وَاخفِض لَهُما جَناحَ الذُّلِّ مِنَ الرَّحمَةِ وَقُل رَبِّ ارحَمهُما كَما رَبَّيانى صَغيرًا"
    },
    {
      "index": "25",
      "text": "رَبُّكُم أَعلَمُ بِما فى نُفوسِكُم ۚ إِن تَكونوا صـٰلِحينَ فَإِنَّهُ كانَ لِلأَوّٰبينَ غَفورًا"
    },
    {
      "index": "26",
      "text": "وَءاتِ ذَا القُربىٰ حَقَّهُ وَالمِسكينَ وَابنَ السَّبيلِ وَلا تُبَذِّر تَبذيرًا"
    },
    {
      "index": "27",
      "text": "إِنَّ المُبَذِّرينَ كانوا إِخوٰنَ الشَّيـٰطينِ ۖ وَكانَ الشَّيطـٰنُ لِرَبِّهِ كَفورًا"
    },
    {
      "index": "28",
      "text": "وَإِمّا تُعرِضَنَّ عَنهُمُ ابتِغاءَ رَحمَةٍ مِن رَبِّكَ تَرجوها فَقُل لَهُم قَولًا مَيسورًا"
    },
    {
      "index": "29",
      "text": "وَلا تَجعَل يَدَكَ مَغلولَةً إِلىٰ عُنُقِكَ وَلا تَبسُطها كُلَّ البَسطِ فَتَقعُدَ مَلومًا مَحسورًا"
    },
    {
      "index": "30",
      "text": "إِنَّ رَبَّكَ يَبسُطُ الرِّزقَ لِمَن يَشاءُ وَيَقدِرُ ۚ إِنَّهُ كانَ بِعِبادِهِ خَبيرًا بَصيرًا"
    },
    {
      "index": "31",
      "text": "وَلا تَقتُلوا أَولـٰدَكُم خَشيَةَ إِملـٰقٍ ۖ نَحنُ نَرزُقُهُم وَإِيّاكُم ۚ إِنَّ قَتلَهُم كانَ خِطـًٔا كَبيرًا"
    },
    {
      "index": "32",
      "text": "وَلا تَقرَبُوا الزِّنىٰ ۖ إِنَّهُ كانَ فـٰحِشَةً وَساءَ سَبيلًا"
    },
    {
      "index": "33",
      "text": "وَلا تَقتُلُوا النَّفسَ الَّتى حَرَّمَ اللَّهُ إِلّا بِالحَقِّ ۗ وَمَن قُتِلَ مَظلومًا فَقَد جَعَلنا لِوَلِيِّهِ سُلطـٰنًا فَلا يُسرِف فِى القَتلِ ۖ إِنَّهُ كانَ مَنصورًا"
    },
    {
      "index": "34",
      "text": "وَلا تَقرَبوا مالَ اليَتيمِ إِلّا بِالَّتى هِىَ أَحسَنُ حَتّىٰ يَبلُغَ أَشُدَّهُ ۚ وَأَوفوا بِالعَهدِ ۖ إِنَّ العَهدَ كانَ مَسـٔولًا"
    },
    {
      "index": "35",
      "text": "وَأَوفُوا الكَيلَ إِذا كِلتُم وَزِنوا بِالقِسطاسِ المُستَقيمِ ۚ ذٰلِكَ خَيرٌ وَأَحسَنُ تَأويلًا"
    },
    {
      "index": "36",
      "text": "وَلا تَقفُ ما لَيسَ لَكَ بِهِ عِلمٌ ۚ إِنَّ السَّمعَ وَالبَصَرَ وَالفُؤادَ كُلُّ أُولـٰئِكَ كانَ عَنهُ مَسـٔولًا"
    },
    {
      "index": "37",
      "text": "وَلا تَمشِ فِى الأَرضِ مَرَحًا ۖ إِنَّكَ لَن تَخرِقَ الأَرضَ وَلَن تَبلُغَ الجِبالَ طولًا"
    },
    {
      "index": "38",
      "text": "كُلُّ ذٰلِكَ كانَ سَيِّئُهُ عِندَ رَبِّكَ مَكروهًا"
    },
    {
      "index": "39",
      "text": "ذٰلِكَ مِمّا أَوحىٰ إِلَيكَ رَبُّكَ مِنَ الحِكمَةِ ۗ وَلا تَجعَل مَعَ اللَّهِ إِلـٰهًا ءاخَرَ فَتُلقىٰ فى جَهَنَّمَ مَلومًا مَدحورًا"
    },
    {
      "index": "40",
      "text": "أَفَأَصفىٰكُم رَبُّكُم بِالبَنينَ وَاتَّخَذَ مِنَ المَلـٰئِكَةِ إِنـٰثًا ۚ إِنَّكُم لَتَقولونَ قَولًا عَظيمًا"
    },
    {
      "index": "41",
      "text": "وَلَقَد صَرَّفنا فى هـٰذَا القُرءانِ لِيَذَّكَّروا وَما يَزيدُهُم إِلّا نُفورًا"
    },
    {
      "index": "42",
      "text": "قُل لَو كانَ مَعَهُ ءالِهَةٌ كَما يَقولونَ إِذًا لَابتَغَوا إِلىٰ ذِى العَرشِ سَبيلًا"
    },
    {
      "index": "43",
      "text": "سُبحـٰنَهُ وَتَعـٰلىٰ عَمّا يَقولونَ عُلُوًّا كَبيرًا"
    },
    {
      "index": "44",
      "text": "تُسَبِّحُ لَهُ السَّمـٰوٰتُ السَّبعُ وَالأَرضُ وَمَن فيهِنَّ ۚ وَإِن مِن شَىءٍ إِلّا يُسَبِّحُ بِحَمدِهِ وَلـٰكِن لا تَفقَهونَ تَسبيحَهُم ۗ إِنَّهُ كانَ حَليمًا غَفورًا"
    },
    {
      "index": "45",
      "text": "وَإِذا قَرَأتَ القُرءانَ جَعَلنا بَينَكَ وَبَينَ الَّذينَ لا يُؤمِنونَ بِالـٔاخِرَةِ حِجابًا مَستورًا"
    },
    {
      "index": "46",
      "text": "وَجَعَلنا عَلىٰ قُلوبِهِم أَكِنَّةً أَن يَفقَهوهُ وَفى ءاذانِهِم وَقرًا ۚ وَإِذا ذَكَرتَ رَبَّكَ فِى القُرءانِ وَحدَهُ وَلَّوا عَلىٰ أَدبـٰرِهِم نُفورًا"
    },
    {
      "index": "47",
      "text": "نَحنُ أَعلَمُ بِما يَستَمِعونَ بِهِ إِذ يَستَمِعونَ إِلَيكَ وَإِذ هُم نَجوىٰ إِذ يَقولُ الظّـٰلِمونَ إِن تَتَّبِعونَ إِلّا رَجُلًا مَسحورًا"
    },
    {
      "index": "48",
      "text": "انظُر كَيفَ ضَرَبوا لَكَ الأَمثالَ فَضَلّوا فَلا يَستَطيعونَ سَبيلًا"
    },
    {
      "index": "49",
      "text": "وَقالوا أَءِذا كُنّا عِظـٰمًا وَرُفـٰتًا أَءِنّا لَمَبعوثونَ خَلقًا جَديدًا"
    },
    {
      "index": "50",
      "text": "۞ قُل كونوا حِجارَةً أَو حَديدًا"
    },
    {
      "index": "51",
      "text": "أَو خَلقًا مِمّا يَكبُرُ فى صُدورِكُم ۚ فَسَيَقولونَ مَن يُعيدُنا ۖ قُلِ الَّذى فَطَرَكُم أَوَّلَ مَرَّةٍ ۚ فَسَيُنغِضونَ إِلَيكَ رُءوسَهُم وَيَقولونَ مَتىٰ هُوَ ۖ قُل عَسىٰ أَن يَكونَ قَريبًا"
    },
    {
      "index": "52",
      "text": "يَومَ يَدعوكُم فَتَستَجيبونَ بِحَمدِهِ وَتَظُنّونَ إِن لَبِثتُم إِلّا قَليلًا"
    },
    {
      "index": "53",
      "text": "وَقُل لِعِبادى يَقولُوا الَّتى هِىَ أَحسَنُ ۚ إِنَّ الشَّيطـٰنَ يَنزَغُ بَينَهُم ۚ إِنَّ الشَّيطـٰنَ كانَ لِلإِنسـٰنِ عَدُوًّا مُبينًا"
    },
    {
      "index": "54",
      "text": "رَبُّكُم أَعلَمُ بِكُم ۖ إِن يَشَأ يَرحَمكُم أَو إِن يَشَأ يُعَذِّبكُم ۚ وَما أَرسَلنـٰكَ عَلَيهِم وَكيلًا"
    },
    {
      "index": "55",
      "text": "وَرَبُّكَ أَعلَمُ بِمَن فِى السَّمـٰوٰتِ وَالأَرضِ ۗ وَلَقَد فَضَّلنا بَعضَ النَّبِيّـۧنَ عَلىٰ بَعضٍ ۖ وَءاتَينا داوۥدَ زَبورًا"
    },
    {
      "index": "56",
      "text": "قُلِ ادعُوا الَّذينَ زَعَمتُم مِن دونِهِ فَلا يَملِكونَ كَشفَ الضُّرِّ عَنكُم وَلا تَحويلًا"
    },
    {
      "index": "57",
      "text": "أُولـٰئِكَ الَّذينَ يَدعونَ يَبتَغونَ إِلىٰ رَبِّهِمُ الوَسيلَةَ أَيُّهُم أَقرَبُ وَيَرجونَ رَحمَتَهُ وَيَخافونَ عَذابَهُ ۚ إِنَّ عَذابَ رَبِّكَ كانَ مَحذورًا"
    },
    {
      "index": "58",
      "text": "وَإِن مِن قَريَةٍ إِلّا نَحنُ مُهلِكوها قَبلَ يَومِ القِيـٰمَةِ أَو مُعَذِّبوها عَذابًا شَديدًا ۚ كانَ ذٰلِكَ فِى الكِتـٰبِ مَسطورًا"
    },
    {
      "index": "59",
      "text": "وَما مَنَعَنا أَن نُرسِلَ بِالـٔايـٰتِ إِلّا أَن كَذَّبَ بِهَا الأَوَّلونَ ۚ وَءاتَينا ثَمودَ النّاقَةَ مُبصِرَةً فَظَلَموا بِها ۚ وَما نُرسِلُ بِالـٔايـٰتِ إِلّا تَخويفًا"
    },
    {
      "index": "60",
      "text": "وَإِذ قُلنا لَكَ إِنَّ رَبَّكَ أَحاطَ بِالنّاسِ ۚ وَما جَعَلنَا الرُّءيَا الَّتى أَرَينـٰكَ إِلّا فِتنَةً لِلنّاسِ وَالشَّجَرَةَ المَلعونَةَ فِى القُرءانِ ۚ وَنُخَوِّفُهُم فَما يَزيدُهُم إِلّا طُغيـٰنًا كَبيرًا"
    },
    {
      "index": "61",
      "text": "وَإِذ قُلنا لِلمَلـٰئِكَةِ اسجُدوا لِـٔادَمَ فَسَجَدوا إِلّا إِبليسَ قالَ ءَأَسجُدُ لِمَن خَلَقتَ طينًا"
    },
    {
      "index": "62",
      "text": "قالَ أَرَءَيتَكَ هـٰذَا الَّذى كَرَّمتَ عَلَىَّ لَئِن أَخَّرتَنِ إِلىٰ يَومِ القِيـٰمَةِ لَأَحتَنِكَنَّ ذُرِّيَّتَهُ إِلّا قَليلًا"
    },
    {
      "index": "63",
      "text": "قالَ اذهَب فَمَن تَبِعَكَ مِنهُم فَإِنَّ جَهَنَّمَ جَزاؤُكُم جَزاءً مَوفورًا"
    },
    {
      "index": "64",
      "text": "وَاستَفزِز مَنِ استَطَعتَ مِنهُم بِصَوتِكَ وَأَجلِب عَلَيهِم بِخَيلِكَ وَرَجِلِكَ وَشارِكهُم فِى الأَموٰلِ وَالأَولـٰدِ وَعِدهُم ۚ وَما يَعِدُهُمُ الشَّيطـٰنُ إِلّا غُرورًا"
    },
    {
      "index": "65",
      "text": "إِنَّ عِبادى لَيسَ لَكَ عَلَيهِم سُلطـٰنٌ ۚ وَكَفىٰ بِرَبِّكَ وَكيلًا"
    },
    {
      "index": "66",
      "text": "رَبُّكُمُ الَّذى يُزجى لَكُمُ الفُلكَ فِى البَحرِ لِتَبتَغوا مِن فَضلِهِ ۚ إِنَّهُ كانَ بِكُم رَحيمًا"
    },
    {
      "index": "67",
      "text": "وَإِذا مَسَّكُمُ الضُّرُّ فِى البَحرِ ضَلَّ مَن تَدعونَ إِلّا إِيّاهُ ۖ فَلَمّا نَجّىٰكُم إِلَى البَرِّ أَعرَضتُم ۚ وَكانَ الإِنسـٰنُ كَفورًا"
    },
    {
      "index": "68",
      "text": "أَفَأَمِنتُم أَن يَخسِفَ بِكُم جانِبَ البَرِّ أَو يُرسِلَ عَلَيكُم حاصِبًا ثُمَّ لا تَجِدوا لَكُم وَكيلًا"
    },
    {
      "index": "69",
      "text": "أَم أَمِنتُم أَن يُعيدَكُم فيهِ تارَةً أُخرىٰ فَيُرسِلَ عَلَيكُم قاصِفًا مِنَ الرّيحِ فَيُغرِقَكُم بِما كَفَرتُم ۙ ثُمَّ لا تَجِدوا لَكُم عَلَينا بِهِ تَبيعًا"
    },
    {
      "index": "70",
      "text": "۞ وَلَقَد كَرَّمنا بَنى ءادَمَ وَحَمَلنـٰهُم فِى البَرِّ وَالبَحرِ وَرَزَقنـٰهُم مِنَ الطَّيِّبـٰتِ وَفَضَّلنـٰهُم عَلىٰ كَثيرٍ مِمَّن خَلَقنا تَفضيلًا"
    },
    {
      "index": "71",
      "text": "يَومَ نَدعوا كُلَّ أُناسٍ بِإِمـٰمِهِم ۖ فَمَن أوتِىَ كِتـٰبَهُ بِيَمينِهِ فَأُولـٰئِكَ يَقرَءونَ كِتـٰبَهُم وَلا يُظلَمونَ فَتيلًا"
    },
    {
      "index": "72",
      "text": "وَمَن كانَ فى هـٰذِهِ أَعمىٰ فَهُوَ فِى الـٔاخِرَةِ أَعمىٰ وَأَضَلُّ سَبيلًا"
    },
    {
      "index": "73",
      "text": "وَإِن كادوا لَيَفتِنونَكَ عَنِ الَّذى أَوحَينا إِلَيكَ لِتَفتَرِىَ عَلَينا غَيرَهُ ۖ وَإِذًا لَاتَّخَذوكَ خَليلًا"
    },
    {
      "index": "74",
      "text": "وَلَولا أَن ثَبَّتنـٰكَ لَقَد كِدتَ تَركَنُ إِلَيهِم شَيـًٔا قَليلًا"
    },
    {
      "index": "75",
      "text": "إِذًا لَأَذَقنـٰكَ ضِعفَ الحَيوٰةِ وَضِعفَ المَماتِ ثُمَّ لا تَجِدُ لَكَ عَلَينا نَصيرًا"
    },
    {
      "index": "76",
      "text": "وَإِن كادوا لَيَستَفِزّونَكَ مِنَ الأَرضِ لِيُخرِجوكَ مِنها ۖ وَإِذًا لا يَلبَثونَ خِلـٰفَكَ إِلّا قَليلًا"
    },
    {
      "index": "77",
      "text": "سُنَّةَ مَن قَد أَرسَلنا قَبلَكَ مِن رُسُلِنا ۖ وَلا تَجِدُ لِسُنَّتِنا تَحويلًا"
    },
    {
      "index": "78",
      "text": "أَقِمِ الصَّلوٰةَ لِدُلوكِ الشَّمسِ إِلىٰ غَسَقِ الَّيلِ وَقُرءانَ الفَجرِ ۖ إِنَّ قُرءانَ الفَجرِ كانَ مَشهودًا"
    },
    {
      "index": "79",
      "text": "وَمِنَ الَّيلِ فَتَهَجَّد بِهِ نافِلَةً لَكَ عَسىٰ أَن يَبعَثَكَ رَبُّكَ مَقامًا مَحمودًا"
    },
    {
      "index": "80",
      "text": "وَقُل رَبِّ أَدخِلنى مُدخَلَ صِدقٍ وَأَخرِجنى مُخرَجَ صِدقٍ وَاجعَل لى مِن لَدُنكَ سُلطـٰنًا نَصيرًا"
    },
    {
      "index": "81",
      "text": "وَقُل جاءَ الحَقُّ وَزَهَقَ البـٰطِلُ ۚ إِنَّ البـٰطِلَ كانَ زَهوقًا"
    },
    {
      "index": "82",
      "text": "وَنُنَزِّلُ مِنَ القُرءانِ ما هُوَ شِفاءٌ وَرَحمَةٌ لِلمُؤمِنينَ ۙ وَلا يَزيدُ الظّـٰلِمينَ إِلّا خَسارًا"
    },
    {
      "index": "83",
      "text": "وَإِذا أَنعَمنا عَلَى الإِنسـٰنِ أَعرَضَ وَنَـٔا بِجانِبِهِ ۖ وَإِذا مَسَّهُ الشَّرُّ كانَ يَـٔوسًا"
    },
    {
      "index": "84",
      "text": "قُل كُلٌّ يَعمَلُ عَلىٰ شاكِلَتِهِ فَرَبُّكُم أَعلَمُ بِمَن هُوَ أَهدىٰ سَبيلًا"
    },
    {
      "index": "85",
      "text": "وَيَسـَٔلونَكَ عَنِ الرّوحِ ۖ قُلِ الرّوحُ مِن أَمرِ رَبّى وَما أوتيتُم مِنَ العِلمِ إِلّا قَليلًا"
    },
    {
      "index": "86",
      "text": "وَلَئِن شِئنا لَنَذهَبَنَّ بِالَّذى أَوحَينا إِلَيكَ ثُمَّ لا تَجِدُ لَكَ بِهِ عَلَينا وَكيلًا"
    },
    {
      "index": "87",
      "text": "إِلّا رَحمَةً مِن رَبِّكَ ۚ إِنَّ فَضلَهُ كانَ عَلَيكَ كَبيرًا"
    },
    {
      "index": "88",
      "text": "قُل لَئِنِ اجتَمَعَتِ الإِنسُ وَالجِنُّ عَلىٰ أَن يَأتوا بِمِثلِ هـٰذَا القُرءانِ لا يَأتونَ بِمِثلِهِ وَلَو كانَ بَعضُهُم لِبَعضٍ ظَهيرًا"
    },
    {
      "index": "89",
      "text": "وَلَقَد صَرَّفنا لِلنّاسِ فى هـٰذَا القُرءانِ مِن كُلِّ مَثَلٍ فَأَبىٰ أَكثَرُ النّاسِ إِلّا كُفورًا"
    },
    {
      "index": "90",
      "text": "وَقالوا لَن نُؤمِنَ لَكَ حَتّىٰ تَفجُرَ لَنا مِنَ الأَرضِ يَنبوعًا"
    },
    {
      "index": "91",
      "text": "أَو تَكونَ لَكَ جَنَّةٌ مِن نَخيلٍ وَعِنَبٍ فَتُفَجِّرَ الأَنهـٰرَ خِلـٰلَها تَفجيرًا"
    },
    {
      "index": "92",
      "text": "أَو تُسقِطَ السَّماءَ كَما زَعَمتَ عَلَينا كِسَفًا أَو تَأتِىَ بِاللَّهِ وَالمَلـٰئِكَةِ قَبيلًا"
    },
    {
      "index": "93",
      "text": "أَو يَكونَ لَكَ بَيتٌ مِن زُخرُفٍ أَو تَرقىٰ فِى السَّماءِ وَلَن نُؤمِنَ لِرُقِيِّكَ حَتّىٰ تُنَزِّلَ عَلَينا كِتـٰبًا نَقرَؤُهُ ۗ قُل سُبحانَ رَبّى هَل كُنتُ إِلّا بَشَرًا رَسولًا"
    },
    {
      "index": "94",
      "text": "وَما مَنَعَ النّاسَ أَن يُؤمِنوا إِذ جاءَهُمُ الهُدىٰ إِلّا أَن قالوا أَبَعَثَ اللَّهُ بَشَرًا رَسولًا"
    },
    {
      "index": "95",
      "text": "قُل لَو كانَ فِى الأَرضِ مَلـٰئِكَةٌ يَمشونَ مُطمَئِنّينَ لَنَزَّلنا عَلَيهِم مِنَ السَّماءِ مَلَكًا رَسولًا"
    },
    {
      "index": "96",
      "text": "قُل كَفىٰ بِاللَّهِ شَهيدًا بَينى وَبَينَكُم ۚ إِنَّهُ كانَ بِعِبادِهِ خَبيرًا بَصيرًا"
    },
    {
      "index": "97",
      "text": "وَمَن يَهدِ اللَّهُ فَهُوَ المُهتَدِ ۖ وَمَن يُضلِل فَلَن تَجِدَ لَهُم أَولِياءَ مِن دونِهِ ۖ وَنَحشُرُهُم يَومَ القِيـٰمَةِ عَلىٰ وُجوهِهِم عُميًا وَبُكمًا وَصُمًّا ۖ مَأوىٰهُم جَهَنَّمُ ۖ كُلَّما خَبَت زِدنـٰهُم سَعيرًا"
    },
    {
      "index": "98",
      "text": "ذٰلِكَ جَزاؤُهُم بِأَنَّهُم كَفَروا بِـٔايـٰتِنا وَقالوا أَءِذا كُنّا عِظـٰمًا وَرُفـٰتًا أَءِنّا لَمَبعوثونَ خَلقًا جَديدًا"
    },
    {
      "index": "99",
      "text": "۞ أَوَلَم يَرَوا أَنَّ اللَّهَ الَّذى خَلَقَ السَّمـٰوٰتِ وَالأَرضَ قادِرٌ عَلىٰ أَن يَخلُقَ مِثلَهُم وَجَعَلَ لَهُم أَجَلًا لا رَيبَ فيهِ فَأَبَى الظّـٰلِمونَ إِلّا كُفورًا"
    },
    {
      "index": "100",
      "text": "قُل لَو أَنتُم تَملِكونَ خَزائِنَ رَحمَةِ رَبّى إِذًا لَأَمسَكتُم خَشيَةَ الإِنفاقِ ۚ وَكانَ الإِنسـٰنُ قَتورًا"
    },
    {
      "index": "101",
      "text": "وَلَقَد ءاتَينا موسىٰ تِسعَ ءايـٰتٍ بَيِّنـٰتٍ ۖ فَسـَٔل بَنى إِسرٰءيلَ إِذ جاءَهُم فَقالَ لَهُ فِرعَونُ إِنّى لَأَظُنُّكَ يـٰموسىٰ مَسحورًا"
    },
    {
      "index": "102",
      "text": "قالَ لَقَد عَلِمتَ ما أَنزَلَ هـٰؤُلاءِ إِلّا رَبُّ السَّمـٰوٰتِ وَالأَرضِ بَصائِرَ وَإِنّى لَأَظُنُّكَ يـٰفِرعَونُ مَثبورًا"
    },
    {
      "index": "103",
      "text": "فَأَرادَ أَن يَستَفِزَّهُم مِنَ الأَرضِ فَأَغرَقنـٰهُ وَمَن مَعَهُ جَميعًا"
    },
    {
      "index": "104",
      "text": "وَقُلنا مِن بَعدِهِ لِبَنى إِسرٰءيلَ اسكُنُوا الأَرضَ فَإِذا جاءَ وَعدُ الـٔاخِرَةِ جِئنا بِكُم لَفيفًا"
    },
    {
      "index": "105",
      "text": "وَبِالحَقِّ أَنزَلنـٰهُ وَبِالحَقِّ نَزَلَ ۗ وَما أَرسَلنـٰكَ إِلّا مُبَشِّرًا وَنَذيرًا"
    },
    {
      "index": "106",
      "text": "وَقُرءانًا فَرَقنـٰهُ لِتَقرَأَهُ عَلَى النّاسِ عَلىٰ مُكثٍ وَنَزَّلنـٰهُ تَنزيلًا"
    },
    {
      "index": "107",
      "text": "قُل ءامِنوا بِهِ أَو لا تُؤمِنوا ۚ إِنَّ الَّذينَ أوتُوا العِلمَ مِن قَبلِهِ إِذا يُتلىٰ عَلَيهِم يَخِرّونَ لِلأَذقانِ سُجَّدًا"
    },
    {
      "index": "108",
      "text": "وَيَقولونَ سُبحـٰنَ رَبِّنا إِن كانَ وَعدُ رَبِّنا لَمَفعولًا"
    },
    {
      "index": "109",
      "text": "وَيَخِرّونَ لِلأَذقانِ يَبكونَ وَيَزيدُهُم خُشوعًا ۩"
    },
    {
      "index": "110",
      "text": "قُلِ ادعُوا اللَّهَ أَوِ ادعُوا الرَّحمـٰنَ ۖ أَيًّا ما تَدعوا فَلَهُ الأَسماءُ الحُسنىٰ ۚ وَلا تَجهَر بِصَلاتِكَ وَلا تُخافِت بِها وَابتَغِ بَينَ ذٰلِكَ سَبيلًا"
    },
    {
      "index": "111",
      "text": "وَقُلِ الحَمدُ لِلَّهِ الَّذى لَم يَتَّخِذ وَلَدًا وَلَم يَكُن لَهُ شَريكٌ فِى المُلكِ وَلَم يَكُن لَهُ وَلِىٌّ مِنَ الذُّلِّ ۖ وَكَبِّرهُ تَكبيرًا"
    }
  ],
  "index": "17",
  "name": "الإسراء",
  "copyright": "# PLEASE DO NOT REMOVE OR CHANGE THIS COPYRIGHT BLOCK \n#==================================================================== \n#\n#  Tanzil Quran Text (Uthmani Minimal, Version 1.1)\n#  Copyright (C) 2007-2022 Tanzil Project\n#  License: Creative Commons Attribution 3.0\n#\n#  This copy of the Quran text is carefully produced, highly \n#  verified and continuously monitored by a group of specialists \n#  at Tanzil Project.\n#\n#  TERMS OF USE:\n#\n#  - Permission is granted to copy and distribute verbatim copies \n#    of this text, but CHANGING IT IS NOT ALLOWED.\n#\n#  - This Quran text can be used in any website or application, \n#    provided that its source (Tanzil Project) is clearly indicated, \n#    and a link is made to tanzil.net to enable users to keep\n#    track of changes.\n#\n#  - This copyright notice shall be included in all verbatim copies \n#    of the text, and shall be reproduced appropriately in all files \n#    derived from or containing substantial portion of this text.\n#\n#  Please check updates at: http://tanzil.net/updates/\n#\n#====================================================================\n",
  "type": "uthmani-min",
  "version": "1.1"
}