{
  "aya": [
    {
      "index": "1",
      "text": "إِذَا ٱلسَّمَآءُ ٱنشَقَّتْ",
      "bismillah": "بِسْمِ ٱللَّهِ ٱلرَّحْمَـٰنِ ٱلرَّحِيمِ"
    },
    {
      "index": "2",
      "text": "وَأَذِنَتْ لِرَبِّهَا وَحُقَّتْ"
    },
    {
      "index": "3",
      "text": "وَإِذَا ٱلْأَرْضُ مُدَّتْ"
    },
    {
      "index": "4",
      "text": "وَأَلْقَتْ مَا فِيهَا وَتَخَلَّتْ"
    },
    {
      "index": "5",
      "text": "وَأَذِنَتْ لِرَبِّهَا وَحُقَّتْ"
    },
    {
      "index": "6",
      "text": "يَـٰٓأَيُّهَا ٱلْإِنسَـٰنُ إِنَّكَ كَادِحٌ إِلَىٰ رَبِّكَ كَدْحًا فَمُلَـٰقِيهِ"
    },
    {
      "index": "7",
      "text": "فَأَمَّا مَنْ أُوتِىَ كِتَـٰبَهُۥ بِيَمِينِهِۦ"
    },
    {
      "index": "8",
      "text": "فَسَوْفَ يُحَاسَبُ حِسَابًا يَسِيرًا"
    },
    {
      "index": "9",
      "text": "وَيَنقَلِبُ إِلَىٰٓ أَهْلِهِۦ مَسْرُورًا"
    },
    {
      "index": "10",
      "text": "وَأَمَّا مَنْ أُوتِىَ كِتَـٰبَهُۥ وَرَآءَ ظَهْرِهِۦ"
    },
    {
      "index": "11",
      "text": "فَسَوْفَ يَدْعُوا۟ ثُبُورًا"
    },
    {
      "index": "12",
      "text": "وَيَصْلَىٰ سَعِيرًا"
    },
    {
      "index": "13",
      "text": "إِنَّهُۥ كَانَ فِىٓ أَهْلِهِۦ مَسْرُورًا"
    },
    {
      "index": "14",
      "text": "إِنَّهُۥ ظَنَّ أَن لَّن يَحُورَ"
    },
    {
      "index": "15",
      "text": "بَلَىٰٓ إِنَّ رَبَّهُۥ كَانَ بِهِۦ بَصِيرًا"
    },
    {
      "index": "16",
      "text": "فَلَآ أُقْسِمُ بِٱلشَّفَقِ"
    },
    {
      "index": "17",
      "text": "وَٱلَّيْلِ وَمَا وَسَقَ"
    },
    {
      "index": "18",
      "text": "وَٱلْقَمَرِ إِذَا ٱتَّسَقَ"
    },
    {
      "index": "19",
      "text": "لَتَرْكَبُنَّ طَبَقًا عَن طَبَقٍ"
    },
    {
      "index": "20",
      "text": "فَمَا لَهُمْ لَا يُؤْمِنُونَ"
    },
    {
      "index": "21",
      "text": "وَإِذَا قُرِئَ عَلَيْهِمُ ٱلْقُرْءَانُ لَا يَسْجُدُونَ ۩"
    },
    {
      "index": "22",
      "text": "بَلِ ٱلَّذِينَ كَفَرُوا۟ يُكَذِّبُونَ"
    },
    {
      "index": "23",
      "text": "وَٱللَّهُ أَعْلَمُ بِمَا يُوعُونَ"
    },
    {
      "index": "24",
      "text": "فَبَشِّرْهُم بِعَذَابٍ أَلِيمٍ"
    },
    {
      "index": "25",
      "text": "إِلَّا ٱلَّذِينَ ءَامَنُوا۟ وَعَمِلُوا۟ ٱلصَّـٰلِحَـٰتِ لَهُمْ أَجْرٌ غَيْرُ مَمْنُونٍۭ"
    }
  ],
  "index": "84",
  "name": "الإنشقاق",
  "copyright": "# PLEASE DO NOT REMOVE OR CHANGE THIS COPYRIGHT BLOCK \n#==================================================================== \n#\n#  Tanzil Quran Text (Uthmani, Version 1.1)\n#  Copyright (C) 2007-2022 Tanzil Project\n#  License: Creative Commons Attribution 3.0\n#\n#  This copy of the Quran text is carefully produced, highly \n#  verified and continuously monitored by a group of specialists \n#  at Tanzil Project.\n#\n#  TERMS OF USE:\n#\n#  - Permission is granted to copy and distribute verbatim copies \n#    of this text, but CHANGING IT IS NOT ALLOWED.\n#\n#  - This Quran text can be used in any website or application, \n#    provided that its source (Tanzil Project) is clearly indicated, \n#    and a link is made to tanzil.net to enable users to keep\n#    track of changes.\n#\n#  - This copyright notice shall be included in all verbatim copies \n#    of the text, and shall be reproduced appropriately in all files \n#    derived from or containing substantial portion of this text.\n#\n#  Please check updates at: http://tanzil.net/updates/\n#\n#====================================================================\n",
  "type": "uthmani",
  "version": "1.1"
}