{
  "aya": [
    {
      "index": "1",
      "text": "وَٱلذَّٰرِيَـٰتِ ذَرْوًا",
      "bismillah": "بِسْمِ ٱللَّهِ ٱلرَّحْمَـٰنِ ٱلرَّحِيمِ"
    },
    {
      "index": "2",
      "text": "فَٱلْحَـٰمِلَـٰتِ وِقْرًا"
    },
    {
      "index": "3",
      "text": "فَٱلْجَـٰرِيَـٰتِ يُسْرًا"
    },
    {
      "index": "4",
      "text": "فَٱلْمُقَسِّمَـٰتِ أَمْرًا"
    },
    {
      "index": "5",
      "text": "إِنَّمَا تُوعَدُونَ لَصَادِقٌ"
    },
    {
      "index": "6",
      "text": "وَإِنَّ ٱلدِّينَ لَوَٰقِعٌ"
    },
    {
      "index": "7",
      "text": "وَٱلسَّمَآءِ ذَاتِ ٱلْحُبُكِ"
    },
    {
      "index": "8",
      "text": "إِنَّكُمْ لَفِى قَوْلٍ مُّخْتَلِفٍ"
    },
    {
      "index": "9",
      "text": "يُؤْفَكُ عَنْهُ مَنْ أُفِكَ"
    },
    {
      "index": "10",
      "text": "قُتِلَ ٱلْخَرَّٰصُونَ"
    },
    {
      "index": "11",
      "text": "ٱلَّذِينَ هُمْ فِى غَمْرَةٍ سَاهُونَ"
    },
    {
      "index": "12",
      "text": "يَسْـَٔلُونَ أَيَّانَ يَوْمُ ٱلدِّينِ"
    },
    {
      "index": "13",
      "text": "يَوْمَ هُمْ عَلَى ٱلنَّارِ يُفْتَنُونَ"
    },
    {
      "index": "14",
      "text": "ذُوقُوا۟ فِتْنَتَكُمْ هَـٰذَا ٱلَّذِى كُنتُم بِهِۦ تَسْتَعْجِلُونَ"
    },
    {
      "index": "15",
      "text": "إِنَّ ٱلْمُتَّقِينَ فِى جَنَّـٰتٍ وَعُيُونٍ"
    },
    {
      "index": "16",
      "text": "ءَاخِذِينَ مَآ ءَاتَىٰهُمْ رَبُّهُمْ ۚ إِنَّهُمْ كَانُوا۟ قَبْلَ ذَٰلِكَ مُحْسِنِينَ"
    },
    {
      "index": "17",
      "text": "كَانُوا۟ قَلِيلًا مِّنَ ٱلَّيْلِ مَا يَهْجَعُونَ"
    },
    {
      "index": "18",
      "text": "وَبِٱلْأَسْحَارِ هُمْ يَسْتَغْفِرُونَ"
    },
    {
      "index": "19",
      "text": "وَفِىٓ أَمْوَٰلِهِمْ حَقٌّ لِّلسَّآئِلِ وَٱلْمَحْرُومِ"
    },
    {
      "index": "20",
      "text": "وَفِى ٱلْأَرْضِ ءَايَـٰتٌ لِّلْمُوقِنِينَ"
    },
    {
      "index": "21",
      "text": "وَفِىٓ أَنفُسِكُمْ ۚ أَفَلَا تُبْصِرُونَ"
    },
    {
      "index": "22",
      "text": "وَفِى ٱلسَّمَآءِ رِزْقُكُمْ وَمَا تُوعَدُونَ"
    },
    {
      "index": "23",
      "text": "فَوَرَبِّ ٱلسَّمَآءِ وَٱلْأَرْضِ إِنَّهُۥ لَحَقٌّ مِّثْلَ مَآ أَنَّكُمْ تَنطِقُونَ"
    },
    {
      "index": "24",
      "text": "هَلْ أَتَىٰكَ حَدِيثُ ضَيْفِ إِبْرَٰهِيمَ ٱلْمُكْرَمِينَ"
    },
    {
      "index": "25",
      "text": "إِذْ دَخَلُوا۟ عَلَيْهِ فَقَالُوا۟ سَلَـٰمًا ۖ قَالَ سَلَـٰمٌ قَوْمٌ مُّنكَرُونَ"
    },
    {
      "index": "26",
      "text": "فَرَاغَ إِلَىٰٓ أَهْلِهِۦ فَجَآءَ بِعِجْلٍ سَمِينٍ"
    },
    {
      "index": "27",
      "text": "فَقَرَّبَهُۥٓ إِلَيْهِمْ قَالَ أَلَا تَأْكُلُونَ"
    },
    {
      "index": "28",
      "text": "فَأَوْجَسَ مِنْهُمْ خِيفَةً ۖ قَالُوا۟ لَا تَخَفْ ۖ وَبَشَّرُوهُ بِغُلَـٰمٍ عَلِيمٍ"
    },
    {
      "index": "29",
      "text": "فَأَقْبَلَتِ ٱمْرَأَتُهُۥ فِى صَرَّةٍ فَصَكَّتْ وَجْهَهَا وَقَالَتْ عَجُوزٌ عَقِيمٌ"
    },
    {
      "index": "30",
      "text": "قَالُوا۟ كَذَٰلِكِ قَالَ رَبُّكِ ۖ إِنَّهُۥ هُوَ ٱلْحَكِيمُ ٱلْعَلِيمُ"
    },
    {
      "index": "31",
      "text": "۞ قَالَ فَمَا خَطْبُكُمْ أَيُّهَا ٱلْمُرْسَلُونَ"
    },
    {
      "index": "32",
      "text": "قَالُوٓا۟ إِنَّآ أُرْسِلْنَآ إِلَىٰ قَوْمٍ مُّجْرِمِينَ"
    },
    {
      "index": "33",
      "text": "لِنُرْسِلَ عَلَيْهِمْ حِجَارَةً مِّن طِينٍ"
    },
    {
      "index": "34",
      "text": "مُّسَوَّمَةً عِندَ رَبِّكَ لِلْمُسْرِفِينَ"
    },
    {
      "index": "35",
      "text": "فَأَخْرَجْنَا مَن كَانَ فِيهَا مِنَ ٱلْمُؤْمِنِينَ"
    },
    {
      "index": "36",
      "text": "فَمَا وَجَدْنَا فِيهَا غَيْرَ بَيْتٍ مِّنَ ٱلْمُسْلِمِينَ"
    },
    {
      "index": "37",
      "text": "وَتَرَكْنَا فِيهَآ ءَايَةً لِّلَّذِينَ يَخَافُونَ ٱلْعَذَابَ ٱلْأَلِيمَ"
    },
    {
      "index": "38",
      "text": "وَفِى مُوسَىٰٓ إِذْ أَرْسَلْنَـٰهُ إِلَىٰ فِرْعَوْنَ بِسُلْطَـٰنٍ مُّبِينٍ"
    },
    {
      "index": "39",
      "text": "فَتَوَلَّىٰ بِرُكْنِهِۦ وَقَالَ سَـٰحِرٌ أَوْ مَجْنُونٌ"
    },
    {
      "index": "40",
      "text": "فَأَخَذْنَـٰهُ وَجُنُودَهُۥ فَنَبَذْنَـٰهُمْ فِى ٱلْيَمِّ وَهُوَ مُلِيمٌ"
    },
    {
      "index": "41",
      "text": "وَفِى عَادٍ إِذْ أَرْسَلْنَا عَلَيْهِمُ ٱلرِّيحَ ٱلْعَقِيمَ"
    },
    {
      "index": "42",
      "text": "مَا تَذَرُ مِن شَىْءٍ أَتَتْ عَلَيْهِ إِلَّا جَعَلَتْهُ كَٱلرَّمِيمِ"
    },
    {
      "index": "43",
      "text": "وَفِى ثَمُودَ إِذْ قِيلَ لَهُمْ تَمَتَّعُوا۟ حَتَّىٰ حِينٍ"
    },
    {
      "index": "44",
      "text": "فَعَتَوْا۟ عَنْ أَمْرِ رَبِّهِمْ فَأَخَذَتْهُمُ ٱلصَّـٰعِقَةُ وَهُمْ يَنظُرُونَ"
    },
    {
      "index": "45",
      "text": "فَمَا ٱسْتَطَـٰعُوا۟ مِن قِيَامٍ وَمَا كَانُوا۟ مُنتَصِرِينَ"
    },
    {
      "index": "46",
      "text": "وَقَوْمَ نُوحٍ مِّن قَبْلُ ۖ إِنَّهُمْ كَانُوا۟ قَوْمًا فَـٰسِقِينَ"
    },
    {
      "index": "47",
      "text": "وَٱلسَّمَآءَ بَنَيْنَـٰهَا بِأَيْي۟دٍ وَإِنَّا لَمُوسِعُونَ"
    },
    {
      "index": "48",
      "text": "وَٱلْأَرْضَ فَرَشْنَـٰهَا فَنِعْمَ ٱلْمَـٰهِدُونَ"
    },
    {
      "index": "49",
      "text": "وَمِن كُلِّ شَىْءٍ خَلَقْنَا زَوْجَيْنِ لَعَلَّكُمْ تَذَكَّرُونَ"
    },
    {
      "index": "50",
      "text": "فَفِرُّوٓا۟ إِلَى ٱللَّهِ ۖ إِنِّى لَكُم مِّنْهُ نَذِيرٌ مُّبِينٌ"
    },
    {
      "index": "51",
      "text": "وَلَا تَجْعَلُوا۟ مَعَ ٱللَّهِ إِلَـٰهًا ءَاخَرَ ۖ إِنِّى لَكُم مِّنْهُ نَذِيرٌ مُّبِينٌ"
    },
    {
      "index": "52",
      "text": "كَذَٰلِكَ مَآ أَتَى ٱلَّذِينَ مِن قَبْلِهِم مِّن رَّسُولٍ إِلَّا قَالُوا۟ سَاحِرٌ أَوْ مَجْنُونٌ"
    },
    {
      "index": "53",
      "text": "أَتَوَاصَوْا۟ بِهِۦ ۚ بَلْ هُمْ قَوْمٌ طَاغُونَ"
    },
    {
      "index": "54",
      "text": "فَتَوَلَّ عَنْهُمْ فَمَآ أَنتَ بِمَلُومٍ"
    },
    {
      "index": "55",
      "text": "وَذَكِّرْ فَإِنَّ ٱلذِّكْرَىٰ تَنفَعُ ٱلْمُؤْمِنِينَ"
    },
    {
      "index": "56",
      "text": "وَمَا خَلَقْتُ ٱلْجِنَّ وَٱلْإِنسَ إِلَّا لِيَعْبُدُونِ"
    },
    {
      "index": "57",
      "text": "مَآ أُرِيدُ مِنْهُم مِّن رِّزْقٍ وَمَآ أُرِيدُ أَن يُطْعِمُونِ"
    },
    {
      "index": "58",
      "text": "إِنَّ ٱللَّهَ هُوَ ٱلرَّزَّاقُ ذُو ٱلْقُوَّةِ ٱلْمَتِينُ"
    },
    {
      "index": "59",
      "text": "فَإِنَّ لِلَّذِينَ ظَلَمُوا۟ ذَنُوبًا مِّثْلَ ذَنُوبِ أَصْحَـٰبِهِمْ فَلَا يَسْتَعْجِلُونِ"
    },
    {
      "index": "60",
      "text": "فَوَيْلٌ لِّلَّذِينَ كَفَرُوا۟ مِن يَوْمِهِمُ ٱلَّذِى يُوعَدُونَ"
    }
  ],
  "index": "51",
  "name": "الذاريات",
  "copyright": "# PLEASE DO NOT REMOVE OR CHANGE THIS COPYRIGHT BLOCK \n#==================================================================== \n#\n#  Tanzil Quran Text (Uthmani, Version 1.1)\n#  Copyright (C) 2007-2022 Tanzil Project\n#  License: Creative Commons Attribution 3.0\n#\n#  This copy of the Quran text is carefully produced, highly \n#  verified and continuously monitored by a group of specialists \n#  at Tanzil Project.\n#\n#  TERMS OF USE:\n#\n#  - Permission is granted to copy and distribute verbatim copies \n#    of this text, but CHANGING IT IS NOT ALLOWED.\n#\n#  - This Quran text can be used in any website or application, \n#    provided that its source (Tanzil Project) is clearly indicated, \n#    and a link is made to tanzil.net to enable users to keep\n#    track of changes.\n#\n#  - This copyright notice shall be included in all verbatim copies \n#    of the text, and shall be reproduced appropriately in all files \n#    derived from or containing substantial portion of this text.\n#\n#  Please check updates at: http://tanzil.net/updates/\n#\n#====================================================================\n",
  "type": "uthmani",
  "version": "1.1"
}