{
  "aya": [
    {
      "index": "1",
      "text": "عَبَسَ وَتَوَلّىٰ",
      "bismillah": "بِسمِ اللَّهِ الرَّحمـٰنِ الرَّحيمِ"
    },
    {
      "index": "2",
      "text": "أَن جاءَهُ الأَعمىٰ"
    },
    {
      "index": "3",
      "text": "وَما يُدريكَ لَعَلَّهُ يَزَّكّىٰ"
    },
    {
      "index": "4",
      "text": "أَو يَذَّكَّرُ فَتَنفَعَهُ الذِّكرىٰ"
    },
    {
      "index": "5",
      "text": "أَمّا مَنِ استَغنىٰ"
    },
    {
      "index": "6",
      "text": "فَأَنتَ لَهُ تَصَدّىٰ"
    },
    {
      "index": "7",
      "text": "وَما عَلَيكَ أَلّا يَزَّكّىٰ"
    },
    {
      "index": "8",
      "text": "وَأَمّا مَن جاءَكَ يَسعىٰ"
    },
    {
      "index": "9",
      "text": "وَهُوَ يَخشىٰ"
    },
    {
      "index": "10",
      "text": "فَأَنتَ عَنهُ تَلَهّىٰ"
    },
    {
      "index": "11",
      "text": "كَلّا إِنَّها تَذكِرَةٌ"
    },
    {
      "index": "12",
      "text": "فَمَن شاءَ ذَكَرَهُ"
    },
    {
      "index": "13",
      "text": "فى صُحُفٍ مُكَرَّمَةٍ"
    },
    {
      "index": "14",
      "text": "مَرفوعَةٍ مُطَهَّرَةٍ"
    },
    {
      "index": "15",
      "text": "بِأَيدى سَفَرَةٍ"
    },
    {
      "index": "16",
      "text": "كِرامٍ بَرَرَةٍ"
    },
    {
      "index": "17",
      "text": "قُتِلَ الإِنسـٰنُ ما أَكفَرَهُ"
    },
    {
      "index": "18",
      "text": "مِن أَىِّ شَىءٍ خَلَقَهُ"
    },
    {
      "index": "19",
      "text": "مِن نُطفَةٍ خَلَقَهُ فَقَدَّرَهُ"
    },
    {
      "index": "20",
      "text": "ثُمَّ السَّبيلَ يَسَّرَهُ"
    },
    {
      "index": "21",
      "text": "ثُمَّ أَماتَهُ فَأَقبَرَهُ"
    },
    {
      "index": "22",
      "text": "ثُمَّ إِذا شاءَ أَنشَرَهُ"
    },
    {
      "index": "23",
      "text": "كَلّا لَمّا يَقضِ ما أَمَرَهُ"
    },
    {
      "index": "24",
      "text": "فَليَنظُرِ الإِنسـٰنُ إِلىٰ طَعامِهِ"
    },
    {
      "index": "25",
      "text": "أَنّا صَبَبنَا الماءَ صَبًّا"
    },
    {
      "index": "26",
      "text": "ثُمَّ شَقَقنَا الأَرضَ شَقًّا"
    },
    {
      "index": "27",
      "text": "فَأَنبَتنا فيها حَبًّا"
    },
    {
      "index": "28",
      "text": "وَعِنَبًا وَقَضبًا"
    },
    {
      "index": "29",
      "text": "وَزَيتونًا وَنَخلًا"
    },
    {
      "index": "30",
      "text": "وَحَدائِقَ غُلبًا"
    },
    {
      "index": "31",
      "text": "وَفـٰكِهَةً وَأَبًّا"
    },
    {
      "index": "32",
      "text": "مَتـٰعًا لَكُم وَلِأَنعـٰمِكُم"
    },
    {
      "index": "33",
      "text": "فَإِذا جاءَتِ الصّاخَّةُ"
    },
    {
      "index": "34",
      "text": "يَومَ يَفِرُّ المَرءُ مِن أَخيهِ"
    },
    {
      "index": "35",
      "text": "وَأُمِّهِ وَأَبيهِ"
    },
    {
      "index": "36",
      "text": "وَصـٰحِبَتِهِ وَبَنيهِ"
    },
    {
      "index": "37",
      "text": "لِكُلِّ امرِئٍ مِنهُم يَومَئِذٍ شَأنٌ يُغنيهِ"
    },
    {
      "index": "38",
      "text": "وُجوهٌ يَومَئِذٍ مُسفِرَةٌ"
    },
    {
      "index": "39",
      "text": "ضاحِكَةٌ مُستَبشِرَةٌ"
    },
    {
      "index": "40",
      "text": "وَوُجوهٌ يَومَئِذٍ عَلَيها غَبَرَةٌ"
    },
    {
      "index": "41",
      "text": "تَرهَقُها قَتَرَةٌ"
    },
    {
      "index": "42",
      "text": "أُولـٰئِكَ هُمُ الكَفَرَةُ الفَجَرَةُ"
    }
  ],
  "index": "80",
  "name": "عبس",
  "copyright": "# PLEASE DO NOT REMOVE OR CHANGE THIS COPYRIGHT BLOCK \n#==================================================================== \n#\n#  Tanzil Quran Text (Uthmani Minimal, Version 1.1)\n#  Copyright (C) 2007-2022 Tanzil Project\n#  License: Creative Commons Attribution 3.0\n#\n#  This copy of the Quran text is carefully produced, highly \n#  verified and continuously monitored by a group of specialists \n#  at Tanzil Project.\n#\n#  TERMS OF USE:\n#\n#  - Permission is granted to copy and distribute verbatim copies \n#    of this text, but CHANGING IT IS NOT ALLOWED.\n#\n#  - This Quran text can be used in any website or application, \n#    provided that its source (Tanzil Project) is clearly indicated, \n#    and a link is made to tanzil.net to enable users to keep\n#    track of changes.\n#\n#  - This copyright notice shall be included in all verbatim copies \n#    of the text, and shall be reproduced appropriately in all files \n#    derived from or containing substantial portion of this text.\n#\n#  Please check updates at: http://tanzil.net/updates/\n#\n#====================================================================\n",
  "type": "uthmani-min",
  "version": "1.1"
}