{
  "aya": [
    {
      "index": "1",
      "text": "قد أفلح المؤمنون",
      "bismillah": "بسم الله الرحمن الرحيم"
    },
    {
      "index": "2",
      "text": "الذين هم في صلاتهم خاشعون"
    },
    {
      "index": "3",
      "text": "والذين هم عن اللغو معرضون"
    },
    {
      "index": "4",
      "text": "والذين هم للزكاة فاعلون"
    },
    {
      "index": "5",
      "text": "والذين هم لفروجهم حافظون"
    },
    {
      "index": "6",
      "text": "إلا على أزواجهم أو ما ملكت أيمانهم فإنهم غير ملومين"
    },
    {
      "index": "7",
      "text": "فمن ابتغى وراء ذلك فأولئك هم العادون"
    },
    {
      "index": "8",
      "text": "والذين هم لأماناتهم وعهدهم راعون"
    },
    {
      "index": "9",
      "text": "والذين هم على صلواتهم يحافظون"
    },
    {
      "index": "10",
      "text": "أولئك هم الوارثون"
    },
    {
      "index": "11",
      "text": "الذين يرثون الفردوس هم فيها خالدون"
    },
    {
      "index": "12",
      "text": "ولقد خلقنا الإنسان من سلالة من طين"
    },
    {
      "index": "13",
      "text": "ثم جعلناه نطفة في قرار مكين"
    },
    {
      "index": "14",
      "text": "ثم خلقنا النطفة علقة فخلقنا العلقة مضغة فخلقنا المضغة عظاما فكسونا العظام لحما ثم أنشأناه خلقا آخر ۚ فتبارك الله أحسن الخالقين"
    },
    {
      "index": "15",
      "text": "ثم إنكم بعد ذلك لميتون"
    },
    {
      "index": "16",
      "text": "ثم إنكم يوم القيامة تبعثون"
    },
    {
      "index": "17",
      "text": "ولقد خلقنا فوقكم سبع طرائق وما كنا عن الخلق غافلين"
    },
    {
      "index": "18",
      "text": "وأنزلنا من السماء ماء بقدر فأسكناه في الأرض ۖ وإنا على ذهاب به لقادرون"
    },
    {
      "index": "19",
      "text": "فأنشأنا لكم به جنات من نخيل وأعناب لكم فيها فواكه كثيرة ومنها تأكلون"
    },
    {
      "index": "20",
      "text": "وشجرة تخرج من طور سيناء تنبت بالدهن وصبغ للآكلين"
    },
    {
      "index": "21",
      "text": "وإن لكم في الأنعام لعبرة ۖ نسقيكم مما في بطونها ولكم فيها منافع كثيرة ومنها تأكلون"
    },
    {
      "index": "22",
      "text": "وعليها وعلى الفلك تحملون"
    },
    {
      "index": "23",
      "text": "ولقد أرسلنا نوحا إلى قومه فقال يا قوم اعبدوا الله ما لكم من إله غيره ۖ أفلا تتقون"
    },
    {
      "index": "24",
      "text": "فقال الملأ الذين كفروا من قومه ما هذا إلا بشر مثلكم يريد أن يتفضل عليكم ولو شاء الله لأنزل ملائكة ما سمعنا بهذا في آبائنا الأولين"
    },
    {
      "index": "25",
      "text": "إن هو إلا رجل به جنة فتربصوا به حتى حين"
    },
    {
      "index": "26",
      "text": "قال رب انصرني بما كذبون"
    },
    {
      "index": "27",
      "text": "فأوحينا إليه أن اصنع الفلك بأعيننا ووحينا فإذا جاء أمرنا وفار التنور ۙ فاسلك فيها من كل زوجين اثنين وأهلك إلا من سبق عليه القول منهم ۖ ولا تخاطبني في الذين ظلموا ۖ إنهم مغرقون"
    },
    {
      "index": "28",
      "text": "فإذا استويت أنت ومن معك على الفلك فقل الحمد لله الذي نجانا من القوم الظالمين"
    },
    {
      "index": "29",
      "text": "وقل رب أنزلني منزلا مباركا وأنت خير المنزلين"
    },
    {
      "index": "30",
      "text": "إن في ذلك لآيات وإن كنا لمبتلين"
    },
    {
      "index": "31",
      "text": "ثم أنشأنا من بعدهم قرنا آخرين"
    },
    {
      "index": "32",
      "text": "فأرسلنا فيهم رسولا منهم أن اعبدوا الله ما لكم من إله غيره ۖ أفلا تتقون"
    },
    {
      "index": "33",
      "text": "وقال الملأ من قومه الذين كفروا وكذبوا بلقاء الآخرة وأترفناهم في الحياة الدنيا ما هذا إلا بشر مثلكم يأكل مما تأكلون منه ويشرب مما تشربون"
    },
    {
      "index": "34",
      "text": "ولئن أطعتم بشرا مثلكم إنكم إذا لخاسرون"
    },
    {
      "index": "35",
      "text": "أيعدكم أنكم إذا متم وكنتم ترابا وعظاما أنكم مخرجون"
    },
    {
      "index": "36",
      "text": "۞ هيهات هيهات لما توعدون"
    },
    {
      "index": "37",
      "text": "إن هي إلا حياتنا الدنيا نموت ونحيا وما نحن بمبعوثين"
    },
    {
      "index": "38",
      "text": "إن هو إلا رجل افترى على الله كذبا وما نحن له بمؤمنين"
    },
    {
      "index": "39",
      "text": "قال رب انصرني بما كذبون"
    },
    {
      "index": "40",
      "text": "قال عما قليل ليصبحن نادمين"
    },
    {
      "index": "41",
      "text": "فأخذتهم الصيحة بالحق فجعلناهم غثاء ۚ فبعدا للقوم الظالمين"
    },
    {
      "index": "42",
      "text": "ثم أنشأنا من بعدهم قرونا آخرين"
    },
    {
      "index": "43",
      "text": "ما تسبق من أمة أجلها وما يستأخرون"
    },
    {
      "index": "44",
      "text": "ثم أرسلنا رسلنا تترى ۖ كل ما جاء أمة رسولها كذبوه ۚ فأتبعنا بعضهم بعضا وجعلناهم أحاديث ۚ فبعدا لقوم لا يؤمنون"
    },
    {
      "index": "45",
      "text": "ثم أرسلنا موسى وأخاه هارون بآياتنا وسلطان مبين"
    },
    {
      "index": "46",
      "text": "إلى فرعون وملئه فاستكبروا وكانوا قوما عالين"
    },
    {
      "index": "47",
      "text": "فقالوا أنؤمن لبشرين مثلنا وقومهما لنا عابدون"
    },
    {
      "index": "48",
      "text": "فكذبوهما فكانوا من المهلكين"
    },
    {
      "index": "49",
      "text": "ولقد آتينا موسى الكتاب لعلهم يهتدون"
    },
    {
      "index": "50",
      "text": "وجعلنا ابن مريم وأمه آية وآويناهما إلى ربوة ذات قرار ومعين"
    },
    {
      "index": "51",
      "text": "يا أيها الرسل كلوا من الطيبات واعملوا صالحا ۖ إني بما تعملون عليم"
    },
    {
      "index": "52",
      "text": "وإن هذه أمتكم أمة واحدة وأنا ربكم فاتقون"
    },
    {
      "index": "53",
      "text": "فتقطعوا أمرهم بينهم زبرا ۖ كل حزب بما لديهم فرحون"
    },
    {
      "index": "54",
      "text": "فذرهم في غمرتهم حتى حين"
    },
    {
      "index": "55",
      "text": "أيحسبون أنما نمدهم به من مال وبنين"
    },
    {
      "index": "56",
      "text": "نسارع لهم في الخيرات ۚ بل لا يشعرون"
    },
    {
      "index": "57",
      "text": "إن الذين هم من خشية ربهم مشفقون"
    },
    {
      "index": "58",
      "text": "والذين هم بآيات ربهم يؤمنون"
    },
    {
      "index": "59",
      "text": "والذين هم بربهم لا يشركون"
    },
    {
      "index": "60",
      "text": "والذين يؤتون ما آتوا وقلوبهم وجلة أنهم إلى ربهم راجعون"
    },
    {
      "index": "61",
      "text": "أولئك يسارعون في الخيرات وهم لها سابقون"
    },
    {
      "index": "62",
      "text": "ولا نكلف نفسا إلا وسعها ۖ ولدينا كتاب ينطق بالحق ۚ وهم لا يظلمون"
    },
    {
      "index": "63",
      "text": "بل قلوبهم في غمرة من هذا ولهم أعمال من دون ذلك هم لها عاملون"
    },
    {
      "index": "64",
      "text": "حتى إذا أخذنا مترفيهم بالعذاب إذا هم يجأرون"
    },
    {
      "index": "65",
      "text": "لا تجأروا اليوم ۖ إنكم منا لا تنصرون"
    },
    {
      "index": "66",
      "text": "قد كانت آياتي تتلى عليكم فكنتم على أعقابكم تنكصون"
    },
    {
      "index": "67",
      "text": "مستكبرين به سامرا تهجرون"
    },
    {
      "index": "68",
      "text": "أفلم يدبروا القول أم جاءهم ما لم يأت آباءهم الأولين"
    },
    {
      "index": "69",
      "text": "أم لم يعرفوا رسولهم فهم له منكرون"
    },
    {
      "index": "70",
      "text": "أم يقولون به جنة ۚ بل جاءهم بالحق وأكثرهم للحق كارهون"
    },
    {
      "index": "71",
      "text": "ولو اتبع الحق أهواءهم لفسدت السماوات والأرض ومن فيهن ۚ بل أتيناهم بذكرهم فهم عن ذكرهم معرضون"
    },
    {
      "index": "72",
      "text": "أم تسألهم خرجا فخراج ربك خير ۖ وهو خير الرازقين"
    },
    {
      "index": "73",
      "text": "وإنك لتدعوهم إلى صراط مستقيم"
    },
    {
      "index": "74",
      "text": "وإن الذين لا يؤمنون بالآخرة عن الصراط لناكبون"
    },
    {
      "index": "75",
      "text": "۞ ولو رحمناهم وكشفنا ما بهم من ضر للجوا في طغيانهم يعمهون"
    },
    {
      "index": "76",
      "text": "ولقد أخذناهم بالعذاب فما استكانوا لربهم وما يتضرعون"
    },
    {
      "index": "77",
      "text": "حتى إذا فتحنا عليهم بابا ذا عذاب شديد إذا هم فيه مبلسون"
    },
    {
      "index": "78",
      "text": "وهو الذي أنشأ لكم السمع والأبصار والأفئدة ۚ قليلا ما تشكرون"
    },
    {
      "index": "79",
      "text": "وهو الذي ذرأكم في الأرض وإليه تحشرون"
    },
    {
      "index": "80",
      "text": "وهو الذي يحيي ويميت وله اختلاف الليل والنهار ۚ أفلا تعقلون"
    },
    {
      "index": "81",
      "text": "بل قالوا مثل ما قال الأولون"
    },
    {
      "index": "82",
      "text": "قالوا أإذا متنا وكنا ترابا وعظاما أإنا لمبعوثون"
    },
    {
      "index": "83",
      "text": "لقد وعدنا نحن وآباؤنا هذا من قبل إن هذا إلا أساطير الأولين"
    },
    {
      "index": "84",
      "text": "قل لمن الأرض ومن فيها إن كنتم تعلمون"
    },
    {
      "index": "85",
      "text": "سيقولون لله ۚ قل أفلا تذكرون"
    },
    {
      "index": "86",
      "text": "قل من رب السماوات السبع ورب العرش العظيم"
    },
    {
      "index": "87",
      "text": "سيقولون لله ۚ قل أفلا تتقون"
    },
    {
      "index": "88",
      "text": "قل من بيده ملكوت كل شيء وهو يجير ولا يجار عليه إن كنتم تعلمون"
    },
    {
      "index": "89",
      "text": "سيقولون لله ۚ قل فأنى تسحرون"
    },
    {
      "index": "90",
      "text": "بل أتيناهم بالحق وإنهم لكاذبون"
    },
    {
      "index": "91",
      "text": "ما اتخذ الله من ولد وما كان معه من إله ۚ إذا لذهب كل إله بما خلق ولعلا بعضهم على بعض ۚ سبحان الله عما يصفون"
    },
    {
      "index": "92",
      "text": "عالم الغيب والشهادة فتعالى عما يشركون"
    },
    {
      "index": "93",
      "text": "قل رب إما تريني ما يوعدون"
    },
    {
      "index": "94",
      "text": "رب فلا تجعلني في القوم الظالمين"
    },
    {
      "index": "95",
      "text": "وإنا على أن نريك ما نعدهم لقادرون"
    },
    {
      "index": "96",
      "text": "ادفع بالتي هي أحسن السيئة ۚ نحن أعلم بما يصفون"
    },
    {
      "index": "97",
      "text": "وقل رب أعوذ بك من همزات الشياطين"
    },
    {
      "index": "98",
      "text": "وأعوذ بك رب أن يحضرون"
    },
    {
      "index": "99",
      "text": "حتى إذا جاء أحدهم الموت قال رب ارجعون"
    },
    {
      "index": "100",
      "text": "لعلي أعمل صالحا فيما تركت ۚ كلا ۚ إنها كلمة هو قائلها ۖ ومن ورائهم برزخ إلى يوم يبعثون"
    },
    {
      "index": "101",
      "text": "فإذا نفخ في الصور فلا أنساب بينهم يومئذ ولا يتساءلون"
    },
    {
      "index": "102",
      "text": "فمن ثقلت موازينه فأولئك هم المفلحون"
    },
    {
      "index": "103",
      "text": "ومن خفت موازينه فأولئك الذين خسروا أنفسهم في جهنم خالدون"
    },
    {
      "index": "104",
      "text": "تلفح وجوههم النار وهم فيها كالحون"
    },
    {
      "index": "105",
      "text": "ألم تكن آياتي تتلى عليكم فكنتم بها تكذبون"
    },
    {
      "index": "106",
      "text": "قالوا ربنا غلبت علينا شقوتنا وكنا قوما ضالين"
    },
    {
      "index": "107",
      "text": "ربنا أخرجنا منها فإن عدنا فإنا ظالمون"
    },
    {
      "index": "108",
      "text": "قال اخسئوا فيها ولا تكلمون"
    },
    {
      "index": "109",
      "text": "إنه كان فريق من عبادي يقولون ربنا آمنا فاغفر لنا وارحمنا وأنت خير الراحمين"
    },
    {
      "index": "110",
      "text": "فاتخذتموهم سخريا حتى أنسوكم ذكري وكنتم منهم تضحكون"
    },
    {
      "index": "111",
      "text": "إني جزيتهم اليوم بما صبروا أنهم هم الفائزون"
    },
    {
      "index": "112",
      "text": "قال كم لبثتم في الأرض عدد سنين"
    },
    {
      "index": "113",
      "text": "قالوا لبثنا يوما أو بعض يوم فاسأل العادين"
    },
    {
      "index": "114",
      "text": "قال إن لبثتم إلا قليلا ۖ لو أنكم كنتم تعلمون"
    },
    {
      "index": "115",
      "text": "أفحسبتم أنما خلقناكم عبثا وأنكم إلينا لا ترجعون"
    },
    {
      "index": "116",
      "text": "فتعالى الله الملك الحق ۖ لا إله إلا هو رب العرش الكريم"
    },
    {
      "index": "117",
      "text": "ومن يدع مع الله إلها آخر لا برهان له به فإنما حسابه عند ربه ۚ إنه لا يفلح الكافرون"
    },
    {
      "index": "118",
      "text": "وقل رب اغفر وارحم وأنت خير الراحمين"
    }
  ],
  "index": "23",
  "name": "المؤمنون",
  "copyright": "# PLEASE DO NOT REMOVE OR CHANGE THIS COPYRIGHT BLOCK \n#==================================================================== \n#\n#  Tanzil Quran Text (Simple Clean, Version 1.1)\n#  Copyright (C) 2007-2022 Tanzil Project\n#  License: Creative Commons Attribution 3.0\n#\n#  This copy of the Quran text is carefully produced, highly \n#  verified and continuously monitored by a group of specialists \n#  at Tanzil Project.\n#\n#  TERMS OF USE:\n#\n#  - Permission is granted to copy and distribute verbatim copies \n#    of this text, but CHANGING IT IS NOT ALLOWED.\n#\n#  - This Quran text can be used in any website or application, \n#    provided that its source (Tanzil Project) is clearly indicated, \n#    and a link is made to tanzil.net to enable users to keep\n#    track of changes.\n#\n#  - This copyright notice shall be included in all verbatim copies \n#    of the text, and shall be reproduced appropriately in all files \n#    derived from or containing substantial portion of this text.\n#\n#  Please check updates at: http://tanzil.net/updates/\n#\n#====================================================================\n",
  "type": "simple-clean",
  "version": "1.1"
}