{
  "aya": [
    {
      "index": "1",
      "text": "ق ۚ وَالقُرءانِ المَجيدِ",
      "bismillah": "بِسمِ اللَّهِ الرَّحمـٰنِ الرَّحيمِ"
    },
    {
      "index": "2",
      "text": "بَل عَجِبوا أَن جاءَهُم مُنذِرٌ مِنهُم فَقالَ الكـٰفِرونَ هـٰذا شَىءٌ عَجيبٌ"
    },
    {
      "index": "3",
      "text": "أَءِذا مِتنا وَكُنّا تُرابًا ۖ ذٰلِكَ رَجعٌ بَعيدٌ"
    },
    {
      "index": "4",
      "text": "قَد عَلِمنا ما تَنقُصُ الأَرضُ مِنهُم ۖ وَعِندَنا كِتـٰبٌ حَفيظٌ"
    },
    {
      "index": "5",
      "text": "بَل كَذَّبوا بِالحَقِّ لَمّا جاءَهُم فَهُم فى أَمرٍ مَريجٍ"
    },
    {
      "index": "6",
      "text": "أَفَلَم يَنظُروا إِلَى السَّماءِ فَوقَهُم كَيفَ بَنَينـٰها وَزَيَّنّـٰها وَما لَها مِن فُروجٍ"
    },
    {
      "index": "7",
      "text": "وَالأَرضَ مَدَدنـٰها وَأَلقَينا فيها رَوٰسِىَ وَأَنبَتنا فيها مِن كُلِّ زَوجٍ بَهيجٍ"
    },
    {
      "index": "8",
      "text": "تَبصِرَةً وَذِكرىٰ لِكُلِّ عَبدٍ مُنيبٍ"
    },
    {
      "index": "9",
      "text": "وَنَزَّلنا مِنَ السَّماءِ ماءً مُبـٰرَكًا فَأَنبَتنا بِهِ جَنّـٰتٍ وَحَبَّ الحَصيدِ"
    },
    {
      "index": "10",
      "text": "وَالنَّخلَ باسِقـٰتٍ لَها طَلعٌ نَضيدٌ"
    },
    {
      "index": "11",
      "text": "رِزقًا لِلعِبادِ ۖ وَأَحيَينا بِهِ بَلدَةً مَيتًا ۚ كَذٰلِكَ الخُروجُ"
    },
    {
      "index": "12",
      "text": "كَذَّبَت قَبلَهُم قَومُ نوحٍ وَأَصحـٰبُ الرَّسِّ وَثَمودُ"
    },
    {
      "index": "13",
      "text": "وَعادٌ وَفِرعَونُ وَإِخوٰنُ لوطٍ"
    },
    {
      "index": "14",
      "text": "وَأَصحـٰبُ الأَيكَةِ وَقَومُ تُبَّعٍ ۚ كُلٌّ كَذَّبَ الرُّسُلَ فَحَقَّ وَعيدِ"
    },
    {
      "index": "15",
      "text": "أَفَعَيينا بِالخَلقِ الأَوَّلِ ۚ بَل هُم فى لَبسٍ مِن خَلقٍ جَديدٍ"
    },
    {
      "index": "16",
      "text": "وَلَقَد خَلَقنَا الإِنسـٰنَ وَنَعلَمُ ما تُوَسوِسُ بِهِ نَفسُهُ ۖ وَنَحنُ أَقرَبُ إِلَيهِ مِن حَبلِ الوَريدِ"
    },
    {
      "index": "17",
      "text": "إِذ يَتَلَقَّى المُتَلَقِّيانِ عَنِ اليَمينِ وَعَنِ الشِّمالِ قَعيدٌ"
    },
    {
      "index": "18",
      "text": "ما يَلفِظُ مِن قَولٍ إِلّا لَدَيهِ رَقيبٌ عَتيدٌ"
    },
    {
      "index": "19",
      "text": "وَجاءَت سَكرَةُ المَوتِ بِالحَقِّ ۖ ذٰلِكَ ما كُنتَ مِنهُ تَحيدُ"
    },
    {
      "index": "20",
      "text": "وَنُفِخَ فِى الصّورِ ۚ ذٰلِكَ يَومُ الوَعيدِ"
    },
    {
      "index": "21",
      "text": "وَجاءَت كُلُّ نَفسٍ مَعَها سائِقٌ وَشَهيدٌ"
    },
    {
      "index": "22",
      "text": "لَقَد كُنتَ فى غَفلَةٍ مِن هـٰذا فَكَشَفنا عَنكَ غِطاءَكَ فَبَصَرُكَ اليَومَ حَديدٌ"
    },
    {
      "index": "23",
      "text": "وَقالَ قَرينُهُ هـٰذا ما لَدَىَّ عَتيدٌ"
    },
    {
      "index": "24",
      "text": "أَلقِيا فى جَهَنَّمَ كُلَّ كَفّارٍ عَنيدٍ"
    },
    {
      "index": "25",
      "text": "مَنّاعٍ لِلخَيرِ مُعتَدٍ مُريبٍ"
    },
    {
      "index": "26",
      "text": "الَّذى جَعَلَ مَعَ اللَّهِ إِلـٰهًا ءاخَرَ فَأَلقِياهُ فِى العَذابِ الشَّديدِ"
    },
    {
      "index": "27",
      "text": "۞ قالَ قَرينُهُ رَبَّنا ما أَطغَيتُهُ وَلـٰكِن كانَ فى ضَلـٰلٍ بَعيدٍ"
    },
    {
      "index": "28",
      "text": "قالَ لا تَختَصِموا لَدَىَّ وَقَد قَدَّمتُ إِلَيكُم بِالوَعيدِ"
    },
    {
      "index": "29",
      "text": "ما يُبَدَّلُ القَولُ لَدَىَّ وَما أَنا۠ بِظَلّـٰمٍ لِلعَبيدِ"
    },
    {
      "index": "30",
      "text": "يَومَ نَقولُ لِجَهَنَّمَ هَلِ امتَلَأتِ وَتَقولُ هَل مِن مَزيدٍ"
    },
    {
      "index": "31",
      "text": "وَأُزلِفَتِ الجَنَّةُ لِلمُتَّقينَ غَيرَ بَعيدٍ"
    },
    {
      "index": "32",
      "text": "هـٰذا ما توعَدونَ لِكُلِّ أَوّابٍ حَفيظٍ"
    },
    {
      "index": "33",
      "text": "مَن خَشِىَ الرَّحمـٰنَ بِالغَيبِ وَجاءَ بِقَلبٍ مُنيبٍ"
    },
    {
      "index": "34",
      "text": "ادخُلوها بِسَلـٰمٍ ۖ ذٰلِكَ يَومُ الخُلودِ"
    },
    {
      "index": "35",
      "text": "لَهُم ما يَشاءونَ فيها وَلَدَينا مَزيدٌ"
    },
    {
      "index": "36",
      "text": "وَكَم أَهلَكنا قَبلَهُم مِن قَرنٍ هُم أَشَدُّ مِنهُم بَطشًا فَنَقَّبوا فِى البِلـٰدِ هَل مِن مَحيصٍ"
    },
    {
      "index": "37",
      "text": "إِنَّ فى ذٰلِكَ لَذِكرىٰ لِمَن كانَ لَهُ قَلبٌ أَو أَلقَى السَّمعَ وَهُوَ شَهيدٌ"
    },
    {
      "index": "38",
      "text": "وَلَقَد خَلَقنَا السَّمـٰوٰتِ وَالأَرضَ وَما بَينَهُما فى سِتَّةِ أَيّامٍ وَما مَسَّنا مِن لُغوبٍ"
    },
    {
      "index": "39",
      "text": "فَاصبِر عَلىٰ ما يَقولونَ وَسَبِّح بِحَمدِ رَبِّكَ قَبلَ طُلوعِ الشَّمسِ وَقَبلَ الغُروبِ"
    },
    {
      "index": "40",
      "text": "وَمِنَ الَّيلِ فَسَبِّحهُ وَأَدبـٰرَ السُّجودِ"
    },
    {
      "index": "41",
      "text": "وَاستَمِع يَومَ يُنادِ المُنادِ مِن مَكانٍ قَريبٍ"
    },
    {
      "index": "42",
      "text": "يَومَ يَسمَعونَ الصَّيحَةَ بِالحَقِّ ۚ ذٰلِكَ يَومُ الخُروجِ"
    },
    {
      "index": "43",
      "text": "إِنّا نَحنُ نُحيۦ وَنُميتُ وَإِلَينَا المَصيرُ"
    },
    {
      "index": "44",
      "text": "يَومَ تَشَقَّقُ الأَرضُ عَنهُم سِراعًا ۚ ذٰلِكَ حَشرٌ عَلَينا يَسيرٌ"
    },
    {
      "index": "45",
      "text": "نَحنُ أَعلَمُ بِما يَقولونَ ۖ وَما أَنتَ عَلَيهِم بِجَبّارٍ ۖ فَذَكِّر بِالقُرءانِ مَن يَخافُ وَعيدِ"
    }
  ],
  "index": "50",
  "name": "ق",
  "copyright": "# PLEASE DO NOT REMOVE OR CHANGE THIS COPYRIGHT BLOCK \n#==================================================================== \n#\n#  Tanzil Quran Text (Uthmani Minimal, Version 1.1)\n#  Copyright (C) 2007-2022 Tanzil Project\n#  License: Creative Commons Attribution 3.0\n#\n#  This copy of the Quran text is carefully produced, highly \n#  verified and continuously monitored by a group of specialists \n#  at Tanzil Project.\n#\n#  TERMS OF USE:\n#\n#  - Permission is granted to copy and distribute verbatim copies \n#    of this text, but CHANGING IT IS NOT ALLOWED.\n#\n#  - This Quran text can be used in any website or application, \n#    provided that its source (Tanzil Project) is clearly indicated, \n#    and a link is made to tanzil.net to enable users to keep\n#    track of changes.\n#\n#  - This copyright notice shall be included in all verbatim copies \n#    of the text, and shall be reproduced appropriately in all files \n#    derived from or containing substantial portion of this text.\n#\n#  Please check updates at: http://tanzil.net/updates/\n#\n#====================================================================\n",
  "type": "uthmani-min",
  "version": "1.1"
}