{
  "aya": [
    {
      "index": "1",
      "text": "الْحَاقَّةُ",
      "bismillah": "بِسْمِ اللَّهِ الرَّحْمَـٰنِ الرَّحِيمِ"
    },
    {
      "index": "2",
      "text": "مَا الْحَاقَّةُ"
    },
    {
      "index": "3",
      "text": "وَمَا أَدْرَاكَ مَا الْحَاقَّةُ"
    },
    {
      "index": "4",
      "text": "كَذَّبَتْ ثَمُودُ وَعَادٌ بِالْقَارِعَةِ"
    },
    {
      "index": "5",
      "text": "فَأَمَّا ثَمُودُ فَأُهْلِكُوا بِالطَّاغِيَةِ"
    },
    {
      "index": "6",
      "text": "وَأَمَّا عَادٌ فَأُهْلِكُوا بِرِيحٍ صَرْصَرٍ عَاتِيَةٍ"
    },
    {
      "index": "7",
      "text": "سَخَّرَهَا عَلَيْهِمْ سَبْعَ لَيَالٍ وَثَمَانِيَةَ أَيَّامٍ حُسُومًا فَتَرَى الْقَوْمَ فِيهَا صَرْعَىٰ كَأَنَّهُمْ أَعْجَازُ نَخْلٍ خَاوِيَةٍ"
    },
    {
      "index": "8",
      "text": "فَهَلْ تَرَىٰ لَهُم مِّن بَاقِيَةٍ"
    },
    {
      "index": "9",
      "text": "وَجَاءَ فِرْعَوْنُ وَمَن قَبْلَهُ وَالْمُؤْتَفِكَاتُ بِالْخَاطِئَةِ"
    },
    {
      "index": "10",
      "text": "فَعَصَوْا رَسُولَ رَبِّهِمْ فَأَخَذَهُمْ أَخْذَةً رَّابِيَةً"
    },
    {
      "index": "11",
      "text": "إِنَّا لَمَّا طَغَى الْمَاءُ حَمَلْنَاكُمْ فِي الْجَارِيَةِ"
    },
    {
      "index": "12",
      "text": "لِنَجْعَلَهَا لَكُمْ تَذْكِرَةً وَتَعِيَهَا أُذُنٌ وَاعِيَةٌ"
    },
    {
      "index": "13",
      "text": "فَإِذَا نُفِخَ فِي الصُّورِ نَفْخَةٌ وَاحِدَةٌ"
    },
    {
      "index": "14",
      "text": "وَحُمِلَتِ الْأَرْضُ وَالْجِبَالُ فَدُكَّتَا دَكَّةً وَاحِدَةً"
    },
    {
      "index": "15",
      "text": "فَيَوْمَئِذٍ وَقَعَتِ الْوَاقِعَةُ"
    },
    {
      "index": "16",
      "text": "وَانشَقَّتِ السَّمَاءُ فَهِيَ يَوْمَئِذٍ وَاهِيَةٌ"
    },
    {
      "index": "17",
      "text": "وَالْمَلَكُ عَلَىٰ أَرْجَائِهَا ۚ وَيَحْمِلُ عَرْشَ رَبِّكَ فَوْقَهُمْ يَوْمَئِذٍ ثَمَانِيَةٌ"
    },
    {
      "index": "18",
      "text": "يَوْمَئِذٍ تُعْرَضُونَ لَا تَخْفَىٰ مِنكُمْ خَافِيَةٌ"
    },
    {
      "index": "19",
      "text": "فَأَمَّا مَنْ أُوتِيَ كِتَابَهُ بِيَمِينِهِ فَيَقُولُ هَاؤُمُ اقْرَءُوا كِتَابِيَهْ"
    },
    {
      "index": "20",
      "text": "إِنِّي ظَنَنتُ أَنِّي مُلَاقٍ حِسَابِيَهْ"
    },
    {
      "index": "21",
      "text": "فَهُوَ فِي عِيشَةٍ رَّاضِيَةٍ"
    },
    {
      "index": "22",
      "text": "فِي جَنَّةٍ عَالِيَةٍ"
    },
    {
      "index": "23",
      "text": "قُطُوفُهَا دَانِيَةٌ"
    },
    {
      "index": "24",
      "text": "كُلُوا وَاشْرَبُوا هَنِيئًا بِمَا أَسْلَفْتُمْ فِي الْأَيَّامِ الْخَالِيَةِ"
    },
    {
      "index": "25",
      "text": "وَأَمَّا مَنْ أُوتِيَ كِتَابَهُ بِشِمَالِهِ فَيَقُولُ يَا لَيْتَنِي لَمْ أُوتَ كِتَابِيَهْ"
    },
    {
      "index": "26",
      "text": "وَلَمْ أَدْرِ مَا حِسَابِيَهْ"
    },
    {
      "index": "27",
      "text": "يَا لَيْتَهَا كَانَتِ الْقَاضِيَةَ"
    },
    {
      "index": "28",
      "text": "مَا أَغْنَىٰ عَنِّي مَالِيَهْ ۜ"
    },
    {
      "index": "29",
      "text": "هَلَكَ عَنِّي سُلْطَانِيَهْ"
    },
    {
      "index": "30",
      "text": "خُذُوهُ فَغُلُّوهُ"
    },
    {
      "index": "31",
      "text": "ثُمَّ الْجَحِيمَ صَلُّوهُ"
    },
    {
      "index": "32",
      "text": "ثُمَّ فِي سِلْسِلَةٍ ذَرْعُهَا سَبْعُونَ ذِرَاعًا فَاسْلُكُوهُ"
    },
    {
      "index": "33",
      "text": "إِنَّهُ كَانَ لَا يُؤْمِنُ بِاللَّهِ الْعَظِيمِ"
    },
    {
      "index": "34",
      "text": "وَلَا يَحُضُّ عَلَىٰ طَعَامِ الْمِسْكِينِ"
    },
    {
      "index": "35",
      "text": "فَلَيْسَ لَهُ الْيَوْمَ هَاهُنَا حَمِيمٌ"
    },
    {
      "index": "36",
      "text": "وَلَا طَعَامٌ إِلَّا مِنْ غِسْلِينٍ"
    },
    {
      "index": "37",
      "text": "لَّا يَأْكُلُهُ إِلَّا الْخَاطِئُونَ"
    },
    {
      "index": "38",
      "text": "فَلَا أُقْسِمُ بِمَا تُبْصِرُونَ"
    },
    {
      "index": "39",
      "text": "وَمَا لَا تُبْصِرُونَ"
    },
    {
      "index": "40",
      "text": "إِنَّهُ لَقَوْلُ رَسُولٍ كَرِيمٍ"
    },
    {
      "index": "41",
      "text": "وَمَا هُوَ بِقَوْلِ شَاعِرٍ ۚ قَلِيلًا مَّا تُؤْمِنُونَ"
    },
    {
      "index": "42",
      "text": "وَلَا بِقَوْلِ كَاهِنٍ ۚ قَلِيلًا مَّا تَذَكَّرُونَ"
    },
    {
      "index": "43",
      "text": "تَنزِيلٌ مِّن رَّبِّ الْعَالَمِينَ"
    },
    {
      "index": "44",
      "text": "وَلَوْ تَقَوَّلَ عَلَيْنَا بَعْضَ الْأَقَاوِيلِ"
    },
    {
      "index": "45",
      "text": "لَأَخَذْنَا مِنْهُ بِالْيَمِينِ"
    },
    {
      "index": "46",
      "text": "ثُمَّ لَقَطَعْنَا مِنْهُ الْوَتِينَ"
    },
    {
      "index": "47",
      "text": "فَمَا مِنكُم مِّنْ أَحَدٍ عَنْهُ حَاجِزِينَ"
    },
    {
      "index": "48",
      "text": "وَإِنَّهُ لَتَذْكِرَةٌ لِّلْمُتَّقِينَ"
    },
    {
      "index": "49",
      "text": "وَإِنَّا لَنَعْلَمُ أَنَّ مِنكُم مُّكَذِّبِينَ"
    },
    {
      "index": "50",
      "text": "وَإِنَّهُ لَحَسْرَةٌ عَلَى الْكَافِرِينَ"
    },
    {
      "index": "51",
      "text": "وَإِنَّهُ لَحَقُّ الْيَقِينِ"
    },
    {
      "index": "52",
      "text": "فَسَبِّحْ بِاسْمِ رَبِّكَ الْعَظِيمِ"
    }
  ],
  "index": "69",
  "name": "الحاقة",
  "copyright": "# PLEASE DO NOT REMOVE OR CHANGE THIS COPYRIGHT BLOCK \n#==================================================================== \n#\n#  Tanzil Quran Text (Simple, Version 1.1)\n#  Copyright (C) 2007-2022 Tanzil Project\n#  License: Creative Commons Attribution 3.0\n#\n#  This copy of the Quran text is carefully produced, highly \n#  verified and continuously monitored by a group of specialists \n#  at Tanzil Project.\n#\n#  TERMS OF USE:\n#\n#  - Permission is granted to copy and distribute verbatim copies \n#    of this text, but CHANGING IT IS NOT ALLOWED.\n#\n#  - This Quran text can be used in any website or application, \n#    provided that its source (Tanzil Project) is clearly indicated, \n#    and a link is made to tanzil.net to enable users to keep\n#    track of changes.\n#\n#  - This copyright notice shall be included in all verbatim copies \n#    of the text, and shall be reproduced appropriately in all files \n#    derived from or containing substantial portion of this text.\n#\n#  Please check updates at: http://tanzil.net/updates/\n#\n#====================================================================\n",
  "type": "simple",
  "version": "1.1"
}