{
  "aya": [
    {
      "index": "1",
      "text": "الحمد لله الذي له ما في السماوات وما في الأرض وله الحمد في الآخرة ۚ وهو الحكيم الخبير",
      "bismillah": "بسم الله الرحمن الرحيم"
    },
    {
      "index": "2",
      "text": "يعلم ما يلج في الأرض وما يخرج منها وما ينزل من السماء وما يعرج فيها ۚ وهو الرحيم الغفور"
    },
    {
      "index": "3",
      "text": "وقال الذين كفروا لا تأتينا الساعة ۖ قل بلى وربي لتأتينكم عالم الغيب ۖ لا يعزب عنه مثقال ذرة في السماوات ولا في الأرض ولا أصغر من ذلك ولا أكبر إلا في كتاب مبين"
    },
    {
      "index": "4",
      "text": "ليجزي الذين آمنوا وعملوا الصالحات ۚ أولئك لهم مغفرة ورزق كريم"
    },
    {
      "index": "5",
      "text": "والذين سعوا في آياتنا معاجزين أولئك لهم عذاب من رجز أليم"
    },
    {
      "index": "6",
      "text": "ويرى الذين أوتوا العلم الذي أنزل إليك من ربك هو الحق ويهدي إلى صراط العزيز الحميد"
    },
    {
      "index": "7",
      "text": "وقال الذين كفروا هل ندلكم على رجل ينبئكم إذا مزقتم كل ممزق إنكم لفي خلق جديد"
    },
    {
      "index": "8",
      "text": "أفترى على الله كذبا أم به جنة ۗ بل الذين لا يؤمنون بالآخرة في العذاب والضلال البعيد"
    },
    {
      "index": "9",
      "text": "أفلم يروا إلى ما بين أيديهم وما خلفهم من السماء والأرض ۚ إن نشأ نخسف بهم الأرض أو نسقط عليهم كسفا من السماء ۚ إن في ذلك لآية لكل عبد منيب"
    },
    {
      "index": "10",
      "text": "۞ ولقد آتينا داوود منا فضلا ۖ يا جبال أوبي معه والطير ۖ وألنا له الحديد"
    },
    {
      "index": "11",
      "text": "أن اعمل سابغات وقدر في السرد ۖ واعملوا صالحا ۖ إني بما تعملون بصير"
    },
    {
      "index": "12",
      "text": "ولسليمان الريح غدوها شهر ورواحها شهر ۖ وأسلنا له عين القطر ۖ ومن الجن من يعمل بين يديه بإذن ربه ۖ ومن يزغ منهم عن أمرنا نذقه من عذاب السعير"
    },
    {
      "index": "13",
      "text": "يعملون له ما يشاء من محاريب وتماثيل وجفان كالجواب وقدور راسيات ۚ اعملوا آل داوود شكرا ۚ وقليل من عبادي الشكور"
    },
    {
      "index": "14",
      "text": "فلما قضينا عليه الموت ما دلهم على موته إلا دابة الأرض تأكل منسأته ۖ فلما خر تبينت الجن أن لو كانوا يعلمون الغيب ما لبثوا في العذاب المهين"
    },
    {
      "index": "15",
      "text": "لقد كان لسبإ في مسكنهم آية ۖ جنتان عن يمين وشمال ۖ كلوا من رزق ربكم واشكروا له ۚ بلدة طيبة ورب غفور"
    },
    {
      "index": "16",
      "text": "فأعرضوا فأرسلنا عليهم سيل العرم وبدلناهم بجنتيهم جنتين ذواتي أكل خمط وأثل وشيء من سدر قليل"
    },
    {
      "index": "17",
      "text": "ذلك جزيناهم بما كفروا ۖ وهل نجازي إلا الكفور"
    },
    {
      "index": "18",
      "text": "وجعلنا بينهم وبين القرى التي باركنا فيها قرى ظاهرة وقدرنا فيها السير ۖ سيروا فيها ليالي وأياما آمنين"
    },
    {
      "index": "19",
      "text": "فقالوا ربنا باعد بين أسفارنا وظلموا أنفسهم فجعلناهم أحاديث ومزقناهم كل ممزق ۚ إن في ذلك لآيات لكل صبار شكور"
    },
    {
      "index": "20",
      "text": "ولقد صدق عليهم إبليس ظنه فاتبعوه إلا فريقا من المؤمنين"
    },
    {
      "index": "21",
      "text": "وما كان له عليهم من سلطان إلا لنعلم من يؤمن بالآخرة ممن هو منها في شك ۗ وربك على كل شيء حفيظ"
    },
    {
      "index": "22",
      "text": "قل ادعوا الذين زعمتم من دون الله ۖ لا يملكون مثقال ذرة في السماوات ولا في الأرض وما لهم فيهما من شرك وما له منهم من ظهير"
    },
    {
      "index": "23",
      "text": "ولا تنفع الشفاعة عنده إلا لمن أذن له ۚ حتى إذا فزع عن قلوبهم قالوا ماذا قال ربكم ۖ قالوا الحق ۖ وهو العلي الكبير"
    },
    {
      "index": "24",
      "text": "۞ قل من يرزقكم من السماوات والأرض ۖ قل الله ۖ وإنا أو إياكم لعلى هدى أو في ضلال مبين"
    },
    {
      "index": "25",
      "text": "قل لا تسألون عما أجرمنا ولا نسأل عما تعملون"
    },
    {
      "index": "26",
      "text": "قل يجمع بيننا ربنا ثم يفتح بيننا بالحق وهو الفتاح العليم"
    },
    {
      "index": "27",
      "text": "قل أروني الذين ألحقتم به شركاء ۖ كلا ۚ بل هو الله العزيز الحكيم"
    },
    {
      "index": "28",
      "text": "وما أرسلناك إلا كافة للناس بشيرا ونذيرا ولكن أكثر الناس لا يعلمون"
    },
    {
      "index": "29",
      "text": "ويقولون متى هذا الوعد إن كنتم صادقين"
    },
    {
      "index": "30",
      "text": "قل لكم ميعاد يوم لا تستأخرون عنه ساعة ولا تستقدمون"
    },
    {
      "index": "31",
      "text": "وقال الذين كفروا لن نؤمن بهذا القرآن ولا بالذي بين يديه ۗ ولو ترى إذ الظالمون موقوفون عند ربهم يرجع بعضهم إلى بعض القول يقول الذين استضعفوا للذين استكبروا لولا أنتم لكنا مؤمنين"
    },
    {
      "index": "32",
      "text": "قال الذين استكبروا للذين استضعفوا أنحن صددناكم عن الهدى بعد إذ جاءكم ۖ بل كنتم مجرمين"
    },
    {
      "index": "33",
      "text": "وقال الذين استضعفوا للذين استكبروا بل مكر الليل والنهار إذ تأمروننا أن نكفر بالله ونجعل له أندادا ۚ وأسروا الندامة لما رأوا العذاب وجعلنا الأغلال في أعناق الذين كفروا ۚ هل يجزون إلا ما كانوا يعملون"
    },
    {
      "index": "34",
      "text": "وما أرسلنا في قرية من نذير إلا قال مترفوها إنا بما أرسلتم به كافرون"
    },
    {
      "index": "35",
      "text": "وقالوا نحن أكثر أموالا وأولادا وما نحن بمعذبين"
    },
    {
      "index": "36",
      "text": "قل إن ربي يبسط الرزق لمن يشاء ويقدر ولكن أكثر الناس لا يعلمون"
    },
    {
      "index": "37",
      "text": "وما أموالكم ولا أولادكم بالتي تقربكم عندنا زلفى إلا من آمن وعمل صالحا فأولئك لهم جزاء الضعف بما عملوا وهم في الغرفات آمنون"
    },
    {
      "index": "38",
      "text": "والذين يسعون في آياتنا معاجزين أولئك في العذاب محضرون"
    },
    {
      "index": "39",
      "text": "قل إن ربي يبسط الرزق لمن يشاء من عباده ويقدر له ۚ وما أنفقتم من شيء فهو يخلفه ۖ وهو خير الرازقين"
    },
    {
      "index": "40",
      "text": "ويوم يحشرهم جميعا ثم يقول للملائكة أهؤلاء إياكم كانوا يعبدون"
    },
    {
      "index": "41",
      "text": "قالوا سبحانك أنت ولينا من دونهم ۖ بل كانوا يعبدون الجن ۖ أكثرهم بهم مؤمنون"
    },
    {
      "index": "42",
      "text": "فاليوم لا يملك بعضكم لبعض نفعا ولا ضرا ونقول للذين ظلموا ذوقوا عذاب النار التي كنتم بها تكذبون"
    },
    {
      "index": "43",
      "text": "وإذا تتلى عليهم آياتنا بينات قالوا ما هذا إلا رجل يريد أن يصدكم عما كان يعبد آباؤكم وقالوا ما هذا إلا إفك مفترى ۚ وقال الذين كفروا للحق لما جاءهم إن هذا إلا سحر مبين"
    },
    {
      "index": "44",
      "text": "وما آتيناهم من كتب يدرسونها ۖ وما أرسلنا إليهم قبلك من نذير"
    },
    {
      "index": "45",
      "text": "وكذب الذين من قبلهم وما بلغوا معشار ما آتيناهم فكذبوا رسلي ۖ فكيف كان نكير"
    },
    {
      "index": "46",
      "text": "۞ قل إنما أعظكم بواحدة ۖ أن تقوموا لله مثنى وفرادى ثم تتفكروا ۚ ما بصاحبكم من جنة ۚ إن هو إلا نذير لكم بين يدي عذاب شديد"
    },
    {
      "index": "47",
      "text": "قل ما سألتكم من أجر فهو لكم ۖ إن أجري إلا على الله ۖ وهو على كل شيء شهيد"
    },
    {
      "index": "48",
      "text": "قل إن ربي يقذف بالحق علام الغيوب"
    },
    {
      "index": "49",
      "text": "قل جاء الحق وما يبدئ الباطل وما يعيد"
    },
    {
      "index": "50",
      "text": "قل إن ضللت فإنما أضل على نفسي ۖ وإن اهتديت فبما يوحي إلي ربي ۚ إنه سميع قريب"
    },
    {
      "index": "51",
      "text": "ولو ترى إذ فزعوا فلا فوت وأخذوا من مكان قريب"
    },
    {
      "index": "52",
      "text": "وقالوا آمنا به وأنى لهم التناوش من مكان بعيد"
    },
    {
      "index": "53",
      "text": "وقد كفروا به من قبل ۖ ويقذفون بالغيب من مكان بعيد"
    },
    {
      "index": "54",
      "text": "وحيل بينهم وبين ما يشتهون كما فعل بأشياعهم من قبل ۚ إنهم كانوا في شك مريب"
    }
  ],
  "index": "34",
  "name": "سبإ",
  "copyright": "# PLEASE DO NOT REMOVE OR CHANGE THIS COPYRIGHT BLOCK \n#==================================================================== \n#\n#  Tanzil Quran Text (Simple Clean, Version 1.1)\n#  Copyright (C) 2007-2022 Tanzil Project\n#  License: Creative Commons Attribution 3.0\n#\n#  This copy of the Quran text is carefully produced, highly \n#  verified and continuously monitored by a group of specialists \n#  at Tanzil Project.\n#\n#  TERMS OF USE:\n#\n#  - Permission is granted to copy and distribute verbatim copies \n#    of this text, but CHANGING IT IS NOT ALLOWED.\n#\n#  - This Quran text can be used in any website or application, \n#    provided that its source (Tanzil Project) is clearly indicated, \n#    and a link is made to tanzil.net to enable users to keep\n#    track of changes.\n#\n#  - This copyright notice shall be included in all verbatim copies \n#    of the text, and shall be reproduced appropriately in all files \n#    derived from or containing substantial portion of this text.\n#\n#  Please check updates at: http://tanzil.net/updates/\n#\n#====================================================================\n",
  "type": "simple-clean",
  "version": "1.1"
}