{
  "aya": [
    {
      "index": "1",
      "text": "الر ۚ كِتـٰبٌ أَنزَلنـٰهُ إِلَيكَ لِتُخرِجَ النّاسَ مِنَ الظُّلُمـٰتِ إِلَى النّورِ بِإِذنِ رَبِّهِم إِلىٰ صِرٰطِ العَزيزِ الحَميدِ",
      "bismillah": "بِسمِ اللَّهِ الرَّحمـٰنِ الرَّحيمِ"
    },
    {
      "index": "2",
      "text": "اللَّهِ الَّذى لَهُ ما فِى السَّمـٰوٰتِ وَما فِى الأَرضِ ۗ وَوَيلٌ لِلكـٰفِرينَ مِن عَذابٍ شَديدٍ"
    },
    {
      "index": "3",
      "text": "الَّذينَ يَستَحِبّونَ الحَيوٰةَ الدُّنيا عَلَى الـٔاخِرَةِ وَيَصُدّونَ عَن سَبيلِ اللَّهِ وَيَبغونَها عِوَجًا ۚ أُولـٰئِكَ فى ضَلـٰلٍ بَعيدٍ"
    },
    {
      "index": "4",
      "text": "وَما أَرسَلنا مِن رَسولٍ إِلّا بِلِسانِ قَومِهِ لِيُبَيِّنَ لَهُم ۖ فَيُضِلُّ اللَّهُ مَن يَشاءُ وَيَهدى مَن يَشاءُ ۚ وَهُوَ العَزيزُ الحَكيمُ"
    },
    {
      "index": "5",
      "text": "وَلَقَد أَرسَلنا موسىٰ بِـٔايـٰتِنا أَن أَخرِج قَومَكَ مِنَ الظُّلُمـٰتِ إِلَى النّورِ وَذَكِّرهُم بِأَيّىٰمِ اللَّهِ ۚ إِنَّ فى ذٰلِكَ لَـٔايـٰتٍ لِكُلِّ صَبّارٍ شَكورٍ"
    },
    {
      "index": "6",
      "text": "وَإِذ قالَ موسىٰ لِقَومِهِ اذكُروا نِعمَةَ اللَّهِ عَلَيكُم إِذ أَنجىٰكُم مِن ءالِ فِرعَونَ يَسومونَكُم سوءَ العَذابِ وَيُذَبِّحونَ أَبناءَكُم وَيَستَحيونَ نِساءَكُم ۚ وَفى ذٰلِكُم بَلاءٌ مِن رَبِّكُم عَظيمٌ"
    },
    {
      "index": "7",
      "text": "وَإِذ تَأَذَّنَ رَبُّكُم لَئِن شَكَرتُم لَأَزيدَنَّكُم ۖ وَلَئِن كَفَرتُم إِنَّ عَذابى لَشَديدٌ"
    },
    {
      "index": "8",
      "text": "وَقالَ موسىٰ إِن تَكفُروا أَنتُم وَمَن فِى الأَرضِ جَميعًا فَإِنَّ اللَّهَ لَغَنِىٌّ حَميدٌ"
    },
    {
      "index": "9",
      "text": "أَلَم يَأتِكُم نَبَؤُا۟ الَّذينَ مِن قَبلِكُم قَومِ نوحٍ وَعادٍ وَثَمودَ ۛ وَالَّذينَ مِن بَعدِهِم ۛ لا يَعلَمُهُم إِلَّا اللَّهُ ۚ جاءَتهُم رُسُلُهُم بِالبَيِّنـٰتِ فَرَدّوا أَيدِيَهُم فى أَفوٰهِهِم وَقالوا إِنّا كَفَرنا بِما أُرسِلتُم بِهِ وَإِنّا لَفى شَكٍّ مِمّا تَدعونَنا إِلَيهِ مُريبٍ"
    },
    {
      "index": "10",
      "text": "۞ قالَت رُسُلُهُم أَفِى اللَّهِ شَكٌّ فاطِرِ السَّمـٰوٰتِ وَالأَرضِ ۖ يَدعوكُم لِيَغفِرَ لَكُم مِن ذُنوبِكُم وَيُؤَخِّرَكُم إِلىٰ أَجَلٍ مُسَمًّى ۚ قالوا إِن أَنتُم إِلّا بَشَرٌ مِثلُنا تُريدونَ أَن تَصُدّونا عَمّا كانَ يَعبُدُ ءاباؤُنا فَأتونا بِسُلطـٰنٍ مُبينٍ"
    },
    {
      "index": "11",
      "text": "قالَت لَهُم رُسُلُهُم إِن نَحنُ إِلّا بَشَرٌ مِثلُكُم وَلـٰكِنَّ اللَّهَ يَمُنُّ عَلىٰ مَن يَشاءُ مِن عِبادِهِ ۖ وَما كانَ لَنا أَن نَأتِيَكُم بِسُلطـٰنٍ إِلّا بِإِذنِ اللَّهِ ۚ وَعَلَى اللَّهِ فَليَتَوَكَّلِ المُؤمِنونَ"
    },
    {
      "index": "12",
      "text": "وَما لَنا أَلّا نَتَوَكَّلَ عَلَى اللَّهِ وَقَد هَدىٰنا سُبُلَنا ۚ وَلَنَصبِرَنَّ عَلىٰ ما ءاذَيتُمونا ۚ وَعَلَى اللَّهِ فَليَتَوَكَّلِ المُتَوَكِّلونَ"
    },
    {
      "index": "13",
      "text": "وَقالَ الَّذينَ كَفَروا لِرُسُلِهِم لَنُخرِجَنَّكُم مِن أَرضِنا أَو لَتَعودُنَّ فى مِلَّتِنا ۖ فَأَوحىٰ إِلَيهِم رَبُّهُم لَنُهلِكَنَّ الظّـٰلِمينَ"
    },
    {
      "index": "14",
      "text": "وَلَنُسكِنَنَّكُمُ الأَرضَ مِن بَعدِهِم ۚ ذٰلِكَ لِمَن خافَ مَقامى وَخافَ وَعيدِ"
    },
    {
      "index": "15",
      "text": "وَاستَفتَحوا وَخابَ كُلُّ جَبّارٍ عَنيدٍ"
    },
    {
      "index": "16",
      "text": "مِن وَرائِهِ جَهَنَّمُ وَيُسقىٰ مِن ماءٍ صَديدٍ"
    },
    {
      "index": "17",
      "text": "يَتَجَرَّعُهُ وَلا يَكادُ يُسيغُهُ وَيَأتيهِ المَوتُ مِن كُلِّ مَكانٍ وَما هُوَ بِمَيِّتٍ ۖ وَمِن وَرائِهِ عَذابٌ غَليظٌ"
    },
    {
      "index": "18",
      "text": "مَثَلُ الَّذينَ كَفَروا بِرَبِّهِم ۖ أَعمـٰلُهُم كَرَمادٍ اشتَدَّت بِهِ الرّيحُ فى يَومٍ عاصِفٍ ۖ لا يَقدِرونَ مِمّا كَسَبوا عَلىٰ شَىءٍ ۚ ذٰلِكَ هُوَ الضَّلـٰلُ البَعيدُ"
    },
    {
      "index": "19",
      "text": "أَلَم تَرَ أَنَّ اللَّهَ خَلَقَ السَّمـٰوٰتِ وَالأَرضَ بِالحَقِّ ۚ إِن يَشَأ يُذهِبكُم وَيَأتِ بِخَلقٍ جَديدٍ"
    },
    {
      "index": "20",
      "text": "وَما ذٰلِكَ عَلَى اللَّهِ بِعَزيزٍ"
    },
    {
      "index": "21",
      "text": "وَبَرَزوا لِلَّهِ جَميعًا فَقالَ الضُّعَفـٰؤُا۟ لِلَّذينَ استَكبَروا إِنّا كُنّا لَكُم تَبَعًا فَهَل أَنتُم مُغنونَ عَنّا مِن عَذابِ اللَّهِ مِن شَىءٍ ۚ قالوا لَو هَدىٰنَا اللَّهُ لَهَدَينـٰكُم ۖ سَواءٌ عَلَينا أَجَزِعنا أَم صَبَرنا ما لَنا مِن مَحيصٍ"
    },
    {
      "index": "22",
      "text": "وَقالَ الشَّيطـٰنُ لَمّا قُضِىَ الأَمرُ إِنَّ اللَّهَ وَعَدَكُم وَعدَ الحَقِّ وَوَعَدتُكُم فَأَخلَفتُكُم ۖ وَما كانَ لِىَ عَلَيكُم مِن سُلطـٰنٍ إِلّا أَن دَعَوتُكُم فَاستَجَبتُم لى ۖ فَلا تَلومونى وَلوموا أَنفُسَكُم ۖ ما أَنا۠ بِمُصرِخِكُم وَما أَنتُم بِمُصرِخِىَّ ۖ إِنّى كَفَرتُ بِما أَشرَكتُمونِ مِن قَبلُ ۗ إِنَّ الظّـٰلِمينَ لَهُم عَذابٌ أَليمٌ"
    },
    {
      "index": "23",
      "text": "وَأُدخِلَ الَّذينَ ءامَنوا وَعَمِلُوا الصّـٰلِحـٰتِ جَنّـٰتٍ تَجرى مِن تَحتِهَا الأَنهـٰرُ خـٰلِدينَ فيها بِإِذنِ رَبِّهِم ۖ تَحِيَّتُهُم فيها سَلـٰمٌ"
    },
    {
      "index": "24",
      "text": "أَلَم تَرَ كَيفَ ضَرَبَ اللَّهُ مَثَلًا كَلِمَةً طَيِّبَةً كَشَجَرَةٍ طَيِّبَةٍ أَصلُها ثابِتٌ وَفَرعُها فِى السَّماءِ"
    },
    {
      "index": "25",
      "text": "تُؤتى أُكُلَها كُلَّ حينٍ بِإِذنِ رَبِّها ۗ وَيَضرِبُ اللَّهُ الأَمثالَ لِلنّاسِ لَعَلَّهُم يَتَذَكَّرونَ"
    },
    {
      "index": "26",
      "text": "وَمَثَلُ كَلِمَةٍ خَبيثَةٍ كَشَجَرَةٍ خَبيثَةٍ اجتُثَّت مِن فَوقِ الأَرضِ ما لَها مِن قَرارٍ"
    },
    {
      "index": "27",
      "text": "يُثَبِّتُ اللَّهُ الَّذينَ ءامَنوا بِالقَولِ الثّابِتِ فِى الحَيوٰةِ الدُّنيا وَفِى الـٔاخِرَةِ ۖ وَيُضِلُّ اللَّهُ الظّـٰلِمينَ ۚ وَيَفعَلُ اللَّهُ ما يَشاءُ"
    },
    {
      "index": "28",
      "text": "۞ أَلَم تَرَ إِلَى الَّذينَ بَدَّلوا نِعمَتَ اللَّهِ كُفرًا وَأَحَلّوا قَومَهُم دارَ البَوارِ"
    },
    {
      "index": "29",
      "text": "جَهَنَّمَ يَصلَونَها ۖ وَبِئسَ القَرارُ"
    },
    {
      "index": "30",
      "text": "وَجَعَلوا لِلَّهِ أَندادًا لِيُضِلّوا عَن سَبيلِهِ ۗ قُل تَمَتَّعوا فَإِنَّ مَصيرَكُم إِلَى النّارِ"
    },
    {
      "index": "31",
      "text": "قُل لِعِبادِىَ الَّذينَ ءامَنوا يُقيمُوا الصَّلوٰةَ وَيُنفِقوا مِمّا رَزَقنـٰهُم سِرًّا وَعَلانِيَةً مِن قَبلِ أَن يَأتِىَ يَومٌ لا بَيعٌ فيهِ وَلا خِلـٰلٌ"
    },
    {
      "index": "32",
      "text": "اللَّهُ الَّذى خَلَقَ السَّمـٰوٰتِ وَالأَرضَ وَأَنزَلَ مِنَ السَّماءِ ماءً فَأَخرَجَ بِهِ مِنَ الثَّمَرٰتِ رِزقًا لَكُم ۖ وَسَخَّرَ لَكُمُ الفُلكَ لِتَجرِىَ فِى البَحرِ بِأَمرِهِ ۖ وَسَخَّرَ لَكُمُ الأَنهـٰرَ"
    },
    {
      "index": "33",
      "text": "وَسَخَّرَ لَكُمُ الشَّمسَ وَالقَمَرَ دائِبَينِ ۖ وَسَخَّرَ لَكُمُ الَّيلَ وَالنَّهارَ"
    },
    {
      "index": "34",
      "text": "وَءاتىٰكُم مِن كُلِّ ما سَأَلتُموهُ ۚ وَإِن تَعُدّوا نِعمَتَ اللَّهِ لا تُحصوها ۗ إِنَّ الإِنسـٰنَ لَظَلومٌ كَفّارٌ"
    },
    {
      "index": "35",
      "text": "وَإِذ قالَ إِبرٰهيمُ رَبِّ اجعَل هـٰذَا البَلَدَ ءامِنًا وَاجنُبنى وَبَنِىَّ أَن نَعبُدَ الأَصنامَ"
    },
    {
      "index": "36",
      "text": "رَبِّ إِنَّهُنَّ أَضلَلنَ كَثيرًا مِنَ النّاسِ ۖ فَمَن تَبِعَنى فَإِنَّهُ مِنّى ۖ وَمَن عَصانى فَإِنَّكَ غَفورٌ رَحيمٌ"
    },
    {
      "index": "37",
      "text": "رَبَّنا إِنّى أَسكَنتُ مِن ذُرِّيَّتى بِوادٍ غَيرِ ذى زَرعٍ عِندَ بَيتِكَ المُحَرَّمِ رَبَّنا لِيُقيمُوا الصَّلوٰةَ فَاجعَل أَفـِٔدَةً مِنَ النّاسِ تَهوى إِلَيهِم وَارزُقهُم مِنَ الثَّمَرٰتِ لَعَلَّهُم يَشكُرونَ"
    },
    {
      "index": "38",
      "text": "رَبَّنا إِنَّكَ تَعلَمُ ما نُخفى وَما نُعلِنُ ۗ وَما يَخفىٰ عَلَى اللَّهِ مِن شَىءٍ فِى الأَرضِ وَلا فِى السَّماءِ"
    },
    {
      "index": "39",
      "text": "الحَمدُ لِلَّهِ الَّذى وَهَبَ لى عَلَى الكِبَرِ إِسمـٰعيلَ وَإِسحـٰقَ ۚ إِنَّ رَبّى لَسَميعُ الدُّعاءِ"
    },
    {
      "index": "40",
      "text": "رَبِّ اجعَلنى مُقيمَ الصَّلوٰةِ وَمِن ذُرِّيَّتى ۚ رَبَّنا وَتَقَبَّل دُعاءِ"
    },
    {
      "index": "41",
      "text": "رَبَّنَا اغفِر لى وَلِوٰلِدَىَّ وَلِلمُؤمِنينَ يَومَ يَقومُ الحِسابُ"
    },
    {
      "index": "42",
      "text": "وَلا تَحسَبَنَّ اللَّهَ غـٰفِلًا عَمّا يَعمَلُ الظّـٰلِمونَ ۚ إِنَّما يُؤَخِّرُهُم لِيَومٍ تَشخَصُ فيهِ الأَبصـٰرُ"
    },
    {
      "index": "43",
      "text": "مُهطِعينَ مُقنِعى رُءوسِهِم لا يَرتَدُّ إِلَيهِم طَرفُهُم ۖ وَأَفـِٔدَتُهُم هَواءٌ"
    },
    {
      "index": "44",
      "text": "وَأَنذِرِ النّاسَ يَومَ يَأتيهِمُ العَذابُ فَيَقولُ الَّذينَ ظَلَموا رَبَّنا أَخِّرنا إِلىٰ أَجَلٍ قَريبٍ نُجِب دَعوَتَكَ وَنَتَّبِعِ الرُّسُلَ ۗ أَوَلَم تَكونوا أَقسَمتُم مِن قَبلُ ما لَكُم مِن زَوالٍ"
    },
    {
      "index": "45",
      "text": "وَسَكَنتُم فى مَسـٰكِنِ الَّذينَ ظَلَموا أَنفُسَهُم وَتَبَيَّنَ لَكُم كَيفَ فَعَلنا بِهِم وَضَرَبنا لَكُمُ الأَمثالَ"
    },
    {
      "index": "46",
      "text": "وَقَد مَكَروا مَكرَهُم وَعِندَ اللَّهِ مَكرُهُم وَإِن كانَ مَكرُهُم لِتَزولَ مِنهُ الجِبالُ"
    },
    {
      "index": "47",
      "text": "فَلا تَحسَبَنَّ اللَّهَ مُخلِفَ وَعدِهِ رُسُلَهُ ۗ إِنَّ اللَّهَ عَزيزٌ ذُو انتِقامٍ"
    },
    {
      "index": "48",
      "text": "يَومَ تُبَدَّلُ الأَرضُ غَيرَ الأَرضِ وَالسَّمـٰوٰتُ ۖ وَبَرَزوا لِلَّهِ الوٰحِدِ القَهّارِ"
    },
    {
      "index": "49",
      "text": "وَتَرَى المُجرِمينَ يَومَئِذٍ مُقَرَّنينَ فِى الأَصفادِ"
    },
    {
      "index": "50",
      "text": "سَرابيلُهُم مِن قَطِرانٍ وَتَغشىٰ وُجوهَهُمُ النّارُ"
    },
    {
      "index": "51",
      "text": "لِيَجزِىَ اللَّهُ كُلَّ نَفسٍ ما كَسَبَت ۚ إِنَّ اللَّهَ سَريعُ الحِسابِ"
    },
    {
      "index": "52",
      "text": "هـٰذا بَلـٰغٌ لِلنّاسِ وَلِيُنذَروا بِهِ وَلِيَعلَموا أَنَّما هُوَ إِلـٰهٌ وٰحِدٌ وَلِيَذَّكَّرَ أُولُوا الأَلبـٰبِ"
    }
  ],
  "index": "14",
  "name": "ابراهيم",
  "copyright": "# PLEASE DO NOT REMOVE OR CHANGE THIS COPYRIGHT BLOCK \n#==================================================================== \n#\n#  Tanzil Quran Text (Uthmani Minimal, Version 1.1)\n#  Copyright (C) 2007-2022 Tanzil Project\n#  License: Creative Commons Attribution 3.0\n#\n#  This copy of the Quran text is carefully produced, highly \n#  verified and continuously monitored by a group of specialists \n#  at Tanzil Project.\n#\n#  TERMS OF USE:\n#\n#  - Permission is granted to copy and distribute verbatim copies \n#    of this text, but CHANGING IT IS NOT ALLOWED.\n#\n#  - This Quran text can be used in any website or application, \n#    provided that its source (Tanzil Project) is clearly indicated, \n#    and a link is made to tanzil.net to enable users to keep\n#    track of changes.\n#\n#  - This copyright notice shall be included in all verbatim copies \n#    of the text, and shall be reproduced appropriately in all files \n#    derived from or containing substantial portion of this text.\n#\n#  Please check updates at: http://tanzil.net/updates/\n#\n#====================================================================\n",
  "type": "uthmani-min",
  "version": "1.1"
}