{
  "aya": [
    {
      "index": "1",
      "text": "حم",
      "bismillah": "بِسْمِ اللَّهِ الرَّحْمَـٰنِ الرَّحِيمِ"
    },
    {
      "index": "2",
      "text": "وَالْكِتَابِ الْمُبِينِ"
    },
    {
      "index": "3",
      "text": "إِنَّا أَنزَلْنَاهُ فِي لَيْلَةٍ مُّبَارَكَةٍ ۚ إِنَّا كُنَّا مُنذِرِينَ"
    },
    {
      "index": "4",
      "text": "فِيهَا يُفْرَقُ كُلُّ أَمْرٍ حَكِيمٍ"
    },
    {
      "index": "5",
      "text": "أَمْرًا مِّنْ عِندِنَا ۚ إِنَّا كُنَّا مُرْسِلِينَ"
    },
    {
      "index": "6",
      "text": "رَحْمَةً مِّن رَّبِّكَ ۚ إِنَّهُ هُوَ السَّمِيعُ الْعَلِيمُ"
    },
    {
      "index": "7",
      "text": "رَبِّ السَّمَاوَاتِ وَالْأَرْضِ وَمَا بَيْنَهُمَا ۖ إِن كُنتُم مُّوقِنِينَ"
    },
    {
      "index": "8",
      "text": "لَا إِلَـٰهَ إِلَّا هُوَ يُحْيِي وَيُمِيتُ ۖ رَبُّكُمْ وَرَبُّ آبَائِكُمُ الْأَوَّلِينَ"
    },
    {
      "index": "9",
      "text": "بَلْ هُمْ فِي شَكٍّ يَلْعَبُونَ"
    },
    {
      "index": "10",
      "text": "فَارْتَقِبْ يَوْمَ تَأْتِي السَّمَاءُ بِدُخَانٍ مُّبِينٍ"
    },
    {
      "index": "11",
      "text": "يَغْشَى النَّاسَ ۖ هَـٰذَا عَذَابٌ أَلِيمٌ"
    },
    {
      "index": "12",
      "text": "رَّبَّنَا اكْشِفْ عَنَّا الْعَذَابَ إِنَّا مُؤْمِنُونَ"
    },
    {
      "index": "13",
      "text": "أَنَّىٰ لَهُمُ الذِّكْرَىٰ وَقَدْ جَاءَهُمْ رَسُولٌ مُّبِينٌ"
    },
    {
      "index": "14",
      "text": "ثُمَّ تَوَلَّوْا عَنْهُ وَقَالُوا مُعَلَّمٌ مَّجْنُونٌ"
    },
    {
      "index": "15",
      "text": "إِنَّا كَاشِفُو الْعَذَابِ قَلِيلًا ۚ إِنَّكُمْ عَائِدُونَ"
    },
    {
      "index": "16",
      "text": "يَوْمَ نَبْطِشُ الْبَطْشَةَ الْكُبْرَىٰ إِنَّا مُنتَقِمُونَ"
    },
    {
      "index": "17",
      "text": "۞ وَلَقَدْ فَتَنَّا قَبْلَهُمْ قَوْمَ فِرْعَوْنَ وَجَاءَهُمْ رَسُولٌ كَرِيمٌ"
    },
    {
      "index": "18",
      "text": "أَنْ أَدُّوا إِلَيَّ عِبَادَ اللَّهِ ۖ إِنِّي لَكُمْ رَسُولٌ أَمِينٌ"
    },
    {
      "index": "19",
      "text": "وَأَن لَّا تَعْلُوا عَلَى اللَّهِ ۖ إِنِّي آتِيكُم بِسُلْطَانٍ مُّبِينٍ"
    },
    {
      "index": "20",
      "text": "وَإِنِّي عُذْتُ بِرَبِّي وَرَبِّكُمْ أَن تَرْجُمُونِ"
    },
    {
      "index": "21",
      "text": "وَإِن لَّمْ تُؤْمِنُوا لِي فَاعْتَزِلُونِ"
    },
    {
      "index": "22",
      "text": "فَدَعَا رَبَّهُ أَنَّ هَـٰؤُلَاءِ قَوْمٌ مُّجْرِمُونَ"
    },
    {
      "index": "23",
      "text": "فَأَسْرِ بِعِبَادِي لَيْلًا إِنَّكُم مُّتَّبَعُونَ"
    },
    {
      "index": "24",
      "text": "وَاتْرُكِ الْبَحْرَ رَهْوًا ۖ إِنَّهُمْ جُندٌ مُّغْرَقُونَ"
    },
    {
      "index": "25",
      "text": "كَمْ تَرَكُوا مِن جَنَّاتٍ وَعُيُونٍ"
    },
    {
      "index": "26",
      "text": "وَزُرُوعٍ وَمَقَامٍ كَرِيمٍ"
    },
    {
      "index": "27",
      "text": "وَنَعْمَةٍ كَانُوا فِيهَا فَاكِهِينَ"
    },
    {
      "index": "28",
      "text": "كَذَٰلِكَ ۖ وَأَوْرَثْنَاهَا قَوْمًا آخَرِينَ"
    },
    {
      "index": "29",
      "text": "فَمَا بَكَتْ عَلَيْهِمُ السَّمَاءُ وَالْأَرْضُ وَمَا كَانُوا مُنظَرِينَ"
    },
    {
      "index": "30",
      "text": "وَلَقَدْ نَجَّيْنَا بَنِي إِسْرَائِيلَ مِنَ الْعَذَابِ الْمُهِينِ"
    },
    {
      "index": "31",
      "text": "مِن فِرْعَوْنَ ۚ إِنَّهُ كَانَ عَالِيًا مِّنَ الْمُسْرِفِينَ"
    },
    {
      "index": "32",
      "text": "وَلَقَدِ اخْتَرْنَاهُمْ عَلَىٰ عِلْمٍ عَلَى الْعَالَمِينَ"
    },
    {
      "index": "33",
      "text": "وَآتَيْنَاهُم مِّنَ الْآيَاتِ مَا فِيهِ بَلَاءٌ مُّبِينٌ"
    },
    {
      "index": "34",
      "text": "إِنَّ هَـٰؤُلَاءِ لَيَقُولُونَ"
    },
    {
      "index": "35",
      "text": "إِنْ هِيَ إِلَّا مَوْتَتُنَا الْأُولَىٰ وَمَا نَحْنُ بِمُنشَرِينَ"
    },
    {
      "index": "36",
      "text": "فَأْتُوا بِآبَائِنَا إِن كُنتُمْ صَادِقِينَ"
    },
    {
      "index": "37",
      "text": "أَهُمْ خَيْرٌ أَمْ قَوْمُ تُبَّعٍ وَالَّذِينَ مِن قَبْلِهِمْ ۚ أَهْلَكْنَاهُمْ ۖ إِنَّهُمْ كَانُوا مُجْرِمِينَ"
    },
    {
      "index": "38",
      "text": "وَمَا خَلَقْنَا السَّمَاوَاتِ وَالْأَرْضَ وَمَا بَيْنَهُمَا لَاعِبِينَ"
    },
    {
      "index": "39",
      "text": "مَا خَلَقْنَاهُمَا إِلَّا بِالْحَقِّ وَلَـٰكِنَّ أَكْثَرَهُمْ لَا يَعْلَمُونَ"
    },
    {
      "index": "40",
      "text": "إِنَّ يَوْمَ الْفَصْلِ مِيقَاتُهُمْ أَجْمَعِينَ"
    },
    {
      "index": "41",
      "text": "يَوْمَ لَا يُغْنِي مَوْلًى عَن مَّوْلًى شَيْئًا وَلَا هُمْ يُنصَرُونَ"
    },
    {
      "index": "42",
      "text": "إِلَّا مَن رَّحِمَ اللَّهُ ۚ إِنَّهُ هُوَ الْعَزِيزُ الرَّحِيمُ"
    },
    {
      "index": "43",
      "text": "إِنَّ شَجَرَتَ الزَّقُّومِ"
    },
    {
      "index": "44",
      "text": "طَعَامُ الْأَثِيمِ"
    },
    {
      "index": "45",
      "text": "كَالْمُهْلِ يَغْلِي فِي الْبُطُونِ"
    },
    {
      "index": "46",
      "text": "كَغَلْيِ الْحَمِيمِ"
    },
    {
      "index": "47",
      "text": "خُذُوهُ فَاعْتِلُوهُ إِلَىٰ سَوَاءِ الْجَحِيمِ"
    },
    {
      "index": "48",
      "text": "ثُمَّ صُبُّوا فَوْقَ رَأْسِهِ مِنْ عَذَابِ الْحَمِيمِ"
    },
    {
      "index": "49",
      "text": "ذُقْ إِنَّكَ أَنتَ الْعَزِيزُ الْكَرِيمُ"
    },
    {
      "index": "50",
      "text": "إِنَّ هَـٰذَا مَا كُنتُم بِهِ تَمْتَرُونَ"
    },
    {
      "index": "51",
      "text": "إِنَّ الْمُتَّقِينَ فِي مَقَامٍ أَمِينٍ"
    },
    {
      "index": "52",
      "text": "فِي جَنَّاتٍ وَعُيُونٍ"
    },
    {
      "index": "53",
      "text": "يَلْبَسُونَ مِن سُندُسٍ وَإِسْتَبْرَقٍ مُّتَقَابِلِينَ"
    },
    {
      "index": "54",
      "text": "كَذَٰلِكَ وَزَوَّجْنَاهُم بِحُورٍ عِينٍ"
    },
    {
      "index": "55",
      "text": "يَدْعُونَ فِيهَا بِكُلِّ فَاكِهَةٍ آمِنِينَ"
    },
    {
      "index": "56",
      "text": "لَا يَذُوقُونَ فِيهَا الْمَوْتَ إِلَّا الْمَوْتَةَ الْأُولَىٰ ۖ وَوَقَاهُمْ عَذَابَ الْجَحِيمِ"
    },
    {
      "index": "57",
      "text": "فَضْلًا مِّن رَّبِّكَ ۚ ذَٰلِكَ هُوَ الْفَوْزُ الْعَظِيمُ"
    },
    {
      "index": "58",
      "text": "فَإِنَّمَا يَسَّرْنَاهُ بِلِسَانِكَ لَعَلَّهُمْ يَتَذَكَّرُونَ"
    },
    {
      "index": "59",
      "text": "فَارْتَقِبْ إِنَّهُم مُّرْتَقِبُونَ"
    }
  ],
  "index": "44",
  "name": "الدخان",
  "copyright": "# PLEASE DO NOT REMOVE OR CHANGE THIS COPYRIGHT BLOCK \n#==================================================================== \n#\n#  Tanzil Quran Text (Simple, Version 1.1)\n#  Copyright (C) 2007-2022 Tanzil Project\n#  License: Creative Commons Attribution 3.0\n#\n#  This copy of the Quran text is carefully produced, highly \n#  verified and continuously monitored by a group of specialists \n#  at Tanzil Project.\n#\n#  TERMS OF USE:\n#\n#  - Permission is granted to copy and distribute verbatim copies \n#    of this text, but CHANGING IT IS NOT ALLOWED.\n#\n#  - This Quran text can be used in any website or application, \n#    provided that its source (Tanzil Project) is clearly indicated, \n#    and a link is made to tanzil.net to enable users to keep\n#    track of changes.\n#\n#  - This copyright notice shall be included in all verbatim copies \n#    of the text, and shall be reproduced appropriately in all files \n#    derived from or containing substantial portion of this text.\n#\n#  Please check updates at: http://tanzil.net/updates/\n#\n#====================================================================\n",
  "type": "simple",
  "version": "1.1"
}