{
  "aya": [
    {
      "index": "1",
      "text": "طسٓمٓ",
      "bismillah": "بِسْمِ ٱللَّهِ ٱلرَّحْمَـٰنِ ٱلرَّحِيمِ"
    },
    {
      "index": "2",
      "text": "تِلْكَ ءَايَـٰتُ ٱلْكِتَـٰبِ ٱلْمُبِينِ"
    },
    {
      "index": "3",
      "text": "لَعَلَّكَ بَـٰخِعٌ نَّفْسَكَ أَلَّا يَكُونُوا۟ مُؤْمِنِينَ"
    },
    {
      "index": "4",
      "text": "إِن نَّشَأْ نُنَزِّلْ عَلَيْهِم مِّنَ ٱلسَّمَآءِ ءَايَةً فَظَلَّتْ أَعْنَـٰقُهُمْ لَهَا خَـٰضِعِينَ"
    },
    {
      "index": "5",
      "text": "وَمَا يَأْتِيهِم مِّن ذِكْرٍ مِّنَ ٱلرَّحْمَـٰنِ مُحْدَثٍ إِلَّا كَانُوا۟ عَنْهُ مُعْرِضِينَ"
    },
    {
      "index": "6",
      "text": "فَقَدْ كَذَّبُوا۟ فَسَيَأْتِيهِمْ أَنۢبَـٰٓؤُا۟ مَا كَانُوا۟ بِهِۦ يَسْتَهْزِءُونَ"
    },
    {
      "index": "7",
      "text": "أَوَلَمْ يَرَوْا۟ إِلَى ٱلْأَرْضِ كَمْ أَنۢبَتْنَا فِيهَا مِن كُلِّ زَوْجٍ كَرِيمٍ"
    },
    {
      "index": "8",
      "text": "إِنَّ فِى ذَٰلِكَ لَـَٔايَةً ۖ وَمَا كَانَ أَكْثَرُهُم مُّؤْمِنِينَ"
    },
    {
      "index": "9",
      "text": "وَإِنَّ رَبَّكَ لَهُوَ ٱلْعَزِيزُ ٱلرَّحِيمُ"
    },
    {
      "index": "10",
      "text": "وَإِذْ نَادَىٰ رَبُّكَ مُوسَىٰٓ أَنِ ٱئْتِ ٱلْقَوْمَ ٱلظَّـٰلِمِينَ"
    },
    {
      "index": "11",
      "text": "قَوْمَ فِرْعَوْنَ ۚ أَلَا يَتَّقُونَ"
    },
    {
      "index": "12",
      "text": "قَالَ رَبِّ إِنِّىٓ أَخَافُ أَن يُكَذِّبُونِ"
    },
    {
      "index": "13",
      "text": "وَيَضِيقُ صَدْرِى وَلَا يَنطَلِقُ لِسَانِى فَأَرْسِلْ إِلَىٰ هَـٰرُونَ"
    },
    {
      "index": "14",
      "text": "وَلَهُمْ عَلَىَّ ذَنۢبٌ فَأَخَافُ أَن يَقْتُلُونِ"
    },
    {
      "index": "15",
      "text": "قَالَ كَلَّا ۖ فَٱذْهَبَا بِـَٔايَـٰتِنَآ ۖ إِنَّا مَعَكُم مُّسْتَمِعُونَ"
    },
    {
      "index": "16",
      "text": "فَأْتِيَا فِرْعَوْنَ فَقُولَآ إِنَّا رَسُولُ رَبِّ ٱلْعَـٰلَمِينَ"
    },
    {
      "index": "17",
      "text": "أَنْ أَرْسِلْ مَعَنَا بَنِىٓ إِسْرَٰٓءِيلَ"
    },
    {
      "index": "18",
      "text": "قَالَ أَلَمْ نُرَبِّكَ فِينَا وَلِيدًا وَلَبِثْتَ فِينَا مِنْ عُمُرِكَ سِنِينَ"
    },
    {
      "index": "19",
      "text": "وَفَعَلْتَ فَعْلَتَكَ ٱلَّتِى فَعَلْتَ وَأَنتَ مِنَ ٱلْكَـٰفِرِينَ"
    },
    {
      "index": "20",
      "text": "قَالَ فَعَلْتُهَآ إِذًا وَأَنَا۠ مِنَ ٱلضَّآلِّينَ"
    },
    {
      "index": "21",
      "text": "فَفَرَرْتُ مِنكُمْ لَمَّا خِفْتُكُمْ فَوَهَبَ لِى رَبِّى حُكْمًا وَجَعَلَنِى مِنَ ٱلْمُرْسَلِينَ"
    },
    {
      "index": "22",
      "text": "وَتِلْكَ نِعْمَةٌ تَمُنُّهَا عَلَىَّ أَنْ عَبَّدتَّ بَنِىٓ إِسْرَٰٓءِيلَ"
    },
    {
      "index": "23",
      "text": "قَالَ فِرْعَوْنُ وَمَا رَبُّ ٱلْعَـٰلَمِينَ"
    },
    {
      "index": "24",
      "text": "قَالَ رَبُّ ٱلسَّمَـٰوَٰتِ وَٱلْأَرْضِ وَمَا بَيْنَهُمَآ ۖ إِن كُنتُم مُّوقِنِينَ"
    },
    {
      "index": "25",
      "text": "قَالَ لِمَنْ حَوْلَهُۥٓ أَلَا تَسْتَمِعُونَ"
    },
    {
      "index": "26",
      "text": "قَالَ رَبُّكُمْ وَرَبُّ ءَابَآئِكُمُ ٱلْأَوَّلِينَ"
    },
    {
      "index": "27",
      "text": "قَالَ إِنَّ رَسُولَكُمُ ٱلَّذِىٓ أُرْسِلَ إِلَيْكُمْ لَمَجْنُونٌ"
    },
    {
      "index": "28",
      "text": "قَالَ رَبُّ ٱلْمَشْرِقِ وَٱلْمَغْرِبِ وَمَا بَيْنَهُمَآ ۖ إِن كُنتُمْ تَعْقِلُونَ"
    },
    {
      "index": "29",
      "text": "قَالَ لَئِنِ ٱتَّخَذْتَ إِلَـٰهًا غَيْرِى لَأَجْعَلَنَّكَ مِنَ ٱلْمَسْجُونِينَ"
    },
    {
      "index": "30",
      "text": "قَالَ أَوَلَوْ جِئْتُكَ بِشَىْءٍ مُّبِينٍ"
    },
    {
      "index": "31",
      "text": "قَالَ فَأْتِ بِهِۦٓ إِن كُنتَ مِنَ ٱلصَّـٰدِقِينَ"
    },
    {
      "index": "32",
      "text": "فَأَلْقَىٰ عَصَاهُ فَإِذَا هِىَ ثُعْبَانٌ مُّبِينٌ"
    },
    {
      "index": "33",
      "text": "وَنَزَعَ يَدَهُۥ فَإِذَا هِىَ بَيْضَآءُ لِلنَّـٰظِرِينَ"
    },
    {
      "index": "34",
      "text": "قَالَ لِلْمَلَإِ حَوْلَهُۥٓ إِنَّ هَـٰذَا لَسَـٰحِرٌ عَلِيمٌ"
    },
    {
      "index": "35",
      "text": "يُرِيدُ أَن يُخْرِجَكُم مِّنْ أَرْضِكُم بِسِحْرِهِۦ فَمَاذَا تَأْمُرُونَ"
    },
    {
      "index": "36",
      "text": "قَالُوٓا۟ أَرْجِهْ وَأَخَاهُ وَٱبْعَثْ فِى ٱلْمَدَآئِنِ حَـٰشِرِينَ"
    },
    {
      "index": "37",
      "text": "يَأْتُوكَ بِكُلِّ سَحَّارٍ عَلِيمٍ"
    },
    {
      "index": "38",
      "text": "فَجُمِعَ ٱلسَّحَرَةُ لِمِيقَـٰتِ يَوْمٍ مَّعْلُومٍ"
    },
    {
      "index": "39",
      "text": "وَقِيلَ لِلنَّاسِ هَلْ أَنتُم مُّجْتَمِعُونَ"
    },
    {
      "index": "40",
      "text": "لَعَلَّنَا نَتَّبِعُ ٱلسَّحَرَةَ إِن كَانُوا۟ هُمُ ٱلْغَـٰلِبِينَ"
    },
    {
      "index": "41",
      "text": "فَلَمَّا جَآءَ ٱلسَّحَرَةُ قَالُوا۟ لِفِرْعَوْنَ أَئِنَّ لَنَا لَأَجْرًا إِن كُنَّا نَحْنُ ٱلْغَـٰلِبِينَ"
    },
    {
      "index": "42",
      "text": "قَالَ نَعَمْ وَإِنَّكُمْ إِذًا لَّمِنَ ٱلْمُقَرَّبِينَ"
    },
    {
      "index": "43",
      "text": "قَالَ لَهُم مُّوسَىٰٓ أَلْقُوا۟ مَآ أَنتُم مُّلْقُونَ"
    },
    {
      "index": "44",
      "text": "فَأَلْقَوْا۟ حِبَالَهُمْ وَعِصِيَّهُمْ وَقَالُوا۟ بِعِزَّةِ فِرْعَوْنَ إِنَّا لَنَحْنُ ٱلْغَـٰلِبُونَ"
    },
    {
      "index": "45",
      "text": "فَأَلْقَىٰ مُوسَىٰ عَصَاهُ فَإِذَا هِىَ تَلْقَفُ مَا يَأْفِكُونَ"
    },
    {
      "index": "46",
      "text": "فَأُلْقِىَ ٱلسَّحَرَةُ سَـٰجِدِينَ"
    },
    {
      "index": "47",
      "text": "قَالُوٓا۟ ءَامَنَّا بِرَبِّ ٱلْعَـٰلَمِينَ"
    },
    {
      "index": "48",
      "text": "رَبِّ مُوسَىٰ وَهَـٰرُونَ"
    },
    {
      "index": "49",
      "text": "قَالَ ءَامَنتُمْ لَهُۥ قَبْلَ أَنْ ءَاذَنَ لَكُمْ ۖ إِنَّهُۥ لَكَبِيرُكُمُ ٱلَّذِى عَلَّمَكُمُ ٱلسِّحْرَ فَلَسَوْفَ تَعْلَمُونَ ۚ لَأُقَطِّعَنَّ أَيْدِيَكُمْ وَأَرْجُلَكُم مِّنْ خِلَـٰفٍ وَلَأُصَلِّبَنَّكُمْ أَجْمَعِينَ"
    },
    {
      "index": "50",
      "text": "قَالُوا۟ لَا ضَيْرَ ۖ إِنَّآ إِلَىٰ رَبِّنَا مُنقَلِبُونَ"
    },
    {
      "index": "51",
      "text": "إِنَّا نَطْمَعُ أَن يَغْفِرَ لَنَا رَبُّنَا خَطَـٰيَـٰنَآ أَن كُنَّآ أَوَّلَ ٱلْمُؤْمِنِينَ"
    },
    {
      "index": "52",
      "text": "۞ وَأَوْحَيْنَآ إِلَىٰ مُوسَىٰٓ أَنْ أَسْرِ بِعِبَادِىٓ إِنَّكُم مُّتَّبَعُونَ"
    },
    {
      "index": "53",
      "text": "فَأَرْسَلَ فِرْعَوْنُ فِى ٱلْمَدَآئِنِ حَـٰشِرِينَ"
    },
    {
      "index": "54",
      "text": "إِنَّ هَـٰٓؤُلَآءِ لَشِرْذِمَةٌ قَلِيلُونَ"
    },
    {
      "index": "55",
      "text": "وَإِنَّهُمْ لَنَا لَغَآئِظُونَ"
    },
    {
      "index": "56",
      "text": "وَإِنَّا لَجَمِيعٌ حَـٰذِرُونَ"
    },
    {
      "index": "57",
      "text": "فَأَخْرَجْنَـٰهُم مِّن جَنَّـٰتٍ وَعُيُونٍ"
    },
    {
      "index": "58",
      "text": "وَكُنُوزٍ وَمَقَامٍ كَرِيمٍ"
    },
    {
      "index": "59",
      "text": "كَذَٰلِكَ وَأَوْرَثْنَـٰهَا بَنِىٓ إِسْرَٰٓءِيلَ"
    },
    {
      "index": "60",
      "text": "فَأَتْبَعُوهُم مُّشْرِقِينَ"
    },
    {
      "index": "61",
      "text": "فَلَمَّا تَرَٰٓءَا ٱلْجَمْعَانِ قَالَ أَصْحَـٰبُ مُوسَىٰٓ إِنَّا لَمُدْرَكُونَ"
    },
    {
      "index": "62",
      "text": "قَالَ كَلَّآ ۖ إِنَّ مَعِىَ رَبِّى سَيَهْدِينِ"
    },
    {
      "index": "63",
      "text": "فَأَوْحَيْنَآ إِلَىٰ مُوسَىٰٓ أَنِ ٱضْرِب بِّعَصَاكَ ٱلْبَحْرَ ۖ فَٱنفَلَقَ فَكَانَ كُلُّ فِرْقٍ كَٱلطَّوْدِ ٱلْعَظِيمِ"
    },
    {
      "index": "64",
      "text": "وَأَزْلَفْنَا ثَمَّ ٱلْـَٔاخَرِينَ"
    },
    {
      "index": "65",
      "text": "وَأَنجَيْنَا مُوسَىٰ وَمَن مَّعَهُۥٓ أَجْمَعِينَ"
    },
    {
      "index": "66",
      "text": "ثُمَّ أَغْرَقْنَا ٱلْـَٔاخَرِينَ"
    },
    {
      "index": "67",
      "text": "إِنَّ فِى ذَٰلِكَ لَـَٔايَةً ۖ وَمَا كَانَ أَكْثَرُهُم مُّؤْمِنِينَ"
    },
    {
      "index": "68",
      "text": "وَإِنَّ رَبَّكَ لَهُوَ ٱلْعَزِيزُ ٱلرَّحِيمُ"
    },
    {
      "index": "69",
      "text": "وَٱتْلُ عَلَيْهِمْ نَبَأَ إِبْرَٰهِيمَ"
    },
    {
      "index": "70",
      "text": "إِذْ قَالَ لِأَبِيهِ وَقَوْمِهِۦ مَا تَعْبُدُونَ"
    },
    {
      "index": "71",
      "text": "قَالُوا۟ نَعْبُدُ أَصْنَامًا فَنَظَلُّ لَهَا عَـٰكِفِينَ"
    },
    {
      "index": "72",
      "text": "قَالَ هَلْ يَسْمَعُونَكُمْ إِذْ تَدْعُونَ"
    },
    {
      "index": "73",
      "text": "أَوْ يَنفَعُونَكُمْ أَوْ يَضُرُّونَ"
    },
    {
      "index": "74",
      "text": "قَالُوا۟ بَلْ وَجَدْنَآ ءَابَآءَنَا كَذَٰلِكَ يَفْعَلُونَ"
    },
    {
      "index": "75",
      "text": "قَالَ أَفَرَءَيْتُم مَّا كُنتُمْ تَعْبُدُونَ"
    },
    {
      "index": "76",
      "text": "أَنتُمْ وَءَابَآؤُكُمُ ٱلْأَقْدَمُونَ"
    },
    {
      "index": "77",
      "text": "فَإِنَّهُمْ عَدُوٌّ لِّىٓ إِلَّا رَبَّ ٱلْعَـٰلَمِينَ"
    },
    {
      "index": "78",
      "text": "ٱلَّذِى خَلَقَنِى فَهُوَ يَهْدِينِ"
    },
    {
      "index": "79",
      "text": "وَٱلَّذِى هُوَ يُطْعِمُنِى وَيَسْقِينِ"
    },
    {
      "index": "80",
      "text": "وَإِذَا مَرِضْتُ فَهُوَ يَشْفِينِ"
    },
    {
      "index": "81",
      "text": "وَٱلَّذِى يُمِيتُنِى ثُمَّ يُحْيِينِ"
    },
    {
      "index": "82",
      "text": "وَٱلَّذِىٓ أَطْمَعُ أَن يَغْفِرَ لِى خَطِيٓـَٔتِى يَوْمَ ٱلدِّينِ"
    },
    {
      "index": "83",
      "text": "رَبِّ هَبْ لِى حُكْمًا وَأَلْحِقْنِى بِٱلصَّـٰلِحِينَ"
    },
    {
      "index": "84",
      "text": "وَٱجْعَل لِّى لِسَانَ صِدْقٍ فِى ٱلْـَٔاخِرِينَ"
    },
    {
      "index": "85",
      "text": "وَٱجْعَلْنِى مِن وَرَثَةِ جَنَّةِ ٱلنَّعِيمِ"
    },
    {
      "index": "86",
      "text": "وَٱغْفِرْ لِأَبِىٓ إِنَّهُۥ كَانَ مِنَ ٱلضَّآلِّينَ"
    },
    {
      "index": "87",
      "text": "وَلَا تُخْزِنِى يَوْمَ يُبْعَثُونَ"
    },
    {
      "index": "88",
      "text": "يَوْمَ لَا يَنفَعُ مَالٌ وَلَا بَنُونَ"
    },
    {
      "index": "89",
      "text": "إِلَّا مَنْ أَتَى ٱللَّهَ بِقَلْبٍ سَلِيمٍ"
    },
    {
      "index": "90",
      "text": "وَأُزْلِفَتِ ٱلْجَنَّةُ لِلْمُتَّقِينَ"
    },
    {
      "index": "91",
      "text": "وَبُرِّزَتِ ٱلْجَحِيمُ لِلْغَاوِينَ"
    },
    {
      "index": "92",
      "text": "وَقِيلَ لَهُمْ أَيْنَ مَا كُنتُمْ تَعْبُدُونَ"
    },
    {
      "index": "93",
      "text": "مِن دُونِ ٱللَّهِ هَلْ يَنصُرُونَكُمْ أَوْ يَنتَصِرُونَ"
    },
    {
      "index": "94",
      "text": "فَكُبْكِبُوا۟ فِيهَا هُمْ وَٱلْغَاوُۥنَ"
    },
    {
      "index": "95",
      "text": "وَجُنُودُ إِبْلِيسَ أَجْمَعُونَ"
    },
    {
      "index": "96",
      "text": "قَالُوا۟ وَهُمْ فِيهَا يَخْتَصِمُونَ"
    },
    {
      "index": "97",
      "text": "تَٱللَّهِ إِن كُنَّا لَفِى ضَلَـٰلٍ مُّبِينٍ"
    },
    {
      "index": "98",
      "text": "إِذْ نُسَوِّيكُم بِرَبِّ ٱلْعَـٰلَمِينَ"
    },
    {
      "index": "99",
      "text": "وَمَآ أَضَلَّنَآ إِلَّا ٱلْمُجْرِمُونَ"
    },
    {
      "index": "100",
      "text": "فَمَا لَنَا مِن شَـٰفِعِينَ"
    },
    {
      "index": "101",
      "text": "وَلَا صَدِيقٍ حَمِيمٍ"
    },
    {
      "index": "102",
      "text": "فَلَوْ أَنَّ لَنَا كَرَّةً فَنَكُونَ مِنَ ٱلْمُؤْمِنِينَ"
    },
    {
      "index": "103",
      "text": "إِنَّ فِى ذَٰلِكَ لَـَٔايَةً ۖ وَمَا كَانَ أَكْثَرُهُم مُّؤْمِنِينَ"
    },
    {
      "index": "104",
      "text": "وَإِنَّ رَبَّكَ لَهُوَ ٱلْعَزِيزُ ٱلرَّحِيمُ"
    },
    {
      "index": "105",
      "text": "كَذَّبَتْ قَوْمُ نُوحٍ ٱلْمُرْسَلِينَ"
    },
    {
      "index": "106",
      "text": "إِذْ قَالَ لَهُمْ أَخُوهُمْ نُوحٌ أَلَا تَتَّقُونَ"
    },
    {
      "index": "107",
      "text": "إِنِّى لَكُمْ رَسُولٌ أَمِينٌ"
    },
    {
      "index": "108",
      "text": "فَٱتَّقُوا۟ ٱللَّهَ وَأَطِيعُونِ"
    },
    {
      "index": "109",
      "text": "وَمَآ أَسْـَٔلُكُمْ عَلَيْهِ مِنْ أَجْرٍ ۖ إِنْ أَجْرِىَ إِلَّا عَلَىٰ رَبِّ ٱلْعَـٰلَمِينَ"
    },
    {
      "index": "110",
      "text": "فَٱتَّقُوا۟ ٱللَّهَ وَأَطِيعُونِ"
    },
    {
      "index": "111",
      "text": "۞ قَالُوٓا۟ أَنُؤْمِنُ لَكَ وَٱتَّبَعَكَ ٱلْأَرْذَلُونَ"
    },
    {
      "index": "112",
      "text": "قَالَ وَمَا عِلْمِى بِمَا كَانُوا۟ يَعْمَلُونَ"
    },
    {
      "index": "113",
      "text": "إِنْ حِسَابُهُمْ إِلَّا عَلَىٰ رَبِّى ۖ لَوْ تَشْعُرُونَ"
    },
    {
      "index": "114",
      "text": "وَمَآ أَنَا۠ بِطَارِدِ ٱلْمُؤْمِنِينَ"
    },
    {
      "index": "115",
      "text": "إِنْ أَنَا۠ إِلَّا نَذِيرٌ مُّبِينٌ"
    },
    {
      "index": "116",
      "text": "قَالُوا۟ لَئِن لَّمْ تَنتَهِ يَـٰنُوحُ لَتَكُونَنَّ مِنَ ٱلْمَرْجُومِينَ"
    },
    {
      "index": "117",
      "text": "قَالَ رَبِّ إِنَّ قَوْمِى كَذَّبُونِ"
    },
    {
      "index": "118",
      "text": "فَٱفْتَحْ بَيْنِى وَبَيْنَهُمْ فَتْحًا وَنَجِّنِى وَمَن مَّعِىَ مِنَ ٱلْمُؤْمِنِينَ"
    },
    {
      "index": "119",
      "text": "فَأَنجَيْنَـٰهُ وَمَن مَّعَهُۥ فِى ٱلْفُلْكِ ٱلْمَشْحُونِ"
    },
    {
      "index": "120",
      "text": "ثُمَّ أَغْرَقْنَا بَعْدُ ٱلْبَاقِينَ"
    },
    {
      "index": "121",
      "text": "إِنَّ فِى ذَٰلِكَ لَـَٔايَةً ۖ وَمَا كَانَ أَكْثَرُهُم مُّؤْمِنِينَ"
    },
    {
      "index": "122",
      "text": "وَإِنَّ رَبَّكَ لَهُوَ ٱلْعَزِيزُ ٱلرَّحِيمُ"
    },
    {
      "index": "123",
      "text": "كَذَّبَتْ عَادٌ ٱلْمُرْسَلِينَ"
    },
    {
      "index": "124",
      "text": "إِذْ قَالَ لَهُمْ أَخُوهُمْ هُودٌ أَلَا تَتَّقُونَ"
    },
    {
      "index": "125",
      "text": "إِنِّى لَكُمْ رَسُولٌ أَمِينٌ"
    },
    {
      "index": "126",
      "text": "فَٱتَّقُوا۟ ٱللَّهَ وَأَطِيعُونِ"
    },
    {
      "index": "127",
      "text": "وَمَآ أَسْـَٔلُكُمْ عَلَيْهِ مِنْ أَجْرٍ ۖ إِنْ أَجْرِىَ إِلَّا عَلَىٰ رَبِّ ٱلْعَـٰلَمِينَ"
    },
    {
      "index": "128",
      "text": "أَتَبْنُونَ بِكُلِّ رِيعٍ ءَايَةً تَعْبَثُونَ"
    },
    {
      "index": "129",
      "text": "وَتَتَّخِذُونَ مَصَانِعَ لَعَلَّكُمْ تَخْلُدُونَ"
    },
    {
      "index": "130",
      "text": "وَإِذَا بَطَشْتُم بَطَشْتُمْ جَبَّارِينَ"
    },
    {
      "index": "131",
      "text": "فَٱتَّقُوا۟ ٱللَّهَ وَأَطِيعُونِ"
    },
    {
      "index": "132",
      "text": "وَٱتَّقُوا۟ ٱلَّذِىٓ أَمَدَّكُم بِمَا تَعْلَمُونَ"
    },
    {
      "index": "133",
      "text": "أَمَدَّكُم بِأَنْعَـٰمٍ وَبَنِينَ"
    },
    {
      "index": "134",
      "text": "وَجَنَّـٰتٍ وَعُيُونٍ"
    },
    {
      "index": "135",
      "text": "إِنِّىٓ أَخَافُ عَلَيْكُمْ عَذَابَ يَوْمٍ عَظِيمٍ"
    },
    {
      "index": "136",
      "text": "قَالُوا۟ سَوَآءٌ عَلَيْنَآ أَوَعَظْتَ أَمْ لَمْ تَكُن مِّنَ ٱلْوَٰعِظِينَ"
    },
    {
      "index": "137",
      "text": "إِنْ هَـٰذَآ إِلَّا خُلُقُ ٱلْأَوَّلِينَ"
    },
    {
      "index": "138",
      "text": "وَمَا نَحْنُ بِمُعَذَّبِينَ"
    },
    {
      "index": "139",
      "text": "فَكَذَّبُوهُ فَأَهْلَكْنَـٰهُمْ ۗ إِنَّ فِى ذَٰلِكَ لَـَٔايَةً ۖ وَمَا كَانَ أَكْثَرُهُم مُّؤْمِنِينَ"
    },
    {
      "index": "140",
      "text": "وَإِنَّ رَبَّكَ لَهُوَ ٱلْعَزِيزُ ٱلرَّحِيمُ"
    },
    {
      "index": "141",
      "text": "كَذَّبَتْ ثَمُودُ ٱلْمُرْسَلِينَ"
    },
    {
      "index": "142",
      "text": "إِذْ قَالَ لَهُمْ أَخُوهُمْ صَـٰلِحٌ أَلَا تَتَّقُونَ"
    },
    {
      "index": "143",
      "text": "إِنِّى لَكُمْ رَسُولٌ أَمِينٌ"
    },
    {
      "index": "144",
      "text": "فَٱتَّقُوا۟ ٱللَّهَ وَأَطِيعُونِ"
    },
    {
      "index": "145",
      "text": "وَمَآ أَسْـَٔلُكُمْ عَلَيْهِ مِنْ أَجْرٍ ۖ إِنْ أَجْرِىَ إِلَّا عَلَىٰ رَبِّ ٱلْعَـٰلَمِينَ"
    },
    {
      "index": "146",
      "text": "أَتُتْرَكُونَ فِى مَا هَـٰهُنَآ ءَامِنِينَ"
    },
    {
      "index": "147",
      "text": "فِى جَنَّـٰتٍ وَعُيُونٍ"
    },
    {
      "index": "148",
      "text": "وَزُرُوعٍ وَنَخْلٍ طَلْعُهَا هَضِيمٌ"
    },
    {
      "index": "149",
      "text": "وَتَنْحِتُونَ مِنَ ٱلْجِبَالِ بُيُوتًا فَـٰرِهِينَ"
    },
    {
      "index": "150",
      "text": "فَٱتَّقُوا۟ ٱللَّهَ وَأَطِيعُونِ"
    },
    {
      "index": "151",
      "text": "وَلَا تُطِيعُوٓا۟ أَمْرَ ٱلْمُسْرِفِينَ"
    },
    {
      "index": "152",
      "text": "ٱلَّذِينَ يُفْسِدُونَ فِى ٱلْأَرْضِ وَلَا يُصْلِحُونَ"
    },
    {
      "index": "153",
      "text": "قَالُوٓا۟ إِنَّمَآ أَنتَ مِنَ ٱلْمُسَحَّرِينَ"
    },
    {
      "index": "154",
      "text": "مَآ أَنتَ إِلَّا بَشَرٌ مِّثْلُنَا فَأْتِ بِـَٔايَةٍ إِن كُنتَ مِنَ ٱلصَّـٰدِقِينَ"
    },
    {
      "index": "155",
      "text": "قَالَ هَـٰذِهِۦ نَاقَةٌ لَّهَا شِرْبٌ وَلَكُمْ شِرْبُ يَوْمٍ مَّعْلُومٍ"
    },
    {
      "index": "156",
      "text": "وَلَا تَمَسُّوهَا بِسُوٓءٍ فَيَأْخُذَكُمْ عَذَابُ يَوْمٍ عَظِيمٍ"
    },
    {
      "index": "157",
      "text": "فَعَقَرُوهَا فَأَصْبَحُوا۟ نَـٰدِمِينَ"
    },
    {
      "index": "158",
      "text": "فَأَخَذَهُمُ ٱلْعَذَابُ ۗ إِنَّ فِى ذَٰلِكَ لَـَٔايَةً ۖ وَمَا كَانَ أَكْثَرُهُم مُّؤْمِنِينَ"
    },
    {
      "index": "159",
      "text": "وَإِنَّ رَبَّكَ لَهُوَ ٱلْعَزِيزُ ٱلرَّحِيمُ"
    },
    {
      "index": "160",
      "text": "كَذَّبَتْ قَوْمُ لُوطٍ ٱلْمُرْسَلِينَ"
    },
    {
      "index": "161",
      "text": "إِذْ قَالَ لَهُمْ أَخُوهُمْ لُوطٌ أَلَا تَتَّقُونَ"
    },
    {
      "index": "162",
      "text": "إِنِّى لَكُمْ رَسُولٌ أَمِينٌ"
    },
    {
      "index": "163",
      "text": "فَٱتَّقُوا۟ ٱللَّهَ وَأَطِيعُونِ"
    },
    {
      "index": "164",
      "text": "وَمَآ أَسْـَٔلُكُمْ عَلَيْهِ مِنْ أَجْرٍ ۖ إِنْ أَجْرِىَ إِلَّا عَلَىٰ رَبِّ ٱلْعَـٰلَمِينَ"
    },
    {
      "index": "165",
      "text": "أَتَأْتُونَ ٱلذُّكْرَانَ مِنَ ٱلْعَـٰلَمِينَ"
    },
    {
      "index": "166",
      "text": "وَتَذَرُونَ مَا خَلَقَ لَكُمْ رَبُّكُم مِّنْ أَزْوَٰجِكُم ۚ بَلْ أَنتُمْ قَوْمٌ عَادُونَ"
    },
    {
      "index": "167",
      "text": "قَالُوا۟ لَئِن لَّمْ تَنتَهِ يَـٰلُوطُ لَتَكُونَنَّ مِنَ ٱلْمُخْرَجِينَ"
    },
    {
      "index": "168",
      "text": "قَالَ إِنِّى لِعَمَلِكُم مِّنَ ٱلْقَالِينَ"
    },
    {
      "index": "169",
      "text": "رَبِّ نَجِّنِى وَأَهْلِى مِمَّا يَعْمَلُونَ"
    },
    {
      "index": "170",
      "text": "فَنَجَّيْنَـٰهُ وَأَهْلَهُۥٓ أَجْمَعِينَ"
    },
    {
      "index": "171",
      "text": "إِلَّا عَجُوزًا فِى ٱلْغَـٰبِرِينَ"
    },
    {
      "index": "172",
      "text": "ثُمَّ دَمَّرْنَا ٱلْـَٔاخَرِينَ"
    },
    {
      "index": "173",
      "text": "وَأَمْطَرْنَا عَلَيْهِم مَّطَرًا ۖ فَسَآءَ مَطَرُ ٱلْمُنذَرِينَ"
    },
    {
      "index": "174",
      "text": "إِنَّ فِى ذَٰلِكَ لَـَٔايَةً ۖ وَمَا كَانَ أَكْثَرُهُم مُّؤْمِنِينَ"
    },
    {
      "index": "175",
      "text": "وَإِنَّ رَبَّكَ لَهُوَ ٱلْعَزِيزُ ٱلرَّحِيمُ"
    },
    {
      "index": "176",
      "text": "كَذَّبَ أَصْحَـٰبُ لْـَٔيْكَةِ ٱلْمُرْسَلِينَ"
    },
    {
      "index": "177",
      "text": "إِذْ قَالَ لَهُمْ شُعَيْبٌ أَلَا تَتَّقُونَ"
    },
    {
      "index": "178",
      "text": "إِنِّى لَكُمْ رَسُولٌ أَمِينٌ"
    },
    {
      "index": "179",
      "text": "فَٱتَّقُوا۟ ٱللَّهَ وَأَطِيعُونِ"
    },
    {
      "index": "180",
      "text": "وَمَآ أَسْـَٔلُكُمْ عَلَيْهِ مِنْ أَجْرٍ ۖ إِنْ أَجْرِىَ إِلَّا عَلَىٰ رَبِّ ٱلْعَـٰلَمِينَ"
    },
    {
      "index": "181",
      "text": "۞ أَوْفُوا۟ ٱلْكَيْلَ وَلَا تَكُونُوا۟ مِنَ ٱلْمُخْسِرِينَ"
    },
    {
      "index": "182",
      "text": "وَزِنُوا۟ بِٱلْقِسْطَاسِ ٱلْمُسْتَقِيمِ"
    },
    {
      "index": "183",
      "text": "وَلَا تَبْخَسُوا۟ ٱلنَّاسَ أَشْيَآءَهُمْ وَلَا تَعْثَوْا۟ فِى ٱلْأَرْضِ مُفْسِدِينَ"
    },
    {
      "index": "184",
      "text": "وَٱتَّقُوا۟ ٱلَّذِى خَلَقَكُمْ وَٱلْجِبِلَّةَ ٱلْأَوَّلِينَ"
    },
    {
      "index": "185",
      "text": "قَالُوٓا۟ إِنَّمَآ أَنتَ مِنَ ٱلْمُسَحَّرِينَ"
    },
    {
      "index": "186",
      "text": "وَمَآ أَنتَ إِلَّا بَشَرٌ مِّثْلُنَا وَإِن نَّظُنُّكَ لَمِنَ ٱلْكَـٰذِبِينَ"
    },
    {
      "index": "187",
      "text": "فَأَسْقِطْ عَلَيْنَا كِسَفًا مِّنَ ٱلسَّمَآءِ إِن كُنتَ مِنَ ٱلصَّـٰدِقِينَ"
    },
    {
      "index": "188",
      "text": "قَالَ رَبِّىٓ أَعْلَمُ بِمَا تَعْمَلُونَ"
    },
    {
      "index": "189",
      "text": "فَكَذَّبُوهُ فَأَخَذَهُمْ عَذَابُ يَوْمِ ٱلظُّلَّةِ ۚ إِنَّهُۥ كَانَ عَذَابَ يَوْمٍ عَظِيمٍ"
    },
    {
      "index": "190",
      "text": "إِنَّ فِى ذَٰلِكَ لَـَٔايَةً ۖ وَمَا كَانَ أَكْثَرُهُم مُّؤْمِنِينَ"
    },
    {
      "index": "191",
      "text": "وَإِنَّ رَبَّكَ لَهُوَ ٱلْعَزِيزُ ٱلرَّحِيمُ"
    },
    {
      "index": "192",
      "text": "وَإِنَّهُۥ لَتَنزِيلُ رَبِّ ٱلْعَـٰلَمِينَ"
    },
    {
      "index": "193",
      "text": "نَزَلَ بِهِ ٱلرُّوحُ ٱلْأَمِينُ"
    },
    {
      "index": "194",
      "text": "عَلَىٰ قَلْبِكَ لِتَكُونَ مِنَ ٱلْمُنذِرِينَ"
    },
    {
      "index": "195",
      "text": "بِلِسَانٍ عَرَبِىٍّ مُّبِينٍ"
    },
    {
      "index": "196",
      "text": "وَإِنَّهُۥ لَفِى زُبُرِ ٱلْأَوَّلِينَ"
    },
    {
      "index": "197",
      "text": "أَوَلَمْ يَكُن لَّهُمْ ءَايَةً أَن يَعْلَمَهُۥ عُلَمَـٰٓؤُا۟ بَنِىٓ إِسْرَٰٓءِيلَ"
    },
    {
      "index": "198",
      "text": "وَلَوْ نَزَّلْنَـٰهُ عَلَىٰ بَعْضِ ٱلْأَعْجَمِينَ"
    },
    {
      "index": "199",
      "text": "فَقَرَأَهُۥ عَلَيْهِم مَّا كَانُوا۟ بِهِۦ مُؤْمِنِينَ"
    },
    {
      "index": "200",
      "text": "كَذَٰلِكَ سَلَكْنَـٰهُ فِى قُلُوبِ ٱلْمُجْرِمِينَ"
    },
    {
      "index": "201",
      "text": "لَا يُؤْمِنُونَ بِهِۦ حَتَّىٰ يَرَوُا۟ ٱلْعَذَابَ ٱلْأَلِيمَ"
    },
    {
      "index": "202",
      "text": "فَيَأْتِيَهُم بَغْتَةً وَهُمْ لَا يَشْعُرُونَ"
    },
    {
      "index": "203",
      "text": "فَيَقُولُوا۟ هَلْ نَحْنُ مُنظَرُونَ"
    },
    {
      "index": "204",
      "text": "أَفَبِعَذَابِنَا يَسْتَعْجِلُونَ"
    },
    {
      "index": "205",
      "text": "أَفَرَءَيْتَ إِن مَّتَّعْنَـٰهُمْ سِنِينَ"
    },
    {
      "index": "206",
      "text": "ثُمَّ جَآءَهُم مَّا كَانُوا۟ يُوعَدُونَ"
    },
    {
      "index": "207",
      "text": "مَآ أَغْنَىٰ عَنْهُم مَّا كَانُوا۟ يُمَتَّعُونَ"
    },
    {
      "index": "208",
      "text": "وَمَآ أَهْلَكْنَا مِن قَرْيَةٍ إِلَّا لَهَا مُنذِرُونَ"
    },
    {
      "index": "209",
      "text": "ذِكْرَىٰ وَمَا كُنَّا ظَـٰلِمِينَ"
    },
    {
      "index": "210",
      "text": "وَمَا تَنَزَّلَتْ بِهِ ٱلشَّيَـٰطِينُ"
    },
    {
      "index": "211",
      "text": "وَمَا يَنۢبَغِى لَهُمْ وَمَا يَسْتَطِيعُونَ"
    },
    {
      "index": "212",
      "text": "إِنَّهُمْ عَنِ ٱلسَّمْعِ لَمَعْزُولُونَ"
    },
    {
      "index": "213",
      "text": "فَلَا تَدْعُ مَعَ ٱللَّهِ إِلَـٰهًا ءَاخَرَ فَتَكُونَ مِنَ ٱلْمُعَذَّبِينَ"
    },
    {
      "index": "214",
      "text": "وَأَنذِرْ عَشِيرَتَكَ ٱلْأَقْرَبِينَ"
    },
    {
      "index": "215",
      "text": "وَٱخْفِضْ جَنَاحَكَ لِمَنِ ٱتَّبَعَكَ مِنَ ٱلْمُؤْمِنِينَ"
    },
    {
      "index": "216",
      "text": "فَإِنْ عَصَوْكَ فَقُلْ إِنِّى بَرِىٓءٌ مِّمَّا تَعْمَلُونَ"
    },
    {
      "index": "217",
      "text": "وَتَوَكَّلْ عَلَى ٱلْعَزِيزِ ٱلرَّحِيمِ"
    },
    {
      "index": "218",
      "text": "ٱلَّذِى يَرَىٰكَ حِينَ تَقُومُ"
    },
    {
      "index": "219",
      "text": "وَتَقَلُّبَكَ فِى ٱلسَّـٰجِدِينَ"
    },
    {
      "index": "220",
      "text": "إِنَّهُۥ هُوَ ٱلسَّمِيعُ ٱلْعَلِيمُ"
    },
    {
      "index": "221",
      "text": "هَلْ أُنَبِّئُكُمْ عَلَىٰ مَن تَنَزَّلُ ٱلشَّيَـٰطِينُ"
    },
    {
      "index": "222",
      "text": "تَنَزَّلُ عَلَىٰ كُلِّ أَفَّاكٍ أَثِيمٍ"
    },
    {
      "index": "223",
      "text": "يُلْقُونَ ٱلسَّمْعَ وَأَكْثَرُهُمْ كَـٰذِبُونَ"
    },
    {
      "index": "224",
      "text": "وَٱلشُّعَرَآءُ يَتَّبِعُهُمُ ٱلْغَاوُۥنَ"
    },
    {
      "index": "225",
      "text": "أَلَمْ تَرَ أَنَّهُمْ فِى كُلِّ وَادٍ يَهِيمُونَ"
    },
    {
      "index": "226",
      "text": "وَأَنَّهُمْ يَقُولُونَ مَا لَا يَفْعَلُونَ"
    },
    {
      "index": "227",
      "text": "إِلَّا ٱلَّذِينَ ءَامَنُوا۟ وَعَمِلُوا۟ ٱلصَّـٰلِحَـٰتِ وَذَكَرُوا۟ ٱللَّهَ كَثِيرًا وَٱنتَصَرُوا۟ مِنۢ بَعْدِ مَا ظُلِمُوا۟ ۗ وَسَيَعْلَمُ ٱلَّذِينَ ظَلَمُوٓا۟ أَىَّ مُنقَلَبٍ يَنقَلِبُونَ"
    }
  ],
  "index": "26",
  "name": "الشعراء",
  "copyright": "# PLEASE DO NOT REMOVE OR CHANGE THIS COPYRIGHT BLOCK \n#==================================================================== \n#\n#  Tanzil Quran Text (Uthmani, Version 1.1)\n#  Copyright (C) 2007-2022 Tanzil Project\n#  License: Creative Commons Attribution 3.0\n#\n#  This copy of the Quran text is carefully produced, highly \n#  verified and continuously monitored by a group of specialists \n#  at Tanzil Project.\n#\n#  TERMS OF USE:\n#\n#  - Permission is granted to copy and distribute verbatim copies \n#    of this text, but CHANGING IT IS NOT ALLOWED.\n#\n#  - This Quran text can be used in any website or application, \n#    provided that its source (Tanzil Project) is clearly indicated, \n#    and a link is made to tanzil.net to enable users to keep\n#    track of changes.\n#\n#  - This copyright notice shall be included in all verbatim copies \n#    of the text, and shall be reproduced appropriately in all files \n#    derived from or containing substantial portion of this text.\n#\n#  Please check updates at: http://tanzil.net/updates/\n#\n#====================================================================\n",
  "type": "uthmani",
  "version": "1.1"
}