{
  "aya": [
    {
      "index": "1",
      "text": "إِذَا السَّماءُ انشَقَّت",
      "bismillah": "بِسمِ اللَّهِ الرَّحمـٰنِ الرَّحيمِ"
    },
    {
      "index": "2",
      "text": "وَأَذِنَت لِرَبِّها وَحُقَّت"
    },
    {
      "index": "3",
      "text": "وَإِذَا الأَرضُ مُدَّت"
    },
    {
      "index": "4",
      "text": "وَأَلقَت ما فيها وَتَخَلَّت"
    },
    {
      "index": "5",
      "text": "وَأَذِنَت لِرَبِّها وَحُقَّت"
    },
    {
      "index": "6",
      "text": "يا أَيُّهَا الإِنسانُ إِنَّكَ كادِحٌ إِلىٰ رَبِّكَ كَدحًا فَمُلاقيهِ"
    },
    {
      "index": "7",
      "text": "فَأَمّا مَن أوتِيَ كِتابَهُ بِيَمينِهِ"
    },
    {
      "index": "8",
      "text": "فَسَوفَ يُحاسَبُ حِسابًا يَسيرًا"
    },
    {
      "index": "9",
      "text": "وَيَنقَلِبُ إِلىٰ أَهلِهِ مَسرورًا"
    },
    {
      "index": "10",
      "text": "وَأَمّا مَن أوتِيَ كِتابَهُ وَراءَ ظَهرِهِ"
    },
    {
      "index": "11",
      "text": "فَسَوفَ يَدعو ثُبورًا"
    },
    {
      "index": "12",
      "text": "وَيَصلىٰ سَعيرًا"
    },
    {
      "index": "13",
      "text": "إِنَّهُ كانَ في أَهلِهِ مَسرورًا"
    },
    {
      "index": "14",
      "text": "إِنَّهُ ظَنَّ أَن لَن يَحورَ"
    },
    {
      "index": "15",
      "text": "بَلىٰ إِنَّ رَبَّهُ كانَ بِهِ بَصيرًا"
    },
    {
      "index": "16",
      "text": "فَلا أُقسِمُ بِالشَّفَقِ"
    },
    {
      "index": "17",
      "text": "وَاللَّيلِ وَما وَسَقَ"
    },
    {
      "index": "18",
      "text": "وَالقَمَرِ إِذَا اتَّسَقَ"
    },
    {
      "index": "19",
      "text": "لَتَركَبُنَّ طَبَقًا عَن طَبَقٍ"
    },
    {
      "index": "20",
      "text": "فَما لَهُم لا يُؤمِنونَ"
    },
    {
      "index": "21",
      "text": "وَإِذا قُرِئَ عَلَيهِمُ القُرآنُ لا يَسجُدونَ ۩"
    },
    {
      "index": "22",
      "text": "بَلِ الَّذينَ كَفَروا يُكَذِّبونَ"
    },
    {
      "index": "23",
      "text": "وَاللَّهُ أَعلَمُ بِما يوعونَ"
    },
    {
      "index": "24",
      "text": "فَبَشِّرهُم بِعَذابٍ أَليمٍ"
    },
    {
      "index": "25",
      "text": "إِلَّا الَّذينَ آمَنوا وَعَمِلُوا الصّالِحاتِ لَهُم أَجرٌ غَيرُ مَمنونٍ"
    }
  ],
  "index": "84",
  "name": "الإنشقاق",
  "copyright": "# PLEASE DO NOT REMOVE OR CHANGE THIS COPYRIGHT BLOCK \n#==================================================================== \n#\n#  Tanzil Quran Text (Simple Minimal, Version 1.1)\n#  Copyright (C) 2007-2022 Tanzil Project\n#  License: Creative Commons Attribution 3.0\n#\n#  This copy of the Quran text is carefully produced, highly \n#  verified and continuously monitored by a group of specialists \n#  at Tanzil Project.\n#\n#  TERMS OF USE:\n#\n#  - Permission is granted to copy and distribute verbatim copies \n#    of this text, but CHANGING IT IS NOT ALLOWED.\n#\n#  - This Quran text can be used in any website or application, \n#    provided that its source (Tanzil Project) is clearly indicated, \n#    and a link is made to tanzil.net to enable users to keep\n#    track of changes.\n#\n#  - This copyright notice shall be included in all verbatim copies \n#    of the text, and shall be reproduced appropriately in all files \n#    derived from or containing substantial portion of this text.\n#\n#  Please check updates at: http://tanzil.net/updates/\n#\n#====================================================================\n",
  "type": "simple-min",
  "version": "1.1"
}