{
  "aya": [
    {
      "index": "1",
      "text": "يسبح لله ما في السماوات وما في الأرض ۖ له الملك وله الحمد ۖ وهو على كل شيء قدير",
      "bismillah": "بسم الله الرحمن الرحيم"
    },
    {
      "index": "2",
      "text": "هو الذي خلقكم فمنكم كافر ومنكم مؤمن ۚ والله بما تعملون بصير"
    },
    {
      "index": "3",
      "text": "خلق السماوات والأرض بالحق وصوركم فأحسن صوركم ۖ وإليه المصير"
    },
    {
      "index": "4",
      "text": "يعلم ما في السماوات والأرض ويعلم ما تسرون وما تعلنون ۚ والله عليم بذات الصدور"
    },
    {
      "index": "5",
      "text": "ألم يأتكم نبأ الذين كفروا من قبل فذاقوا وبال أمرهم ولهم عذاب أليم"
    },
    {
      "index": "6",
      "text": "ذلك بأنه كانت تأتيهم رسلهم بالبينات فقالوا أبشر يهدوننا فكفروا وتولوا ۚ واستغنى الله ۚ والله غني حميد"
    },
    {
      "index": "7",
      "text": "زعم الذين كفروا أن لن يبعثوا ۚ قل بلى وربي لتبعثن ثم لتنبؤن بما عملتم ۚ وذلك على الله يسير"
    },
    {
      "index": "8",
      "text": "فآمنوا بالله ورسوله والنور الذي أنزلنا ۚ والله بما تعملون خبير"
    },
    {
      "index": "9",
      "text": "يوم يجمعكم ليوم الجمع ۖ ذلك يوم التغابن ۗ ومن يؤمن بالله ويعمل صالحا يكفر عنه سيئاته ويدخله جنات تجري من تحتها الأنهار خالدين فيها أبدا ۚ ذلك الفوز العظيم"
    },
    {
      "index": "10",
      "text": "والذين كفروا وكذبوا بآياتنا أولئك أصحاب النار خالدين فيها ۖ وبئس المصير"
    },
    {
      "index": "11",
      "text": "ما أصاب من مصيبة إلا بإذن الله ۗ ومن يؤمن بالله يهد قلبه ۚ والله بكل شيء عليم"
    },
    {
      "index": "12",
      "text": "وأطيعوا الله وأطيعوا الرسول ۚ فإن توليتم فإنما على رسولنا البلاغ المبين"
    },
    {
      "index": "13",
      "text": "الله لا إله إلا هو ۚ وعلى الله فليتوكل المؤمنون"
    },
    {
      "index": "14",
      "text": "يا أيها الذين آمنوا إن من أزواجكم وأولادكم عدوا لكم فاحذروهم ۚ وإن تعفوا وتصفحوا وتغفروا فإن الله غفور رحيم"
    },
    {
      "index": "15",
      "text": "إنما أموالكم وأولادكم فتنة ۚ والله عنده أجر عظيم"
    },
    {
      "index": "16",
      "text": "فاتقوا الله ما استطعتم واسمعوا وأطيعوا وأنفقوا خيرا لأنفسكم ۗ ومن يوق شح نفسه فأولئك هم المفلحون"
    },
    {
      "index": "17",
      "text": "إن تقرضوا الله قرضا حسنا يضاعفه لكم ويغفر لكم ۚ والله شكور حليم"
    },
    {
      "index": "18",
      "text": "عالم الغيب والشهادة العزيز الحكيم"
    }
  ],
  "index": "64",
  "name": "التغابن",
  "copyright": "# PLEASE DO NOT REMOVE OR CHANGE THIS COPYRIGHT BLOCK \n#==================================================================== \n#\n#  Tanzil Quran Text (Simple Clean, Version 1.1)\n#  Copyright (C) 2007-2022 Tanzil Project\n#  License: Creative Commons Attribution 3.0\n#\n#  This copy of the Quran text is carefully produced, highly \n#  verified and continuously monitored by a group of specialists \n#  at Tanzil Project.\n#\n#  TERMS OF USE:\n#\n#  - Permission is granted to copy and distribute verbatim copies \n#    of this text, but CHANGING IT IS NOT ALLOWED.\n#\n#  - This Quran text can be used in any website or application, \n#    provided that its source (Tanzil Project) is clearly indicated, \n#    and a link is made to tanzil.net to enable users to keep\n#    track of changes.\n#\n#  - This copyright notice shall be included in all verbatim copies \n#    of the text, and shall be reproduced appropriately in all files \n#    derived from or containing substantial portion of this text.\n#\n#  Please check updates at: http://tanzil.net/updates/\n#\n#====================================================================\n",
  "type": "simple-clean",
  "version": "1.1"
}