{
    "OFP":
    [
        {
            "title":"Принять упор лжа и начать отжиматься от пола. ",
            "injures":
            [
                "Боль в руках",
                "Боль в спине"
            ],
            "ratio":3,
            "base_count":10
        },{
            "title":"Подтягивания",
            "injures":
            [
                "Боль в спине",
                "Боль в руках"
            ],
            "ratio":2,
            "base_count":5
        },{
            "title":"Приседания",
            "injures":
            [
                "Боль в ногах",
                "Головокружение"
            ],
            "ratio":20,
            "base_count":30
        },{
            "title":"Скручивания из положения лежа",
            "injures":
            [
                "Боль в спине",
                "Боль в животе"
            ],
            "ratio":10,
            "base_count":20
        },{
            "title":"Скручивания с виса",
            "injures":
            [
                "Боль в животе",
                "Боль в руках"
            ],
            "ratio":5,
            "base_count":15
        },{
            "title":"Планка",
            "injures":
            [
                "Боль в животе",
                "Боль в руках"
            ],
            "ratio":30,
            "base_count":50
        },{
            "title":"Обратные отжимания",
            "injures":
            [
                "Боль в руках"
            ],
            "ratio":10,
            "base_count":20
        },{
            "title":"Чередование ходьба/бег вокруг дома",
            "injures":
            [
                "Боль в ногах",
                "Боль в спине"
            ],
            "ratio":15,
            "base_count":10
        },{
            "title":"Лягте на спину, согните ноги в коленях и разведите ноги в стороны, держите стопы вместе, а руки за головой. Не сгибая спину, немного приподнимите корпус и задержитесь в таком положении на пару секунд. Опуститесь в исходное положение.",
            "injures":
            [
                "Боль в животе",
                "Боль в спине"
            ],
            "ratio":10,
            "base_count":5
        },{
            "title":"Ляг на спину, согни ноги в коленях, руки вдоль пола. Немного приподними корпус тела и тянись вперед то левой рукой, то правой. Голова и шея должны оставаться на одной линии, нижняя часть спины — прижатой к полу. Повтори по 15 раз на каждую сторону.",
            "injures":
            [
                "Боль в спине"
            ],
            "ratio":15,
            "base_count":5
        },{
            "title":"Ляг на спину, подними ноги и тянись руками к носочкам. При этом спину и ноги не сгибай",
            "injures":
            [
                "Боль в животе",
                "Боль в спине"
            ],
            "ratio":20,
            "base_count":5
        },{
            "title":"Лежа на спине на полу поднять правую ногу вверх, не сгибая в колене. Выполнять маховые движения вправо-влево до касания стопой пола. Сменить ногу. Это и будет составлять один подход.",
            "injures":
            [
                "Боль в ногах"
            ],
            "ratio":10,
            "base_count":7
        },{
            "title":"Попеременное движение ног вперед-назад. Одна нога выставлена вперед и сильно согнута, другая отставлена назад и выпрямлена. Руки в упоре в пол перед собой. В этом положении менять ноги, стараясь не подпрыгивать. Движения должны быть стелющимися вдоль пола",
            "injures":
            [
                "Боль в ногах"
            ],
            "ratio":15,
            "base_count":3
        },{
            "title":"Лежа на спине, принять вертикальное положение тела ногами вверх. О пол опираться локтями, лопатками и головой. Руками взяться за пояс. Одна нога выпрямлена вверх, другая согнута. Резким движением выбросить согнутую ногу вверх, одновременно сгибая вторую. Пальцы выпрямленной ноги тянуть на себя",
            "injures":
            [
                "Боль в ногах"
            ],
            "ratio":10,
            "base_count":3
        },{
            "title":"Стоя на одной ноге, выпрямляем другую вперед. Затем приседаем на опорной ноге. Затем меняем ногу.",
            "injures":
            [
                "Боль в ногах"
            ],
            "ratio":10,
            "base_count":10
        },{
            "title":"Ноги на ширине плеч. Руки перед собой. Приседать и следить за тем, чтобы спина была ровной, а ступни не отрывались от пола. ",
            "injures":
            [
                "Боль в животе"
            ],
            "ratio":25,
            "base_count":15
        },{
            "title":"Отжимания боком. ",
            "injures":
            [
                "Боль в руках",
                "Боль в спине"
            ],
            "ratio":3,
            "base_count":10
        },{
            "title":"Поднятие таза и одной ноги. ",
            "injures":
            [
                "Боль в руках",
                "Боль в спине"
            ],
            "ratio":3,
            "base_count":10
        }
    ],
    "FLEX":
    [
        {
            "title":"Растяжка, сидя на полу, ноги в разные стороны",
            "injures":
            [
                "Боль в ногах",
                "Боль в спине"
            ],
            "ratio":25,
            "base_count":50
        },{
            "title":"Растяжка, сидя на полу, одна ногда подвернута под себя",
            "injures":
            [
                "Боль в спине"
            ],
            "ratio":20,
            "base_count":40
        },{
            "title":"Растяжка, положение стоя на полу, ноги как можно шире",
            "injures":
            [
                "Боль в ногах"
            ],
            "ratio":20,
            "base_count":60
        },{
            "title":"Растяжка, положение стоя на полу, одна нога согнута в колене, другая отведена назад",
            "injures":
            [
                "Боль в ногах"
            ],
            "ratio":20,
            "base_count":60
        },{
            "title":"Глубокие наклоны вперед",
            "injures":
            [
                "Боль в спине"
            ],
            "ratio":8,
            "base_count":19
        },{
            "title":"Наклон с задержкой к одной ноге",
            "injures":
            [
                "Боль в ногах"
            ],
            "ratio":10,
            "base_count":35
        },{
            "title":"Сведение рук в замок за спиной",
            "injures":
            [
                "Боль в руках"
            ],
            "ratio":10,
            "base_count":35
        },{
            "title":"Поднять руки вверх через стороны, приподняться на носках и потянуться — вдох. Вернуться в исходное положение — выдох.",
            "injures":
            [
                "Боль в руках"
            ],
            "ratio":10,
            "base_count":15
        },{
            "title":"Сидя на стуле, расслабленные руки вдоль тела, спина прямая. Медленно наклонять голову взад-вперед. Руки к плечам. Повернуть голову направо, локти отвести в стороны, вернуться в и.п. То же самое с поворотом головы налево. Руки за голову, пальцы сцеплены. Руки вверх, ладони соединить, потянуться, посмотреть на кисти рук, вернуться в и.п.",
            "injures":
            [
                "Боль в руках"
            ],
            "ratio":5,
            "base_count":10
        },{
            "title":"Исходное положение: стоя, расставить ноги на ширину плеч. В течение 2-3 секунд смотреть прямо перед собой. Далее поднять прямую правую руку перед собой, показать большой палец и сфокусировать на нем взгляд на 3-5 секунд. Опустить руку.",
            "injures":
            [
                "Боль в руках"
            ],
            "ratio":20,
            "base_count":5
        },{
            "title":"Встать прямо, ноги на ширине плеч, руки вдоль туловища. Поставить правую руку на пояс и начать приседать, завоя левую руку за голову. Вернуться в исходное положение и проделать то же самое, сменив руки.",
            "injures":
            [
                "Боль в ногах"
            ],
            "ratio":20,
            "base_count":12
        },{
            "title":"Встать прямо, ноги вместе, руки на поясе. В течении 1 мин выполнять подскоки на месте: сначала ноги вместе - ноги врозь, а затем - одна нога вперед, другая - назад. В течение 1-2 мин походить на месте или по комнате быстрым шагом",
            "injures":
            [
                "Боль в ногах"
            ],
            "ratio":30,
            "base_count":5
        },{
            "title":"Встать прямо, ноги на ширине плеч, руки на поясе. Широко развести руки в стороны и слегка повернуться всем корпусом вправо - вдхо. Вернуться в исходное положение - выдох.",
            "injures":
            [
                "Головокружение",
                "Боль в спине"
            ],
            "ratio":15,
            "base_count":10
        },{
            "title":"Чередование ходьба/бег вокруг дома",
            "injures":
            [
                "Боль в ногах",
                "Боль в спине"
            ],
            "ratio":15,
            "base_count":10
        },{
            "title":"Встать прямо, ноги вместе, руки за голову. Наклониться вправо, одновременно сделав выпад правой ногой также вправо и вытянуть руки вверх. Вернуться в исходное положение и проделать все то же самое в левую сторону",
            "injures":
            [
                "Боль в ногах",
                "Боль в руках"
            ],
            "ratio":20,
            "base_count":5
        },{
            "title":"Встать спиной к стенке, касаясь ее затылком, лопатками, тазом и пятками. Сохранить это положение в течение 5 с. Запомнить его и, стараясь не нарушать, сделать шаг вперед, затем назад",
            "injures":
            [
                "Боль в спине"
            ],
            "ratio":20,
            "base_count":5
        },{
            "title":"Стоя у стены, подтянуть руками к животу ногу, согнуть в коление, не теряя касания со стеной.",
            "injures":
            [
                "Боль в ногах"
            ],
            "ratio":20,
            "base_count":5
        },{
            "title":"Стоя лицом к стене, поднять руки вверх, отводить руки назад - вверх",
            "injures":
            [
                "Боль в руках"
            ],
            "ratio":15,
            "base_count":3
        },{
            "title":"Руки вытянуть вперед. Прогнуться, отрывая от пола руки и ноги. Держаться так 3-5 сек.",
            "injures":
            [
                "Боль в руках"
            ],
            "ratio":5,
            "base_count":13
        }
    ]

}
