<?xml version="1.0" encoding="utf-8"?>
<!-- Generator: Adobe Illustrator 16.0.0, SVG Export Plug-In . SVG Version: 6.00 Build 0)  -->
<!DOCTYPE svg PUBLIC "-//W3C//DTD SVG 1.1//EN" "http://www.w3.org/Graphics/SVG/1.1/DTD/svg11.dtd">
<svg version="1.1" id="Capa_1" xmlns="http://www.w3.org/2000/svg" xmlns:xlink="http://www.w3.org/1999/xlink" x="0px" y="0px"
	 width="200px" height="200px" viewBox="0 0 200 200" enable-background="new 0 0 200 200" xml:space="preserve">
<g>
	<path fill="none" d="M156.744,42.289l0.076,0.107c0.018-0.137,0.053-0.266,0.107-0.395C156.867,42.1,156.822,42.209,156.744,42.289
		z"/>
	<path fill="none" d="M47.832,46.984l0.225-0.316c-0.107,0.068-0.219,0.119-0.342,0.158C47.762,46.871,47.789,46.934,47.832,46.984z
		"/>
	<path fill="#EA5598" d="M64.115,156.459c0,0-0.66,3.662-1.541,9.672c11.875,4.418,24.717,6.854,38.135,6.854
		c0.441,0,0.879-0.027,1.32-0.035c-0.168-0.746-0.236-1.527-0.135-2.33c0.43-3.389,3.279-5.852,6.588-5.926
		c-0.014-0.004-0.025-0.012-0.041-0.016c0.352-0.012,0.705-0.002,1.061,0.043c3.607,0.457,6.164,3.664,5.902,7.246
		c11.914-1.6,23.219-5.102,33.598-10.215c0.701-5.135-0.68-10.844-0.68-10.844c0.861,1.867,3.277,4.736,6.287,7.893
		c7.695-4.361,14.799-9.643,21.191-15.668c-6.404-10.436-15.668-17.41-20.998-20.824c-0.066,0.092-0.117,0.195-0.184,0.289
		c-0.689,0.969-1.361,1.945-2.17,2.812c-1.498,1.852-3.219,3.49-4.977,5.076l-2.779,2.225l-2.961,1.969
		c-0.963,0.697-2.061,1.164-3.084,1.756c-1.033,0.594-2.092,1.115-3.191,1.559c-2.141,1.02-4.379,1.773-6.625,2.502
		c-3.838,4.289-11.193,7.598-19.896,8.385c-10.109,0.916-19.053-1.834-23.018-6.502c-1.957-0.402-3.889-0.93-5.795-1.518
		c-2.209-0.797-4.445-1.521-6.533-2.602c-1.861-0.818-3.592-1.85-5.324-2.883c-0.209-0.123-0.422-0.244-0.627-0.371
		c-0.062-0.037-0.125-0.072-0.188-0.109c0.012,0.004,0.023,0.008,0.037,0.01c-2.016-1.242-3.891-2.615-5.643-4.092
		c-11.57,4.83-21.047,12.641-27.781,19.512c6.691,5.143,13.982,9.539,21.766,13.043C59.191,161.35,62.174,159.039,64.115,156.459z"
		/>
	<path fill="#EA5598" d="M149.002,161.752c1.898-0.936,3.773-1.91,5.607-2.951c-3.01-3.156-5.426-6.025-6.287-7.893
		C148.322,150.908,149.703,156.617,149.002,161.752z"/>
	<path opacity="0.5" fill="#E61B72" d="M149.002,161.752c1.898-0.936,3.773-1.91,5.607-2.951c-3.01-3.156-5.426-6.025-6.287-7.893
		C148.322,150.908,149.703,156.617,149.002,161.752z"/>
	<path fill="#EA5598" d="M55.83,163.369c2.209,0.996,4.461,1.912,6.744,2.762c0.881-6.01,1.541-9.672,1.541-9.672
		C62.174,159.039,59.191,161.35,55.83,163.369z"/>
	<path opacity="0.5" fill="#E61B72" d="M55.83,163.369c2.209,0.996,4.461,1.912,6.744,2.762c0.881-6.01,1.541-9.672,1.541-9.672
		C62.174,159.039,59.191,161.35,55.83,163.369z"/>
	<path fill="#EA5598" d="M175.801,143.133c0.449-0.426,0.904-0.842,1.348-1.273c-4.771-7.844-11.533-16.195-20.818-21.939
		c-0.465,0.826-0.973,1.621-1.527,2.389C160.133,125.723,169.396,132.697,175.801,143.133z"/>
	<path opacity="0.5" fill="#E61B72" d="M175.801,143.133c0.449-0.426,0.904-0.842,1.348-1.273
		c-4.771-7.844-11.533-16.195-20.818-21.939c-0.465,0.826-0.973,1.621-1.527,2.389C160.133,125.723,169.396,132.697,175.801,143.133
		z"/>
	<path fill="#EA5598" d="M61.846,130.814c-0.406-0.346-0.807-0.695-1.201-1.051c-4.496,1.227-18.238,5.764-30.158,17.684
		c1.174,0.982,2.363,1.945,3.578,2.879C40.799,143.455,50.275,135.645,61.846,130.814z"/>
	<path opacity="0.5" fill="#E61B72" d="M61.846,130.814c-0.406-0.346-0.807-0.695-1.201-1.051
		c-4.496,1.227-18.238,5.764-30.158,17.684c1.174,0.982,2.363,1.945,3.578,2.879C40.799,143.455,50.275,135.645,61.846,130.814z"/>
	<path fill="#CEDFF2" d="M113.305,172.061c0.426-3.354-1.676-6.438-4.822-7.367c-3.309,0.074-6.158,2.537-6.588,5.926
		c-0.102,0.803-0.033,1.584,0.135,2.33c3.793-0.045,7.541-0.275,11.232-0.695C113.271,172.188,113.295,172.127,113.305,172.061z"/>
	<path fill="#AECAE9" d="M108.441,164.678c0.016,0.004,0.027,0.012,0.041,0.016c0.338-0.008,0.676-0.016,1.02,0.027
		C109.146,164.676,108.793,164.666,108.441,164.678z"/>
	<path fill="#AECAE9" d="M109.502,164.721c-0.344-0.043-0.682-0.035-1.02-0.027c3.146,0.93,5.248,4.014,4.822,7.367
		c-0.01,0.066-0.033,0.127-0.043,0.193c0.719-0.082,1.428-0.189,2.143-0.287C115.666,168.385,113.109,165.178,109.502,164.721z"/>
	<path fill="#EA5598" d="M121.969,142.972c-4.6,0.916-9.35,1.133-13.982,1.34c-2.316,0.203-4.719-0.044-7.049-0.044
		c-2.346-0.023-4.695-0.336-7.031-0.504c-2.33-0.338-4.676-0.563-6.967-1.11c-0.344-0.061-0.68-0.18-1.021-0.25
		c3.965,4.668,12.908,8.159,23.018,7.243c8.703-0.787,16.059-3.646,19.896-7.646c-0.002,0-0.004,0-0.006,0
		C126.562,142,124.279,142.519,121.969,142.972z"/>
	<path opacity="0.5" fill="#E61B72" d="M121.969,142.972c-4.6,0.916-9.35,1.133-13.982,1.34c-2.316,0.203-4.719-0.044-7.049-0.044
		c-2.346-0.023-4.695-0.336-7.031-0.504c-2.33-0.338-4.676-0.563-6.967-1.11c-0.344-0.061-0.68-0.18-1.021-0.25
		c3.965,4.668,12.908,8.159,23.018,7.243c8.703-0.787,16.059-3.646,19.896-7.646c-0.002,0-0.004,0-0.006,0
		C126.562,142,124.279,142.519,121.969,142.972z"/>
	<path fill="#FBD5B3" d="M145.164,40.023c-0.246-0.234-0.475-0.486-0.729-0.715c0.008,0.021,0.014,0.047,0.021,0.068
		C144.693,39.592,144.932,39.805,145.164,40.023z"/>
	<path fill="#FBD5B3" d="M90.627,126.955c1.195-0.764,2.518-1.463,3.951-2.086c-7.723-2.244-11.613-7.803-11.828-8.117
		c-0.365-0.537-0.23-1.268,0.307-1.633c0.533-0.371,1.268-0.23,1.635,0.305c0.225,0.32,4.912,6.922,14.27,7.887
		c2.35-0.666,4.873-1.15,7.533-1.391c1.219-0.111,2.416-0.15,3.596-0.158c7.738-3.123,10.592-9.502,10.736-9.84
		c0.26-0.588,0.955-0.867,1.547-0.615c0.594,0.262,0.875,0.951,0.617,1.549c-0.133,0.312-2.402,5.438-8.234,9.148
		c3.393,0.381,6.484,1.184,9.061,2.348c7.174-2.676,15.498-3.801,21.93-4.252c3.592-5,6.541-11.033,8.668-18.283
		c5.852-19.953,1.26-37.016-5.029-49.316c-0.143,0.018-0.285,0.059-0.426,0.021c-0.123-0.035-0.244-0.084-0.357-0.162
		c-0.516-0.348-0.65-1.055-0.301-1.572c0.039-0.059,0.053-0.104,0.088-0.162c-1.26-2.312-2.568-4.439-3.859-6.365
		c-0.342,1.357-0.979,2.865-2.105,4.527c-0.381,0.564-1.066,0.801-1.689,0.639c-0.172-0.041-0.338-0.115-0.492-0.219
		c-0.717-0.488-0.904-1.465-0.42-2.184c2.312-3.41,2.068-5.805,1.436-7.295c-1.453-1.873-2.793-3.445-3.916-4.684
		c0.859,2.264,1.33,5.15,0.551,8.645c-0.146,0.662-0.695,1.135-1.332,1.213c-0.178,0.023-0.357,0.018-0.541-0.02
		c-0.848-0.195-1.379-1.031-1.191-1.879c1.555-6.971-3.064-10.969-3.277-11.15c-0.518-0.432-0.676-1.125-0.461-1.725
		c-1.803-0.92-3.65-1.754-5.549-2.494c2.004,2.793,7.502,11.764,4.457,22.76c-0.176,0.629-0.709,1.062-1.316,1.141
		c-0.201,0.025-0.412,0.012-0.617-0.045c-0.834-0.234-1.324-1.098-1.096-1.938c3.154-11.371-4.418-20.68-4.527-20.809
		c-0.537-0.639-0.461-1.57,0.133-2.139c-3.383-1.117-6.879-1.965-10.488-2.48c2.234,0.707,6.193,2.646,8.111,7.9
		c0.203,0.549,0.021,1.143-0.402,1.496c-0.117,0.098-0.25,0.18-0.4,0.238c-0.703,0.25-1.477-0.109-1.734-0.809
		c-2.104-5.766-7.297-6.516-7.533-6.551c-0.74-0.09-1.264-0.762-1.176-1.496c0.059-0.48,0.371-0.85,0.775-1.041
		c-2.564-0.264-5.16-0.398-7.803-0.336c0.072,0.127,0.152,0.254,0.188,0.406c0.201,0.846-0.32,1.691-1.162,1.887
		c-0.104,0.025-10.385,2.566-14.561,10.174c-2.17,3.949-2.342,8.652-0.506,13.986c2.648,7.709,9.119,10.014,12.738,10.701
		c6.916,1.312,14.688-0.938,18.465-5.357c2.326-2.73,2.895-6.01,1.645-9.492c-2.182-6.064-5.271-9.236-8.945-9.158
		c-3.926,0.082-7.814,3.799-8.855,7.096c-0.721,2.273-0.26,4.367,1.145,5.203c1.408,0.832,4.082,0.535,7.342-2.846
		c0.604-0.629,1.598-0.643,2.221-0.041s0.643,1.594,0.039,2.221c-4.535,4.699-8.762,4.816-11.207,3.365
		c-2.686-1.598-3.705-5.156-2.537-8.85c1.391-4.396,6.459-9.18,11.789-9.287c3.594-0.072,8.58,1.822,11.963,11.234
		c1.631,4.541,0.848,9.014-2.207,12.592c-4.258,4.984-12.295,7.607-19.957,6.641c-0.496-0.064-0.992-0.145-1.484-0.234
		C90.629,62.355,85.26,57.828,82.912,51c-2.137-6.211-1.889-11.779,0.732-16.537c3.248-5.9,9.334-9.076,13.162-10.576
		c-4.51,0.484-8.873,1.416-13.023,2.812c0.516,0.572,0.57,1.436,0.062,2.045c-0.111,0.129-7.68,9.438-4.529,20.809
		c0.229,0.84-0.258,1.703-1.094,1.938c-0.207,0.057-0.418,0.07-0.619,0.045c-0.607-0.078-1.139-0.512-1.316-1.141
		c-2.934-10.598,2.078-19.334,4.24-22.453c-1.807,0.725-3.562,1.529-5.275,2.416c0.102,0.541-0.064,1.119-0.518,1.496
		c-0.211,0.182-4.832,4.18-3.277,11.15c0.188,0.848-0.344,1.684-1.191,1.879c-0.184,0.037-0.363,0.043-0.541,0.02
		c-0.637-0.078-1.184-0.551-1.332-1.213c-0.941-4.219-0.062-7.555,1.135-9.957c-1.178,0.785-2.328,1.6-3.445,2.461
		c0.371,0.479,0.447,1.15,0.139,1.715c-0.131,0.25-3.768,3.203,0.242,9.115c0.486,0.719,0.299,1.695-0.42,2.184
		c-0.15,0.104-0.318,0.178-0.49,0.219c-0.621,0.162-1.307-0.074-1.691-0.639c-2.529-3.734-2.691-6.729-2.193-8.84
		c-1.211,1.133-2.385,2.297-3.496,3.523c-0.086,0.295-0.193,0.59-0.381,0.854l-0.82,1.145c-0.473,1.07-0.68,2.816,1.014,5.318
		c0.352,0.518,0.215,1.225-0.299,1.572c-0.113,0.078-0.236,0.127-0.357,0.162c-0.449,0.115-0.943-0.057-1.217-0.459
		c-0.822-1.213-1.26-2.299-1.502-3.287l-3.102,4.342c-0.244,0.34-0.557,0.596-0.9,0.787c-0.441,0.77-0.895,1.529-1.301,2.318
		c0.293-0.398,0.5-0.652,0.547-0.709c0.559-0.666,1.547-0.754,2.211-0.197c0.666,0.559,0.756,1.549,0.197,2.215
		c-0.109,0.129-7.68,9.438-4.527,20.809c0.229,0.84-0.26,1.703-1.096,1.938c-0.207,0.055-0.416,0.068-0.617,0.043
		c-0.609-0.076-1.143-0.51-1.316-1.139c-0.699-2.523-0.939-4.938-0.883-7.199c-0.885,4.477-1.32,9.1-1.135,13.854
		c0.074,1.871,0.207,3.719,0.393,5.541c-4.047,1.055-6.977,5.24-6.781,10.123c0.219,5.539,4.363,9.871,9.254,9.682
		c0.705-0.027,1.377-0.172,2.025-0.375c-1.156-2.957-1.922-5.904-2.27-8.289c-0.494-3.188-0.393-5.336-0.393-5.336
		s0.127,2.146,0.834,5.258c0.371,1.543,0.811,3.354,1.516,5.209c0.311,0.945,0.699,1.889,1.143,2.828
		c0.404,0.961,0.867,1.887,1.381,2.838c0.492,0.951,0.979,1.904,1.521,2.785c0.549,0.889,0.975,1.814,1.514,2.652
		c1.008,1.719,2.018,3.275,2.844,4.646c1.443,2.225,2.441,3.768,2.758,4.258c0.709,0.729,1.459,1.422,2.219,2.107
		c0.965-0.264,1.547-0.391,1.547-0.391C75.121,126.609,84.615,126.49,90.627,126.955z M127.658,71.201
		c0.221-0.381,0.705-0.494,1.078-0.271c0.271,0.16,6.678,4.018,8.947,7.457c0.24,0.369,0.141,0.852-0.223,1.09
		c-0.166,0.107-0.35,0.146-0.529,0.123c-0.221-0.023-0.428-0.146-0.559-0.346c-2.074-3.148-8.381-6.941-8.443-6.98
		C127.555,72.051,127.436,71.574,127.658,71.201z M123.295,82.1c1.766,0.125,3.424,0.559,5.102,0.986
		c0.18-0.178,0.438-0.256,0.715-0.084c0.719,0.434,1.529-0.16,2.141-0.57c0.406-0.275,0.816-1.286,1.254-1.522
		c0.131-0.068,0.305-0.909,0.459-0.909c0.027,0,0.041,0,0.053,0c0.018,0,0.039,0.685,0.098,0.655
		c0.244-0.154,0.635,0.466,0.459,0.753c-0.188,0.311-0.373,0.973-0.734,1.333c-0.236,0.232-0.482,0.547-0.742,0.754
		c1.371,0.094,2.604-0.553,3.447-1.635c0.176-0.227,0.467-0.036,0.514,0.191c0.109,0.518,0.01,0.995-0.205,1.407
		c0.748-0.23,1.516-0.542,2.342-0.973c0.357-0.186,0.883,0.13,0.648,0.558c-2.053,3.725-6.818,2.793-10.207,1.875
		c-2.627-0.717-9.811-3.033-11.17,0.557c-0.211,0.553-0.988,0.301-1.055-0.199C115.934,81.768,121.107,81.949,123.295,82.1z
		 M116.457,88.59c7.906-5.318,15.471,0.539,18.029,3.486c2.557,2.947-2.75,8.471-6.084,6.586c-3.334-1.879-4.908-1.691-10.918-2.994
		C111.471,94.367,116.457,88.59,116.457,88.59z M88.121,98.863c-6.002,1.326-7.584,1.143-10.908,3.033
		c-3.322,1.895-8.658-3.602-6.107-6.566c2.545-2.951,10.088-8.84,18.018-3.555C89.123,91.775,94.129,97.541,88.121,98.863z
		 M76.443,86.238c0.277-0.17,0.539-0.088,0.717,0.084c1.676-0.436,3.334-0.873,5.1-1.008c2.188-0.158,7.357-0.359,6.895,3.154
		c-0.07,0.498-0.844,0.75-1.057,0.201c-1.371-3.584-8.543-1.234-11.168-0.51c-3.389,0.932-8.154,1.883-10.215-1.838
		c-0.24-0.426,0.283-0.74,0.639-0.555c0.836,0.424,1.602,0.738,2.352,0.965c-0.213-0.41-0.318-0.877-0.211-1.396
		c0.043-0.227,0.332-0.391,0.51-0.166c0.852,1.076,2.088,1.764,3.455,1.67c-0.262-0.209-0.508-0.434-0.746-0.666
		c-0.359-0.355-0.549-0.844-0.738-1.148c-0.174-0.289,0.215-0.898,0.461-0.748C72.494,84.309,72.518,84,72.531,84
		c0.012,0,0.027,0,0.055,0c0.152,0,0.328,0.467,0.463,0.533c0.434,0.24,0.844,0.698,1.252,0.97
		C74.916,85.913,75.729,86.678,76.443,86.238z M74.385,73.754c0.373-0.225,0.857-0.104,1.076,0.273
		c0.221,0.371,0.102,0.846-0.271,1.074c-0.061,0.037-6.373,3.826-8.447,6.973c-0.131,0.197-0.34,0.32-0.559,0.35
		c-0.176,0.021-0.363-0.02-0.529-0.129c-0.363-0.236-0.459-0.723-0.225-1.086C67.701,77.764,74.115,73.916,74.385,73.754z
		 M65.566,64.955c0.381,0,0.691,0.312,0.691,0.693c0,0.385-0.311,0.695-0.691,0.695c-0.385,0-0.691-0.311-0.691-0.695
		C64.875,65.268,65.182,64.955,65.566,64.955z M40.289,101.041c-2.023-2.592-1.873-5.053,0-4.949
		c4.848,0.879,3.055,6.375,3.055,6.375s0,2.463-0.648,2.334C42.051,104.67,42.309,103.633,40.289,101.041z M44.916,105.268
		c0.566,0.23,0.967,0.781,0.967,1.434c0,0.859-0.693,1.553-1.553,1.553c-0.727,0-1.309-0.508-1.479-1.182
		c-0.029-0.123-0.076-0.238-0.076-0.371c0-0.857,0.695-1.553,1.555-1.553C44.539,105.148,44.734,105.193,44.916,105.268z"/>
	<path fill="#FBD5B3" d="M152.648,48.512c-0.256-0.35-0.512-0.697-0.773-1.045c0,0.006,0,0.012-0.002,0.018
		C152.133,47.826,152.396,48.166,152.648,48.512z"/>
	<path fill="#FBD5B3" d="M140.436,35.99c-0.422-0.324-0.859-0.623-1.293-0.936C139.574,35.367,140.014,35.666,140.436,35.99
		L140.436,35.99z"/>
	<path fill="#FBD5B3" d="M155.309,52.48c0.209,0.344,0.398,0.699,0.6,1.045C155.707,53.18,155.518,52.824,155.309,52.48z"/>
	<path fill="#FBD5B3" d="M148.422,43.297c-0.047-0.049-0.098-0.094-0.145-0.145c0.047,0.051,0.096,0.098,0.143,0.146L148.422,43.297
		z"/>
	<path fill="#FBD5B3" d="M163.287,74.375c0.062,0.414,0.117,0.832,0.172,1.25C163.404,75.205,163.35,74.789,163.287,74.375z"/>
	<path fill="#FBD5B3" d="M68.266,135.377c-0.207-0.125-0.418-0.246-0.627-0.371C67.844,135.133,68.057,135.254,68.266,135.377z"/>
	<path fill="#FBD5B3" d="M83.984,138.742c-0.096-0.385-0.178-0.775-0.213-1.176c-0.355-3.924,2.324-7.719,6.855-10.611
		c-6.012-0.465-15.506-0.346-28.436,2.418c2.938-0.627,5.697-1.117,8.287-1.496c-3.002,0.754-5.861,1.779-8.633,2.938
		c1.752,1.477,3.627,2.85,5.643,4.092C72.984,136.516,78.514,137.818,83.984,138.742z"/>
	<path fill="#FBD5B3" d="M131.617,133.014c5.381-3.129,10.154-7.381,14.129-12.914c-6.432,0.451-14.756,1.576-21.93,4.252
		C128.26,126.359,131.186,129.398,131.617,133.014z"/>
	<path fill="#FBD5B3" d="M70.479,127.877c-2.59,0.379-5.35,0.869-8.287,1.496c0,0-0.582,0.127-1.547,0.391
		c0.395,0.355,0.795,0.705,1.201,1.051C64.617,129.656,67.477,128.631,70.479,127.877z"/>
	<path fill="#FBD5B3" d="M122.508,124.84c0.428-0.174,0.873-0.324,1.309-0.488c-2.576-1.164-5.668-1.967-9.061-2.348
		c-2.746,1.746-6.273,3.182-10.754,3.648c-2.117,0.225-4.068,0.184-5.869-0.047c-1.264-0.16-2.449-0.414-3.555-0.736
		c-1.434,0.623-2.756,1.322-3.951,2.086c5.078,0.393,7.682,1.199,7.682,1.199C108.631,142.801,122.508,124.84,122.508,124.84z"/>
	<path fill="#FBD5B3" d="M103.76,123.309c2.404-0.25,4.502-0.809,6.33-1.547c-1.18,0.008-2.377,0.047-3.596,0.158
		c-2.66,0.24-5.184,0.725-7.533,1.391C100.447,123.465,102.039,123.488,103.76,123.309z"/>
	<path fill="#FBD5B3" d="M83.771,137.566c0.035,0.4,0.117,0.791,0.213,1.176c17.5,2.959,34.387,1.971,47.633-5.729
		c-0.432-3.615-3.357-6.654-7.801-8.662c-0.436,0.164-0.881,0.314-1.309,0.488c0,0-13.877,17.961-24.199,3.314
		c0,0-2.604-0.807-7.682-1.199C86.096,129.848,83.416,133.643,83.771,137.566z"/>
	<path fill="#221E20" d="M136.373,79.254c0.131,0.199,0.338,0.322,0.559,0.346c0.18,0.023,0.363-0.016,0.529-0.123
		c0.363-0.238,0.463-0.721,0.223-1.09c-2.27-3.439-8.676-7.297-8.947-7.457c-0.373-0.223-0.857-0.109-1.078,0.271
		c-0.223,0.373-0.104,0.85,0.271,1.072C127.992,72.312,134.299,76.105,136.373,79.254z"/>
	<path fill="#452B13" d="M117.467,85.475c1.359-3.59,8.543-1.271,11.17-0.555c3.389,0.918,8.154,1.852,10.207-1.873
		c0.234-0.428-0.291-0.742-0.648-0.557c-0.826,0.432-1.594,0.748-2.342,0.98c0.215-0.412,0.314-0.881,0.205-1.396
		c-0.047-0.229-0.338-0.395-0.514-0.168c-0.844,1.08-2.076,1.775-3.447,1.68c0.26-0.207,0.506-0.432,0.742-0.664
		c0.361-0.359,0.547-0.846,0.734-1.154c0.176-0.287-0.215-1.267-0.459-1.112c-0.059,0.029-0.08-0.655-0.098-0.655
		c-0.012,0-0.025,0-0.053,0c-0.154,0-0.328,0.841-0.459,0.909c-0.438,0.236-0.848,0.886-1.254,1.162
		c-0.611,0.412-1.422,1.184-2.141,0.749c-0.277-0.17-0.535-0.001-0.715,0.176c-1.678-0.428-3.336-0.815-5.102-0.94
		c-2.188-0.152-7.361-0.309-6.883,3.199C116.479,85.752,117.256,86.027,117.467,85.475z"/>
	<path fill="#F2957E" d="M117.484,95.668c6.01,1.303,7.584,1.115,10.918,2.994c3.334,1.885,8.641-3.639,6.084-6.586
		c-2.559-2.947-10.123-8.805-18.029-3.486C116.457,88.59,111.471,94.367,117.484,95.668z"/>
	<path fill="#9F621C" d="M84.691,115.424c-0.367-0.535-1.102-0.676-1.635-0.305c-0.537,0.365-0.672,1.096-0.307,1.633
		c0.215,0.314,4.105,5.873,11.828,8.117c1.369-0.594,2.834-1.119,4.383-1.559C89.604,122.346,84.916,115.744,84.691,115.424z"/>
	<path fill="#9F621C" d="M114.756,122.004c5.832-3.711,8.102-8.836,8.234-9.148c0.258-0.598-0.023-1.287-0.617-1.549
		c-0.592-0.252-1.287,0.027-1.547,0.615c-0.145,0.338-2.998,6.717-10.736,9.84C111.695,121.752,113.254,121.834,114.756,122.004z"/>
	<path fill="#9F621C" d="M104.002,125.652c4.48-0.467,8.008-1.902,10.754-3.648c-1.502-0.17-3.061-0.252-4.666-0.242
		c-1.828,0.738-3.926,1.297-6.33,1.547c-1.721,0.18-3.312,0.156-4.799,0.002c-1.549,0.439-3.014,0.965-4.383,1.559
		c1.105,0.322,2.291,0.576,3.555,0.736C99.934,125.836,101.885,125.877,104.002,125.652z"/>
	<path fill="#9F621C" d="M101.924,23.527c-0.338-0.588-1.01-0.926-1.701-0.764c-0.158,0.041-1.514,0.379-3.416,1.123
		c1.377-0.146,2.75-0.316,4.154-0.371C101.285,23.504,101.6,23.533,101.924,23.527z"/>
	<path fill="#9F621C" d="M83.645,34.463C81.023,39.221,80.775,44.789,82.912,51c2.348,6.828,7.717,11.355,15.123,12.768
		c0.492,0.09,0.988,0.17,1.484,0.234c7.662,0.967,15.699-1.656,19.957-6.641c3.055-3.578,3.838-8.051,2.207-12.592
		c-3.383-9.412-8.369-11.307-11.963-11.234c-5.33,0.107-10.398,4.891-11.789,9.287c-1.168,3.693-0.148,7.252,2.537,8.85
		c2.445,1.451,6.672,1.334,11.207-3.365c0.604-0.627,0.584-1.619-0.039-2.221s-1.617-0.588-2.221,0.041
		c-3.26,3.381-5.934,3.678-7.342,2.846c-1.404-0.836-1.865-2.93-1.145-5.203c1.041-3.297,4.93-7.014,8.855-7.096
		c3.674-0.078,6.764,3.094,8.945,9.158c1.25,3.482,0.682,6.762-1.645,9.492c-3.777,4.42-11.549,6.67-18.465,5.357
		c-3.619-0.688-10.09-2.992-12.738-10.701c-1.836-5.334-1.664-10.037,0.506-13.986c4.176-7.607,14.457-10.148,14.561-10.174
		c0.842-0.195,1.363-1.041,1.162-1.887c-0.035-0.152-0.115-0.279-0.188-0.406c-0.324,0.006-0.639-0.023-0.963-0.012
		c-1.404,0.055-2.777,0.225-4.154,0.371C92.979,25.387,86.893,28.562,83.645,34.463z"/>
	<path fill="#221E20" d="M65.654,82.295c0.166,0.109,0.354,0.15,0.529,0.129c0.219-0.029,0.428-0.152,0.559-0.35
		c2.074-3.146,8.387-6.936,8.447-6.973c0.373-0.229,0.492-0.703,0.271-1.074c-0.219-0.377-0.703-0.498-1.076-0.273
		c-0.27,0.162-6.684,4.01-8.955,7.455C65.195,81.572,65.291,82.059,65.654,82.295z"/>
	<path fill="#452B13" d="M73.049,84.533C72.914,84.467,72.738,84,72.586,84c-0.027,0-0.043,0-0.055,0
		c-0.014,0-0.037,0.309-0.096,0.277c-0.246-0.15-0.635,0.288-0.461,0.575c0.189,0.305,0.379,0.879,0.738,1.235
		c0.238,0.232,0.484,0.499,0.746,0.709c-1.367,0.094-2.604-0.572-3.455-1.65c-0.178-0.223-0.467-0.047-0.51,0.178
		c-0.107,0.521-0.002,0.992,0.211,1.402c-0.75-0.229-1.516-0.537-2.352-0.961c-0.355-0.186-0.879,0.13-0.639,0.556
		c2.061,3.721,6.826,2.771,10.215,1.837c2.625-0.725,9.797-3.073,11.168,0.509c0.213,0.549,0.986,0.299,1.057-0.199
		c0.463-3.516-4.707-3.312-6.895-3.154c-1.766,0.135-3.424,0.572-5.1,1.008c-0.178-0.172-0.439-0.254-0.717-0.084
		c-0.715,0.439-1.527-0.325-2.143-0.735C73.893,85.231,73.482,84.773,73.049,84.533z"/>
	<path fill="#F2957E" d="M71.105,95.33c-2.551,2.965,2.785,8.461,6.107,6.566c3.324-1.891,4.906-1.707,10.908-3.033
		c6.008-1.322,1.002-7.088,1.002-7.088C81.193,86.49,73.65,92.379,71.105,95.33z"/>
	<path fill="#F6B580" d="M156.842,55.146c-0.299-0.549-0.619-1.082-0.934-1.621c0.301,0.518,0.564,1.057,0.852,1.582
		C156.787,55.121,156.814,55.133,156.842,55.146z"/>
	<path fill="#F6B580" d="M139.143,35.055c-0.85-0.615-1.713-1.215-2.598-1.787c0.008,0.014,0.016,0.021,0.021,0.035
		C137.439,33.867,138.303,34.445,139.143,35.055z"/>
	<path fill="#F6B580" d="M145.164,40.023c1.072,1.008,2.117,2.045,3.113,3.129C147.281,42.068,146.236,41.031,145.164,40.023z"/>
	<path fill="#F6B580" d="M163.287,74.375c-0.002-0.012-0.004-0.02-0.006-0.031c0,0.002,0,0.006,0,0.008
		C163.283,74.357,163.285,74.367,163.287,74.375z"/>
	<path fill="#F6B580" d="M152.648,48.512c0.936,1.287,1.828,2.607,2.66,3.969C154.477,51.119,153.584,49.799,152.648,48.512z"/>
	<path fill="#F6B580" d="M163.459,75.625c0.234,1.789,0.42,3.6,0.492,5.438C163.879,79.225,163.695,77.416,163.459,75.625z"/>
	<path fill="#F6B580" d="M67.488,134.906c-0.014-0.002-0.025-0.006-0.037-0.01c0.033,0.018,0.068,0.035,0.104,0.055
		C67.531,134.938,67.512,134.922,67.488,134.906z"/>
	<path fill="#F6B580" d="M163.086,106.553c4.895-0.191,8.688-4.834,8.469-10.373c-0.193-4.871-3.418-8.803-7.525-9.557
		l-2.129,19.848C162.293,106.518,162.684,106.568,163.086,106.553z M168.551,92.812c1.871-0.102,2.021,2.363,0,4.955
		c-2.023,2.59-1.766,3.625-2.408,3.76c-0.648,0.127-1.166-0.135-0.648-2.336C165.494,99.191,163.701,93.691,168.551,92.812z
		 M164.699,101.988c0.18-0.07,0.377-0.117,0.584-0.117c0.857,0,1.555,0.695,1.555,1.557c0,0.129-0.045,0.242-0.076,0.367
		c-0.17,0.674-0.75,1.184-1.479,1.184c-0.859,0-1.553-0.695-1.553-1.551C163.73,102.771,164.131,102.221,164.699,101.988z"/>
	<path fill="#F6B580" d="M150.176,52.062c-0.186,0.275-0.482,0.396-0.791,0.438c6.289,12.301,10.881,29.363,5.029,49.316
		c-2.127,7.25-5.076,13.356-8.668,18.356c1.797-0.125,3.436-0.173,4.863-0.173h-0.008c0.115,0,0.199,0.02,0.309,0.018
		c0.67-0.018,1.295-0.018,1.854-0.018c0.129,0,0.24,0,0.359,0c0.537,0,1.002,0,1.408,0c0.111,0,0.205,0,0.309,0
		c0.188,0,0.41-0.659,0.586-0.962c1.256-1.926,2.271-4.053,3.213-6.159c0.936-2.102,1.662-4.309,2.365-6.51l3.025-19.735
		c0.021-1.83-0.004-3.694-0.078-5.565c-0.072-1.84-0.258-3.652-0.492-5.441c-0.055-0.418-0.109-0.839-0.172-1.251
		c-0.002-0.008-0.004-0.019-0.006-0.025c-0.111,1.555-0.371,3.168-0.832,4.83c-0.174,0.629-0.709,1.062-1.314,1.139
		c-0.203,0.025-0.414,0.012-0.619-0.043c-0.836-0.234-1.324-1.098-1.094-1.938c3.15-11.371-4.422-20.68-4.531-20.809
		c-0.557-0.666-0.469-1.656,0.197-2.215c0.482-0.404,1.135-0.461,1.672-0.209c-0.287-0.525-0.551-1.064-0.852-1.582
		c-0.201-0.346-0.391-0.701-0.6-1.045c-0.832-1.361-1.725-2.682-2.66-3.969c-0.252-0.346-0.516-0.686-0.775-1.027
		C151.801,48.768,151.381,50.285,150.176,52.062z"/>
	<path fill="#F6B580" d="M144.529,44.26c1.291,1.926,2.6,4.053,3.859,6.365c2.713-4.154,0.184-6.24,0.088-6.416
		c-0.162-0.293-0.16-0.617-0.057-0.91c-0.047-0.049-0.096-0.096-0.143-0.146c-0.996-1.084-2.041-2.121-3.113-3.129
		c-0.232-0.219-0.471-0.432-0.707-0.646C144.854,40.639,145.023,42.279,144.529,44.26z"/>
	<path fill="#F6B580" d="M137.342,35.045c1.123,1.238,2.463,2.811,3.916,4.684c-0.465-1.094-1.135-1.715-1.191-1.82
		c-0.361-0.658-0.178-1.445,0.369-1.918c-0.422-0.324-0.861-0.623-1.293-0.936c-0.84-0.609-1.703-1.188-2.576-1.752
		C136.848,33.824,137.104,34.424,137.342,35.045z"/>
	<path fill="#F6B580" d="M150.91,119.846c0.668-0.018,1.295-0.031,1.854-0.037C152.205,119.814,151.58,119.828,150.91,119.846z"/>
	<path fill="#F6B580" d="M153.123,120c0.529,0,1.004,0,1.408,0C154.125,120,153.66,120,153.123,120z"/>
	<path fill="#F6B580" d="M73.734,137.955c2.109,0.963,4.369,1.586,6.58,2.26c1.594,0.398,3.189,0.77,4.797,1.09
		c-0.523-0.809-0.902-1.664-1.127-2.562c-5.471-0.924-11-2.227-16.496-3.836c0.023,0.016,0.043,0.031,0.066,0.045
		C69.578,136.029,71.6,137.137,73.734,137.955z"/>
	<path fill="#F6B580" d="M131.617,133.014c0.01,0.074,0.033,0.143,0.039,0.219c0.154,1.709-0.285,3.389-1.178,4.986
		c1.463-0.508,2.92-1.041,4.33-1.689c1.068-0.42,2.105-0.918,3.107-1.482c0.998-0.568,2.072-1.01,3.008-1.676l2.883-1.883
		l2.705-2.125c1.717-1.518,3.398-3.088,4.857-4.861c0.791-0.84,1.451-1.777,2.123-2.705c0.055-0.068,0.094-0.146,0.146-0.217
		c-1.848-1.131-3-1.709-3.029-1.725c-1.428,0.043-3.066,0.119-4.863,0.244C141.771,125.633,136.998,129.885,131.617,133.014z"/>
	<path fill="#F6B580" d="M152.764,120c0.127,0,0.24,0,0.359,0C153.004,120,152.893,120,152.764,120z"/>
	<path fill="#F6B580" d="M154.84,119.807c-0.104-0.002-0.197-0.002-0.309-0.002c0.111,0,0.205,0.002,0.307,0.002H154.84z"/>
	<path fill="#F6B580" d="M150.602,119.852l0.008,0.004c0.098-0.002,0.205-0.008,0.301-0.01
		C150.801,119.848,150.717,119.848,150.602,119.852z"/>
	<path fill="#F6B580" d="M154.838,119.807c-0.102,0-0.195-0.002-0.307-0.002c-0.404-0.004-0.879-0.004-1.408,0
		c-0.119,0.002-0.232,0.002-0.359,0.004c-0.559,0.006-1.186,0.02-1.854,0.037c-0.096,0.002-0.203,0.008-0.301,0.01
		c0.029,0.016,1.182,0.594,3.029,1.725C154.076,121.016,154.455,120.41,154.838,119.807z"/>
	<path fill="#F6B580" d="M87.109,141.689c2.27,0.479,4.596,0.59,6.895,0.867c2.312,0.102,4.629,0.254,6.945,0.215
		c2.338-0.082,4.605-0.027,6.939-0.25c2.336-0.143,4.658-0.322,6.932-0.666c2.297-0.236,4.564-0.707,6.834-1.146
		c2.26-0.463,4.488-1.094,6.693-1.752c0.711-0.24,1.422-0.49,2.131-0.738c0.893-1.598,1.332-3.277,1.178-4.986
		c-0.006-0.076-0.029-0.145-0.039-0.219c-13.246,7.699-30.133,8.688-47.633,5.729c0.225,0.898,0.604,1.754,1.127,2.562
		C85.777,141.439,86.438,141.59,87.109,141.689z"/>
	<path fill="#9F621C" d="M155.652,120c0.002,0,0.008,0,0.014,0c0.109,0,0.17-0.087,0.244-0.083c0.18,0.002,0.293-0.038,0.293-0.038
		c0.045,0.027,0.082,0.037,0.127,0.062c0.061-0.107,0.141-0.214,0.199-0.323c1.232-2.018,2.217-4.182,3.119-6.356
		c0.902-2.184,1.582-4.439,2.234-6.697l0.061-0.037l0.057-0.033v-0.025c0-0.018-0.355,0.085-0.504,0.06
		C160.162,111.345,158.191,116,155.652,120z"/>
	<path fill="#9F621C" d="M129.771,139.326c-0.285,0.396-0.598,0.787-0.939,1.17c2.246-0.729,4.484-1.482,6.625-2.502
		c1.1-0.443,2.158-0.965,3.191-1.559c1.023-0.592,2.121-1.059,3.084-1.756l2.961-1.969l2.779-2.225
		c1.758-1.586,3.479-3.225,4.977-5.076c0.809-0.867,1.48-1.844,2.17-2.812c0.066-0.094,0.117-0.197,0.184-0.289
		c-0.201-0.129-0.383-0.24-0.572-0.359C148.836,129.604,140.904,135.623,129.771,139.326z"/>
	<path fill="#9F621C" d="M155.91,119.824c0.145,0.004,0.293,0.01,0.293,0.01S156.09,119.83,155.91,119.824z"/>
	<path fill="#9F621C" d="M155.666,119.818c-0.006,0-0.012,0-0.014,0l0,0C155.654,119.818,155.662,119.818,155.666,119.818z"/>
	<path fill="#9F621C" d="M84.225,141.611c-0.383-0.086-0.736-0.201-1.109-0.293c-1.189-0.293-2.371-0.594-3.5-0.945
		c-0.35-0.107-0.672-0.24-1.018-0.354c-1.117-0.371-2.229-0.748-3.287-1.174c-0.344-0.139-0.662-0.301-1-0.443
		c-1.021-0.436-2.039-0.877-3.008-1.363c-0.359-0.178-0.693-0.383-1.043-0.57c-0.672-0.357-1.348-0.711-1.994-1.092
		c1.732,1.033,3.463,2.064,5.324,2.883c2.088,1.08,4.324,1.805,6.533,2.602c1.906,0.588,3.838,1.115,5.795,1.518
		c-0.143-0.168-0.273-0.338-0.402-0.512C85.088,141.777,84.643,141.707,84.225,141.611z"/>
	<path fill="#9F621C" d="M67.451,134.896c0.062,0.037,0.125,0.072,0.188,0.109c-0.018-0.01-0.033-0.021-0.051-0.033
		C67.543,134.945,67.494,134.924,67.451,134.896z"/>
	<path fill="#9F621C" d="M155.666,119.818c0.08,0.002,0.184,0.004,0.244,0.006C155.836,119.822,155.775,119.822,155.666,119.818z"/>
	<path fill="#9F621C" d="M155.91,119.915c-0.061-0.002-0.164,0.085-0.244,0.085c-0.004,0-0.012,0-0.014,0
		c-0.453,1-0.928,1.343-1.422,2.04c0.189,0.119,0.371,0.185,0.572,0.314c0.555-0.768,1.062-1.585,1.527-2.412
		c-0.045-0.027-0.082-0.026-0.127-0.052C156.203,119.891,156.055,119.919,155.91,119.915z"/>
	<path fill="#9F621C" d="M105.678,143.381c-1.992,0.078-3.932,0.096-5.82,0.059c-0.467-0.01-0.904-0.053-1.367-0.068
		c-1.402-0.049-2.803-0.102-4.148-0.213c-0.469-0.041-0.906-0.113-1.365-0.16c-1.301-0.131-2.6-0.264-3.846-0.455
		c-0.424-0.066-0.818-0.16-1.236-0.23c-0.805-0.139-1.602-0.283-2.379-0.445c0.129,0.174,0.26,0.344,0.402,0.512
		c0.342,0.07,0.678,0.166,1.021,0.227c2.291,0.547,4.637,0.727,6.967,1.066c2.336,0.166,4.686,0.385,7.031,0.408
		c2.33,0,4.732,0.061,7.049-0.143c4.633-0.207,9.383-0.05,13.982-0.966c2.311-0.453,4.594-0.972,6.857-0.972
		c0.002,0,0.004,0,0.006,0c0.342-4,0.654-1.524,0.939-1.921C122.975,142.339,115.025,143.014,105.678,143.381z"/>
	<path fill="#9F621C" d="M83.115,141.318c-1.189-0.293-2.371-0.594-3.5-0.945C80.744,140.725,81.926,141.025,83.115,141.318z"/>
	<path fill="#9F621C" d="M74.311,138.402c-1.021-0.436-2.039-0.877-3.008-1.363C72.271,137.525,73.289,137.967,74.311,138.402z"/>
	<path fill="#9F621C" d="M67.588,134.973c0.018,0.012,0.033,0.023,0.051,0.033c0.209,0.125,0.42,0.246,0.627,0.371
		c0.646,0.381,1.322,0.734,1.994,1.092C69.352,135.986,68.447,135.502,67.588,134.973z"/>
	<path fill="#9F621C" d="M78.598,140.02c-1.117-0.371-2.229-0.748-3.287-1.174C76.369,139.271,77.48,139.648,78.598,140.02z"/>
	<path fill="#9F621C" d="M84.225,141.611c0.418,0.096,0.863,0.166,1.291,0.256c-0.004-0.004-0.008-0.008-0.01-0.01
		C85.084,141.77,84.639,141.707,84.225,141.611z"/>
	<path fill="#9F621C" d="M105.678,143.381c-1.992,0.078-3.932,0.096-5.82,0.059C101.746,143.477,103.686,143.459,105.678,143.381z"
		/>
	<path fill="#9F621C" d="M92.977,142.998c-1.301-0.131-2.6-0.264-3.846-0.455C90.377,142.734,91.676,142.867,92.977,142.998z"/>
	<path fill="#9F621C" d="M98.49,143.371c-1.402-0.049-2.803-0.102-4.148-0.213C95.688,143.27,97.088,143.322,98.49,143.371z"/>
	<path fill="#9F621C" d="M85.516,141.867c0.777,0.162,1.574,0.307,2.379,0.445c-0.809-0.139-1.604-0.293-2.389-0.455
		C85.508,141.859,85.512,141.863,85.516,141.867z"/>
	<path fill="#9F621C" d="M71.303,137.039c-0.359-0.18-0.693-0.383-1.043-0.57C70.609,136.656,70.943,136.861,71.303,137.039z"/>
	<path fill="#9F621C" d="M75.311,138.846c-0.344-0.139-0.662-0.301-1-0.443C74.648,138.545,74.967,138.707,75.311,138.846z"/>
	<path fill="#9F621C" d="M79.615,140.373c-0.35-0.107-0.672-0.24-1.018-0.354C78.943,140.133,79.266,140.266,79.615,140.373z"/>
	<path fill="#9F621C" d="M84.225,141.611c-0.383-0.086-0.736-0.201-1.109-0.293C83.488,141.41,83.842,141.525,84.225,141.611z"/>
	<path fill="#9F621C" d="M67.555,134.951c-0.035-0.02-0.07-0.037-0.104-0.055c0.043,0.027,0.092,0.049,0.137,0.076
		C67.576,134.965,67.566,134.959,67.555,134.951z"/>
	<path fill="#9F621C" d="M94.342,143.158c-0.469-0.041-0.904-0.113-1.365-0.16C93.436,143.045,93.873,143.117,94.342,143.158z"/>
	<path fill="#9F621C" d="M99.857,143.439c-0.467-0.01-0.904-0.053-1.367-0.068C98.953,143.387,99.391,143.43,99.857,143.439z"/>
	<path fill="#9F621C" d="M89.131,142.543c-0.424-0.064-0.818-0.16-1.236-0.23C88.312,142.383,88.707,142.477,89.131,142.543z"/>
	<path fill="#9F621C" d="M161.014,106.32l-0.016,0.061l0.006-0.035c-0.703,2.201-1.43,4.383-2.365,6.486
		c-0.941,2.104-1.957,4.28-3.213,6.206c-0.176,0.303-0.398,0.962-0.586,0.962c0.061,0,0.09,0,0.148,0
		c0.27,0,0.484-0.087,0.664-0.083c2.539-4.086,4.459-8.614,5.795-13.428c0.148,0.025,0.303-0.01,0.453,0.007l2.129-19.862
		l-3.025,19.718C161.008,106.342,161.01,106.328,161.014,106.32z"/>
	<path fill="#9F621C" d="M161.014,106.32c-0.004,0.008-0.006,0.018-0.01,0.025l-0.006,0.035L161.014,106.32z"/>
	<path fill="#9F621C" d="M153.492,121.797c-0.672,0.928-1.332,1.865-2.123,2.705c-1.459,1.773-3.141,3.344-4.857,4.861l-2.705,2.125
		l-2.883,1.883c-0.936,0.666-2.01,1.107-3.008,1.676c-1.002,0.564-2.039,1.062-3.107,1.482c-1.41,0.648-2.867,1.182-4.33,1.689
		c-0.209,0.375-0.447,0.744-0.707,1.107c11.133-3.703,19.064-9.723,24.459-17.377c-0.201-0.127-0.404-0.254-0.592-0.369
		C153.586,121.65,153.547,121.729,153.492,121.797z"/>
	<path fill="#9F621C" d="M155.652,119.818c-0.18-0.002-0.395-0.006-0.664-0.01C155.24,119.812,155.48,119.816,155.652,119.818
		L155.652,119.818z"/>
	<path fill="#9F621C" d="M85.111,141.305c-1.607-0.32-3.203-0.691-4.797-1.09c-2.211-0.674-4.471-1.297-6.58-2.26
		c-2.135-0.818-4.156-1.926-6.18-3.004c0.012,0.008,0.021,0.014,0.033,0.021c0.859,0.529,1.764,1.014,2.672,1.496
		c0.35,0.188,0.684,0.391,1.043,0.57c0.969,0.486,1.986,0.928,3.008,1.363c0.338,0.143,0.656,0.305,1,0.443
		c1.059,0.426,2.17,0.803,3.287,1.174c0.346,0.113,0.668,0.246,1.018,0.354c1.129,0.352,2.311,0.652,3.5,0.945
		c0.373,0.092,0.727,0.207,1.109,0.293c0.414,0.096,0.859,0.158,1.281,0.246C85.369,141.674,85.232,141.492,85.111,141.305z"/>
	<path fill="#9F621C" d="M154.988,119.809c-0.059,0-0.088-0.002-0.148-0.002h-0.002
		C154.889,119.809,154.941,119.809,154.988,119.809z"/>
	<path fill="#9F621C" d="M153.639,121.58c0.188,0.115,0.391,0.242,0.592,0.369c0.494-0.697,0.969-1.406,1.422-2.131
		c-0.172-0.002-0.412-0.006-0.664-0.01c-0.047,0-0.1,0-0.15-0.002C154.455,120.41,154.076,121.016,153.639,121.58z"/>
	<path fill="#9F621C" d="M121.654,140.709c-2.27,0.439-4.537,0.91-6.834,1.146c-2.273,0.344-4.596,0.523-6.932,0.666
		c-2.334,0.223-4.602,0.168-6.939,0.25c-2.316,0.039-4.633-0.113-6.945-0.215c-2.299-0.277-4.625-0.389-6.895-0.867
		c-0.672-0.1-1.332-0.25-1.998-0.385c0.121,0.188,0.258,0.369,0.395,0.553c0.785,0.162,1.58,0.316,2.389,0.455
		c0.418,0.07,0.812,0.166,1.236,0.23c1.246,0.191,2.545,0.324,3.846,0.455c0.461,0.047,0.896,0.119,1.365,0.16
		c1.346,0.111,2.746,0.164,4.148,0.213c0.463,0.016,0.9,0.059,1.367,0.068c1.889,0.037,3.828,0.02,5.82-0.059
		c9.348-0.367,17.297-1.793,24.094-4.055c0.26-0.363,0.498-0.732,0.707-1.107c-0.709,0.248-1.42,0.498-2.131,0.738
		C126.143,139.615,123.914,140.246,121.654,140.709z"/>
	<path fill="#452B13" d="M65.566,66.344c0.381,0,0.691-0.311,0.691-0.695c0-0.381-0.311-0.693-0.691-0.693
		c-0.385,0-0.691,0.312-0.691,0.693C64.875,66.033,65.182,66.344,65.566,66.344z"/>
	<path fill="#A66116" d="M134.113,31.75c0.162,0.094,0.316,0.201,0.477,0.299c0.539,0.318,1.064,0.656,1.592,0.992
		c0.121,0.076,0.244,0.148,0.363,0.227c-1.297-2.398-2.863-3.725-2.994-3.832c-0.666-0.555-1.654-0.459-2.207,0.215
		c-0.119,0.145-0.195,0.311-0.254,0.479c1.057,0.539,2.098,1.111,3.121,1.711C134.18,31.811,134.133,31.768,134.113,31.75z"/>
	<path fill="#A66116" d="M131.551,31.854c0.213,0.182,4.832,4.18,3.277,11.15c-0.188,0.848,0.344,1.684,1.191,1.879
		c0.184,0.037,0.363,0.043,0.541,0.02c0.637-0.078,1.186-0.551,1.332-1.213c0.779-3.494,0.309-6.381-0.551-8.645
		c-1.611-1.773-2.758-2.861-3.131-3.205c-1.023-0.6-2.064-1.172-3.121-1.711C130.875,30.729,131.033,31.422,131.551,31.854z"/>
	<path fill="#A66116" d="M134.59,32.049c0.539,0.318,1.064,0.656,1.592,0.992C135.654,32.705,135.129,32.367,134.59,32.049z"/>
	<path fill="#A66116" d="M134.113,31.75c0.02,0.018,0.066,0.061,0.098,0.09c0.123,0.072,0.254,0.133,0.379,0.209
		C134.43,31.951,134.275,31.844,134.113,31.75z"/>
	<path fill="#A66116" d="M136.566,33.303c-0.006-0.014-0.014-0.021-0.021-0.035c-0.119-0.078-0.242-0.15-0.363-0.227
		C136.312,33.123,136.438,33.219,136.566,33.303z"/>
	<path fill="#A66116" d="M136.182,33.041c-0.527-0.336-1.053-0.674-1.592-0.992c-0.125-0.076-0.256-0.137-0.379-0.209
		c0.373,0.344,1.52,1.432,3.131,3.205c-0.238-0.621-0.494-1.221-0.775-1.742C136.438,33.219,136.312,33.123,136.182,33.041z"/>
	<path fill="#A66116" d="M110.453,23.727c-0.264-0.033-0.506,0.033-0.727,0.137c0.787,0.082,1.578,0.152,2.359,0.262
		C111.184,23.84,110.535,23.734,110.453,23.727z"/>
	<path fill="#A66116" d="M108.951,24.904c-0.088,0.734,0.436,1.406,1.176,1.496c0.236,0.035,5.43,0.785,7.533,6.551
		c0.258,0.699,1.031,1.059,1.734,0.809c0.15-0.059,0.283-0.141,0.4-0.238c0.424-0.354,0.605-0.947,0.402-1.496
		c-1.918-5.254-5.877-7.193-8.111-7.9c-0.781-0.109-1.572-0.18-2.359-0.262C109.322,24.055,109.01,24.424,108.951,24.904z"/>
	<path fill="#A66116" d="M156.928,42.002c-0.055,0.129-0.09,0.258-0.107,0.395l1.207,1.689c0.369,0.084,0.758,0.076,1.113-0.131
		c7.9-4.582,7.553-12.521,7.531-12.854c-0.045-0.865-0.785-1.529-1.654-1.482c-0.861,0.049-1.523,0.785-1.482,1.65
		c0.014,0.281,0.209,6.383-5.969,9.967c-0.16,0.092-0.283,0.219-0.395,0.35c-0.006,0.02-0.008,0.037-0.014,0.055
		C157.117,41.787,157.004,41.879,156.928,42.002z"/>
	<path fill="#A66116" d="M143.846,38.818c0.189,0.168,0.4,0.316,0.59,0.49c-0.568-1.768-1.545-2.779-1.619-2.912
		c-0.418-0.758-1.375-1.035-2.135-0.615c-0.098,0.053-0.164,0.137-0.246,0.209c0.012,0.008,0.023,0.018,0.033,0.025
		C141.633,36.906,142.752,37.848,143.846,38.818z"/>
	<path fill="#A66116" d="M139.822,47.023c-0.484,0.719-0.297,1.695,0.42,2.184c0.154,0.104,0.32,0.178,0.492,0.219
		c0.623,0.162,1.309-0.074,1.689-0.639c1.127-1.662,1.764-3.17,2.105-4.527c-1.121-1.666-2.223-3.176-3.271-4.531
		C141.891,41.219,142.135,43.613,139.822,47.023z"/>
	<path fill="#A66116" d="M144.457,39.377c-0.008-0.021-0.014-0.047-0.021-0.068c-0.189-0.174-0.4-0.322-0.59-0.49
		C144.053,39.002,144.254,39.191,144.457,39.377z"/>
	<path fill="#A66116" d="M140.469,36.016c-0.01-0.008-0.021-0.018-0.033-0.025l0,0C140.447,35.998,140.459,36.008,140.469,36.016z"
		/>
	<path fill="#A66116" d="M140.469,36.016c1.162,0.891,2.283,1.832,3.377,2.803C142.752,37.848,141.633,36.906,140.469,36.016z"/>
	<path fill="#A66116" d="M144.457,39.377c-0.203-0.186-0.404-0.375-0.611-0.559c-1.094-0.971-2.215-1.912-3.377-2.803
		c-0.01-0.008-0.021-0.018-0.033-0.025c-0.547,0.473-0.73,1.26-0.369,1.918c0.057,0.105,0.727,0.727,1.191,1.82
		c1.049,1.355,2.15,2.865,3.271,4.531C145.023,42.279,144.854,40.639,144.457,39.377z"/>
	<path fill="#A66116" d="M161.002,46.508c1.205-0.678,4.248-1.857,8.381,2.094c0.627,0.598,1.619,0.576,2.221-0.047
		c0.125-0.137,0.229-0.289,0.301-0.449c0.26-0.59,0.143-1.303-0.35-1.771c-6.602-6.318-11.838-2.564-12.152-2.453
		c-0.43,0.148-0.742,0.469-0.91,0.855l1.324,1.854C160.18,46.408,160.598,46.373,161.002,46.508z"/>
	<path fill="#F5AE7F" d="M43.344,102.467c0,0,1.793-5.496-3.055-6.375c-1.873-0.104-2.023,2.357,0,4.949
		c2.02,2.592,1.762,3.629,2.406,3.76C43.344,104.93,43.344,102.467,43.344,102.467z"/>
	<path fill="#F8B133" d="M42.775,106.701c0,0.133,0.047,0.248,0.076,0.371l2.064-1.805c-0.182-0.074-0.377-0.119-0.586-0.119
		C43.471,105.148,42.775,105.844,42.775,106.701z"/>
	<path fill="#F7D135" d="M44.33,108.254c0.859,0,1.553-0.693,1.553-1.553c0-0.652-0.4-1.203-0.967-1.434l-2.064,1.805
		C43.021,107.746,43.604,108.254,44.33,108.254z"/>
	<path fill="#EF9355" d="M166.143,101.527c0.643-0.135,0.385-1.17,2.408-3.76c2.021-2.592,1.871-5.057,0-4.955
		c-4.85,0.879-3.057,6.379-3.057,6.379C164.977,101.393,165.494,101.654,166.143,101.527z"/>
	<path fill="#F8B133" d="M166.838,103.428c0-0.861-0.697-1.557-1.555-1.557c-0.207,0-0.404,0.047-0.584,0.117l2.062,1.807
		C166.793,103.67,166.838,103.557,166.838,103.428z"/>
	<path fill="#F7D135" d="M165.283,104.979c0.729,0,1.309-0.51,1.479-1.184l-2.062-1.807c-0.568,0.232-0.969,0.783-0.969,1.439
		C163.73,104.283,164.424,104.979,165.283,104.979z"/>
	<path fill="#9F621C" d="M124.848,26.727c-0.557-0.664-1.547-0.754-2.211-0.197c-0.025,0.021-0.037,0.053-0.062,0.076
		c0.996,0.33,1.994,0.652,2.967,1.029C125.17,27.121,124.904,26.791,124.848,26.727z"/>
	<path fill="#9F621C" d="M122.441,28.744c0.109,0.129,7.682,9.438,4.527,20.809c-0.229,0.84,0.262,1.703,1.096,1.938
		c0.205,0.057,0.416,0.07,0.617,0.045c0.607-0.078,1.141-0.512,1.316-1.141c3.045-10.996-2.453-19.967-4.457-22.76
		c-0.973-0.377-1.971-0.699-2.967-1.029C121.98,27.174,121.904,28.105,122.441,28.744z"/>
	<path fill="#9F621C" d="M158.434,58.316c0.699,1.498,1.334,3.031,1.91,4.594c0.141,0.387,0.268,0.777,0.402,1.168
		c0.494,1.436,0.939,2.893,1.324,4.377c0.068,0.264,0.15,0.52,0.215,0.783c0.408,1.672,0.732,3.379,0.996,5.105
		c0.756-10.637-5.668-18.459-5.98-18.83c-0.133-0.158-0.289-0.275-0.459-0.367c0.361,0.67,0.695,1.355,1.033,2.039
		C158.061,57.562,158.254,57.934,158.434,58.316z"/>
	<path fill="#9F621C" d="M160.344,62.91c0.141,0.385,0.268,0.777,0.402,1.168C160.611,63.688,160.484,63.297,160.344,62.91z"/>
	<path fill="#9F621C" d="M162.07,68.455c0.068,0.264,0.15,0.52,0.215,0.783C162.221,68.975,162.139,68.719,162.07,68.455z"/>
	<path fill="#9F621C" d="M157.875,57.186c0.186,0.377,0.381,0.748,0.559,1.131C158.254,57.934,158.061,57.562,157.875,57.186z"/>
	<path fill="#9F621C" d="M157.875,57.186c-0.338-0.684-0.672-1.369-1.033-2.039c-0.027-0.014-0.055-0.025-0.082-0.039
		C157.135,55.799,157.525,56.479,157.875,57.186z"/>
	<path fill="#9F621C" d="M163,74.352c0-0.002,0-0.006,0-0.008c0-1.727-0.588-3.434-0.996-5.105
		C162.412,70.914,163,72.621,163,74.352z"/>
	<path fill="#9F621C" d="M160.746,64.078c0.494,1.436,0.939,2.893,1.324,4.377C161.686,66.971,161.24,65.514,160.746,64.078z"/>
	<path fill="#9F621C" d="M158.434,58.316c0.699,1.498,1.336,3.031,1.91,4.594C159.768,61.348,159.133,59.814,158.434,58.316z"/>
	<path fill="#9F621C" d="M162.07,68.455c-0.385-1.484-0.83-2.941-1.324-4.377c-0.135-0.391-0.262-0.783-0.402-1.168
		c-0.574-1.562-1.211-3.096-1.91-4.594c-0.178-0.383-0.373-0.754-0.559-1.131c-0.35-0.707-0.74-1.387-1.115-2.078
		c-0.537-0.252-1.189-0.195-1.672,0.209c-0.666,0.559-0.754,1.549-0.197,2.215c0.109,0.129,7.682,9.438,4.531,20.809
		c-0.23,0.84,0.258,1.703,1.094,1.938c0.205,0.055,0.416,0.068,0.619,0.043c0.605-0.076,1.141-0.51,1.314-1.139
		c0.461-1.662,0.721-3.275,0.832-4.83c-0.264-1.73-0.588-3.438-0.996-5.113C162.221,68.975,162.139,68.719,162.07,68.455z"/>
	<path fill="#9F621C" d="M43.822,71.982c1.096-5.555,2.943-10.852,5.484-15.76C47.85,58.205,44.018,64.152,43.822,71.982z"/>
	<path fill="#9F621C" d="M44.705,79.182c0.174,0.629,0.707,1.062,1.316,1.139c0.201,0.025,0.41,0.012,0.617-0.043
		c0.836-0.234,1.324-1.098,1.096-1.938c-3.152-11.371,4.418-20.68,4.527-20.809c0.559-0.666,0.469-1.656-0.197-2.215
		c-0.664-0.557-1.652-0.469-2.211,0.197c-0.047,0.057-0.254,0.311-0.547,0.709c-2.541,4.908-4.389,10.205-5.484,15.76
		C43.766,74.244,44.006,76.658,44.705,79.182z"/>
	<path fill="#9F621C" d="M156.744,42.289c0.078-0.08,0.123-0.189,0.184-0.287c0.062-0.148,0.135-0.291,0.244-0.416
		c3.564-12.996-4.805-23.186-5.164-23.613c-0.559-0.664-1.549-0.752-2.211-0.197c-0.666,0.557-0.754,1.549-0.199,2.213
		c0.109,0.129,7.148,8.824,4.787,19.666c0.418,0.197,0.803,0.459,1.09,0.859L156.744,42.289z"/>
	<path fill="#9F621C" d="M156.928,42.002c0.076-0.123,0.189-0.215,0.23-0.361c0.006-0.018,0.008-0.035,0.014-0.055
		C157.062,41.711,156.99,41.854,156.928,42.002z"/>
	<path fill="#9F621C" d="M160.037,46.896l1.721,2.408c0.326,0.461,0.443,0.984,0.465,1.508c3.334,2.258,9.15,7.271,10.537,15.518
		c0.145,0.854,0.957,1.434,1.812,1.291c0.211-0.035,0.406-0.113,0.578-0.223c0.52-0.328,0.816-0.945,0.709-1.586
		c-2.248-13.33-14.182-19.027-14.688-19.264c-0.055-0.025-0.113-0.021-0.17-0.041c-0.299,0.17-0.518,0.318-0.57,0.336
		C160.301,46.889,160.17,46.889,160.037,46.896z"/>
	<path fill="#9F621C" d="M159.816,46.59l0.221,0.307c0.133-0.008,0.264-0.008,0.395-0.053c0.053-0.018,0.271-0.166,0.57-0.336
		C160.598,46.373,160.18,46.408,159.816,46.59z"/>
	<path fill="#E61B72" d="M150.461,43.115c0.072,0.131,1.344,1.434,1.451,3.686l4.51,6.316c0.898,1.252,2.641,1.543,3.893,0.646
		l0.793-0.568c0.797-0.568,1.15-1.475,1.115-2.383c-1.369-0.926-2.332-1.4-2.377-1.422c-0.789-0.359-1.129-1.293-0.76-2.086
		c0.088-0.186,0.211-0.344,0.354-0.479c-0.447-0.145-0.834-0.465-1.002-0.945c-0.135-0.391-0.1-0.795,0.055-1.145l-0.465-0.65
		c-0.244-0.053-0.488-0.123-0.684-0.289c-0.139-0.111-0.254-0.248-0.35-0.416c-0.182-0.311-0.217-0.652-0.174-0.984l-0.076-0.107
		c-0.248,0.256-0.551,0.447-0.904,0.492c-0.201,0.025-0.41,0.012-0.615-0.045c-0.836-0.236-1.326-1.1-1.096-1.936
		c0.107-0.387,0.174-0.764,0.256-1.146c-0.883-0.42-1.949-0.398-2.803,0.211l-0.793,0.566c-0.729,0.518-1.084,1.326-1.119,2.156
		C149.994,42.645,150.289,42.803,150.461,43.115z"/>
	<path fill="#E61B72" d="M156.994,43.381c0.096,0.168,0.211,0.305,0.35,0.416c0.195,0.166,0.439,0.236,0.684,0.289l-1.207-1.689
		C156.777,42.729,156.812,43.07,156.994,43.381z"/>
	<path fill="#E61B72" d="M158.438,45.881c0.168,0.48,0.555,0.801,1.002,0.945c0.111-0.104,0.242-0.17,0.377-0.236l-1.324-1.854
		C158.338,45.086,158.303,45.49,158.438,45.881z"/>
	<path fill="#E61B72" d="M155.225,42.736c0.205,0.057,0.414,0.07,0.615,0.045c0.354-0.045,0.656-0.236,0.904-0.492l-1.27-1.775
		c-0.287-0.4-0.672-0.662-1.09-0.859c-0.082,0.383-0.148,0.76-0.256,1.146C153.898,41.637,154.389,42.5,155.225,42.736z"/>
	<path fill="#E61B72" d="M160.037,46.896c-0.209,0.016-0.404-0.006-0.598-0.07c-0.143,0.135-0.266,0.293-0.354,0.479
		c-0.369,0.793-0.029,1.727,0.76,2.086c0.045,0.021,1.008,0.496,2.377,1.422c-0.021-0.523-0.139-1.047-0.465-1.508L160.037,46.896z"
		/>
	<path fill="#E61B72" d="M160.037,46.896l-0.221-0.307c-0.135,0.066-0.266,0.133-0.377,0.236
		C159.633,46.891,159.828,46.912,160.037,46.896z"/>
	<path fill="#A66116" d="M49.984,41.588c-0.113-0.131-0.238-0.258-0.396-0.352c-6.178-3.584-5.982-9.686-5.973-9.967
		c0.041-0.865-0.617-1.602-1.48-1.65c-0.869-0.047-1.607,0.617-1.654,1.482c-0.02,0.332-0.369,8.271,7.533,12.854
		c0.59,0.344,1.303,0.26,1.797-0.158c0.137-0.111,0.256-0.248,0.35-0.416c0.258-0.439,0.248-0.947,0.062-1.385
		c-0.074-0.123-0.188-0.211-0.227-0.355C49.992,41.623,49.99,41.605,49.984,41.588z"/>
	<path fill="#A66116" d="M47.715,46.826c0.123-0.039,0.234-0.09,0.342-0.158l0.68-0.949c0.182-0.773-0.219-1.572-0.984-1.838
		c-0.312-0.111-5.551-3.865-12.152,2.453c-0.494,0.469-0.611,1.182-0.348,1.771c0.068,0.16,0.172,0.312,0.295,0.449
		c0.604,0.623,1.598,0.645,2.223,0.047c4.133-3.951,7.18-2.771,8.381-2.092C46.705,46.322,47.301,46.443,47.715,46.826z"/>
	<path fill="#9F621C" d="M52.873,40.123c-2.674-11.057,4.572-20.002,4.682-20.135c0.555-0.664,0.467-1.656-0.195-2.213
		c-0.666-0.555-1.656-0.467-2.213,0.197c-0.361,0.428-8.734,10.619-5.162,23.615c0.105,0.123,0.176,0.264,0.238,0.408
		c0.18,0.293,0.418,0.498,0.727,0.623l1.506-2.105C52.572,40.352,52.732,40.254,52.873,40.123z"/>
	<path fill="#9F621C" d="M49.984,41.588c0.006,0.018,0.008,0.035,0.012,0.053c0.039,0.145,0.152,0.232,0.227,0.355
		C50.16,41.852,50.09,41.711,49.984,41.588z"/>
	<path fill="#9F621C" d="M47.832,46.984c-0.043-0.051-0.07-0.113-0.117-0.158c-0.316,0.104-0.658,0.135-0.996,0.018
		c-0.053-0.018-0.27-0.166-0.568-0.334c-0.057,0.018-0.113,0.014-0.166,0.039c-0.51,0.236-12.441,5.934-14.691,19.264
		c-0.107,0.641,0.191,1.258,0.711,1.586c0.172,0.109,0.365,0.188,0.578,0.223c0.854,0.143,1.664-0.438,1.812-1.291
		c1.508-8.959,8.244-14.107,11.34-16.041c0.08-0.344,0.221-0.678,0.439-0.984L47.832,46.984z"/>
	<path fill="#9F621C" d="M47.715,46.826c-0.414-0.383-1.01-0.504-1.564-0.316c0.299,0.168,0.516,0.316,0.568,0.334
		C47.057,46.961,47.398,46.93,47.715,46.826z"/>
	<path fill="#E61B72" d="M55.824,43.115c0.303-0.551,0.994-0.744,1.539-0.439c0.434,0.234,0.564,0.711,0.488,1.174
		c0.107-0.123,0.209-0.256,0.32-0.379c0.32-1.105-0.041-2.334-1.031-3.039l-0.793-0.566c-1.092-0.777-2.523-0.613-3.475,0.258
		c0.055,0.227,0.088,0.449,0.152,0.678c0.229,0.836-0.26,1.699-1.094,1.936c-0.207,0.057-0.416,0.07-0.619,0.045
		c-0.135-0.02-0.238-0.111-0.363-0.162l-2.213,3.1c-0.012,0.055-0.002,0.109-0.023,0.162c-0.121,0.348-0.367,0.605-0.656,0.787
		l-0.225,0.316c0.084,0.102,0.18,0.195,0.238,0.32c0.365,0.793,0.023,1.727-0.76,2.086c-0.037,0.018-0.652,0.322-1.576,0.898
		c-0.25,1.07,0.141,2.23,1.09,2.906l0.791,0.568c0.912,0.652,2.076,0.658,2.992,0.141c1.176-2.043,2.445-4.023,3.848-5.908
		C54.059,45.018,55.74,43.268,55.824,43.115z"/>
	<path fill="#E61B72" d="M54.609,48.775c-0.066-0.27-0.119-0.527-0.154-0.779c-1.402,1.885-2.672,3.865-3.848,5.908
		c0.344-0.191,0.656-0.447,0.9-0.787L54.609,48.775z"/>
	<path fill="#E61B72" d="M57.812,44.209c-0.039,0.074-0.506,0.502-0.842,1.26l0.82-1.145c0.188-0.264,0.295-0.559,0.381-0.854
		c-0.111,0.123-0.213,0.256-0.32,0.379C57.832,43.971,57.875,44.094,57.812,44.209z"/>
	<path fill="#E61B72" d="M48.713,45.881c0.021-0.053,0.012-0.107,0.023-0.162l-0.68,0.949
		C48.346,46.486,48.592,46.229,48.713,45.881z"/>
	<path fill="#E61B72" d="M51.932,42.736c0.834-0.236,1.322-1.1,1.094-1.936c-0.064-0.229-0.098-0.451-0.152-0.678
		c-0.141,0.131-0.301,0.229-0.418,0.391l-1.506,2.105c0.125,0.051,0.229,0.143,0.363,0.162
		C51.516,42.807,51.725,42.793,51.932,42.736z"/>
	<path fill="#E61B72" d="M48.07,47.305c-0.059-0.125-0.154-0.219-0.238-0.32l-1.658,2.32c-0.219,0.307-0.359,0.641-0.439,0.984
		c0.924-0.576,1.539-0.881,1.576-0.898C48.094,49.031,48.436,48.098,48.07,47.305z"/>
	<path fill="#A66116" d="M151.701,47.256c0.055,0.072,0.117,0.139,0.174,0.211c0.012-0.223,0.045-0.457,0.037-0.666l-1.77-2.477
		c-0.375-0.527-0.496-1.137-0.473-1.736c-0.248-0.043-0.51-0.045-0.746,0.088c-0.254,0.137-0.412,0.369-0.502,0.621
		c0.25,0.275,0.48,0.566,0.725,0.846C150.033,45.15,150.883,46.188,151.701,47.256z"/>
	<path fill="#A66116" d="M149.146,44.143c-0.244-0.279-0.475-0.57-0.725-0.846l-0.002,0.002
		C148.67,43.572,148.902,43.863,149.146,44.143z"/>
	<path fill="#A66116" d="M151.873,47.484c0.002-0.006,0.002-0.012,0.002-0.018c-0.057-0.072-0.119-0.139-0.174-0.211
		C151.758,47.332,151.814,47.408,151.873,47.484z"/>
	<path fill="#A66116" d="M148.301,50.787c-0.35,0.518-0.215,1.225,0.301,1.572c0.113,0.078,0.234,0.127,0.357,0.162
		c0.141,0.037,0.283-0.004,0.426-0.021c-0.328-0.641-0.66-1.26-0.996-1.875C148.354,50.684,148.34,50.729,148.301,50.787z"/>
	<path fill="#A66116" d="M149.146,44.143c0.887,1.008,1.736,2.045,2.555,3.113C150.883,46.188,150.033,45.15,149.146,44.143z"/>
	<path fill="#A66116" d="M151.873,47.484c-0.059-0.076-0.115-0.152-0.172-0.229c-0.818-1.068-1.668-2.105-2.555-3.113
		c-0.244-0.279-0.477-0.57-0.727-0.844c-0.104,0.293-0.105,0.617,0.057,0.91c0.096,0.176,2.625,2.262-0.088,6.416
		c0.336,0.615,0.668,1.234,0.996,1.875c0.309-0.041,0.605-0.162,0.791-0.438C151.381,50.285,151.801,48.768,151.873,47.484z"/>
	<path fill="#A66116" d="M151.912,46.801c-0.107-2.252-1.379-3.555-1.451-3.686c-0.172-0.312-0.467-0.471-0.791-0.527
		c-0.023,0.6,0.098,1.209,0.473,1.736L151.912,46.801z"/>
	<path fill="#9F621C" d="M83.65,26.529c-0.666-0.557-1.654-0.467-2.213,0.197c-0.068,0.078-0.414,0.498-0.91,1.215
		c1.078-0.434,2.15-0.869,3.256-1.242C83.734,26.643,83.707,26.578,83.65,26.529z"/>
	<path fill="#9F621C" d="M76.287,50.395c0.178,0.629,0.709,1.062,1.316,1.141c0.201,0.025,0.412,0.012,0.619-0.045
		c0.836-0.234,1.322-1.098,1.094-1.938c-3.15-11.371,4.418-20.68,4.529-20.809c0.508-0.609,0.453-1.473-0.062-2.045
		c-1.105,0.373-2.178,0.809-3.256,1.242C78.365,31.061,73.354,39.797,76.287,50.395z"/>
	<path fill="#9F621C" d="M74.941,29.65c-0.549-0.674-1.541-0.77-2.209-0.215c-0.137,0.113-1.871,1.623-3.205,4.297
		c1.84-1.227,3.746-2.348,5.725-3.375C75.205,30.107,75.117,29.861,74.941,29.65z"/>
	<path fill="#9F621C" d="M68.393,43.689c0.148,0.662,0.695,1.135,1.332,1.213c0.178,0.023,0.357,0.018,0.541-0.02
		c0.848-0.195,1.379-1.031,1.191-1.879c-1.555-6.971,3.066-10.969,3.277-11.15c0.453-0.377,0.619-0.955,0.518-1.496
		c-1.979,1.027-3.885,2.148-5.725,3.375C68.33,36.135,67.451,39.471,68.393,43.689z"/>
	<path fill="#9F621C" d="M65.604,35.781c-0.76-0.42-1.717-0.143-2.135,0.615c-0.082,0.146-1.289,1.387-1.801,3.551
		c1.408-1.318,2.881-2.572,4.414-3.754C65.955,36.029,65.797,35.889,65.604,35.781z"/>
	<path fill="#9F621C" d="M63.861,48.787c0.385,0.564,1.07,0.801,1.691,0.639c0.172-0.041,0.34-0.115,0.49-0.219
		c0.719-0.488,0.906-1.465,0.42-2.184c-4.01-5.912-0.373-8.865-0.242-9.115c0.309-0.564,0.232-1.236-0.139-1.715
		c-1.533,1.182-3.006,2.436-4.414,3.754C61.17,42.059,61.332,45.053,63.861,48.787z"/>
	<path fill="#9F621C" d="M56.111,52.062c0.273,0.402,0.768,0.574,1.217,0.459c0.121-0.035,0.244-0.084,0.357-0.162
		c0.514-0.348,0.65-1.055,0.299-1.572c-1.693-2.502-1.486-4.248-1.014-5.318l-2.361,3.307C54.852,49.764,55.289,50.85,56.111,52.062
		z"/>
	<path fill="#9F621C" d="M57.363,42.676c-0.545-0.305-1.236-0.111-1.539,0.439c-0.084,0.152-1.766,1.902-1.369,4.881
		c1.068-1.438,2.205-2.812,3.396-4.146C57.928,43.387,57.797,42.91,57.363,42.676z"/>
	<path fill="#9F621C" d="M57.852,43.85c-1.191,1.334-2.328,2.709-3.396,4.146c0.035,0.252,0.088,0.51,0.154,0.779l2.361-3.307
		c0.336-0.758,0.803-1.186,0.842-1.26C57.875,44.094,57.832,43.971,57.852,43.85z"/>
	<path fill="#9F621C" d="M47.668,110.791c-0.027,0.008-0.061,0.008-0.09,0.016c0.391,0.994,0.824,1.99,1.301,2.965
		c1.809,3.883,4.186,7.541,6.162,10.066c1.947,2.564,3.527,4.039,3.527,4.039s-0.076-0.119-0.143-0.221
		C53.77,122.861,50.215,117.158,47.668,110.791z"/>
	<path fill="#9F621C" d="M52.824,118.752c-0.539-0.838-0.965-1.764-1.514-2.652c-0.543-0.881-1.029-1.834-1.521-2.785
		c-0.514-0.951-0.977-1.877-1.381-2.838c-0.443-0.939-0.832-1.883-1.143-2.828c-0.705-1.855-1.145-3.666-1.516-5.209
		c-0.707-3.111-0.834-5.258-0.834-5.258s-0.102,2.148,0.393,5.336c0.348,2.385,1.113,5.332,2.27,8.289
		c0.029-0.008,0.062-0.008,0.09-0.016c2.547,6.367,6.102,12.07,10.758,16.865c-0.316-0.49-1.314-2.033-2.758-4.258
		C54.842,122.027,53.832,120.471,52.824,118.752z"/>
	<polygon fill="#D9D9D9" points="22.697,164.004 22.697,164.004 22.697,164.004 	"/>
</g>
</svg>
