<?xml version="1.0" encoding="utf-8"?>
<!-- Generator: Adobe Illustrator 16.0.0, SVG Export Plug-In . SVG Version: 6.00 Build 0)  -->
<!DOCTYPE svg PUBLIC "-//W3C//DTD SVG 1.1//EN" "http://www.w3.org/Graphics/SVG/1.1/DTD/svg11.dtd">
<svg version="1.1" id="Capa_1" xmlns="http://www.w3.org/2000/svg" xmlns:xlink="http://www.w3.org/1999/xlink" x="0px" y="0px"
	 width="200px" height="200px" viewBox="0 0 200 200" enable-background="new 0 0 200 200" xml:space="preserve">
<rect x="-11.5" y="-14" fill="#602483" stroke="#E4003F" stroke-miterlimit="10" width="228" height="228"/>
<g>
	<path fill="#469FCC" d="M24.5,175.307c0,5.453,4.422,9.875,9.875,9.875h138.25c5.453,0,9.875-4.422,9.875-9.875V66.682
		c0-5.455-4.422-9.875-9.875-9.875H34.375c-5.453,0-9.875,4.42-9.875,9.875V175.307z"/>
	<path opacity="0.15" enable-background="new    " d="M172.625,101.243V71.618c0-2.729-2.209-4.938-4.938-4.938H39.313
		c-2.729,0-4.938,2.209-4.938,4.938v29.625H172.625z"/>
	<g opacity="0.15">
		<circle cx="143" cy="125.932" r="9.875"/>
		<circle cx="64" cy="125.932" r="9.875"/>
	</g>
	<path fill="#EACA44" d="M147.938,125.932c0,2.729-2.209,4.938-4.938,4.938H64c-2.729,0-4.938-2.208-4.938-4.938l0,0
		c0-2.729,2.209-4.938,4.938-4.938h79C145.729,120.993,147.938,123.201,147.938,125.932L147.938,125.932z"/>
	<path opacity="0.2" enable-background="new    " d="M143,130.868H64c-1.809,0-3.322-1.019-4.181-2.47
		c-0.438,0.736-0.757,1.549-0.757,2.47c0,2.729,2.209,4.938,4.938,4.938h79c2.729,0,4.938-2.209,4.938-4.938
		c0-0.921-0.316-1.731-0.756-2.47C146.322,129.852,144.809,130.868,143,130.868z"/>
	<g opacity="0.15">
		<rect x="34.375" y="96.307" width="9.875" height="4.938"/>
		<rect x="162.75" y="96.307" width="9.875" height="4.938"/>
	</g>
	<path fill="#EAEAEA" d="M152.875,27.182h-98.75c-5.453,0-9.875,4.42-9.875,9.875v24.688c0-5.454,4.422-9.875,9.875-9.875h98.75
		c5.453,0,9.875,4.421,9.875,9.875V37.057C162.75,31.602,158.328,27.182,152.875,27.182z"/>
	<g opacity="0.1">
		<path d="M152.875,37.057h-98.75c-5.453,0-9.875,4.42-9.875,9.875v4.938c0-5.454,4.422-9.875,9.875-9.875h98.75
			c5.453,0,9.875,4.421,9.875,9.875v-4.938C162.75,41.477,158.328,37.057,152.875,37.057z"/>
		<path d="M152.875,27.182h-98.75c-5.453,0-9.875,4.42-9.875,9.875v4.938c0-5.454,4.422-9.875,9.875-9.875h98.75
			c5.453,0,9.875,4.421,9.875,9.875v-4.938C162.75,31.602,158.328,27.182,152.875,27.182z"/>
		<path d="M152.875,46.932h-98.75c-5.453,0-9.875,4.42-9.875,9.875v4.938c0-5.454,4.422-9.875,9.875-9.875h98.75
			c5.453,0,9.875,4.421,9.875,9.875v-4.938C162.75,51.352,158.328,46.932,152.875,46.932z"/>
	</g>
	<path fill="#EAEAEA" d="M162.75,101.243v-39.5c0-5.454-4.422-9.875-9.875-9.875h-98.75c-5.453,0-9.875,4.421-9.875,9.875v39.5
		H162.75z"/>
	<rect x="44.25" y="96.307" opacity="0.1" enable-background="new    " width="118.5" height="4.938"/>
	<path opacity="0.1" enable-background="new    " d="M138.062,76.557c0,2.729-2.209,4.938-4.938,4.938h-59.25
		c-2.729,0-4.938-2.208-4.938-4.938l0,0c0-2.729,2.209-4.938,4.938-4.938h59.25C135.854,71.618,138.062,73.827,138.062,76.557
		L138.062,76.557z"/>
</g>
</svg>
