<?xml version="1.0" encoding="utf-8"?>
<!-- Generator: Adobe Illustrator 16.0.0, SVG Export Plug-In . SVG Version: 6.00 Build 0)  -->
<!DOCTYPE svg PUBLIC "-//W3C//DTD SVG 1.1//EN" "http://www.w3.org/Graphics/SVG/1.1/DTD/svg11.dtd">
<svg version="1.1" id="Capa_1" xmlns="http://www.w3.org/2000/svg" xmlns:xlink="http://www.w3.org/1999/xlink" x="0px" y="0px"
	 width="200px" height="200px" viewBox="0 0 200 200" enable-background="new 0 0 200 200" xml:space="preserve">
<rect x="-15.823" y="-10.5" fill="#B14191" width="228" height="221"/>
<g>
	<polygon fill="#EAEAEA" points="98.015,46.378 31.47,112.918 31.47,196.006 169.884,196.006 169.884,118.242 	"/>
	<rect x="58.088" y="137.445" fill="#434854" width="37.266" height="58.561"/>
	<g>
		<rect x="106" y="132.123" fill="#469FCC" width="15.972" height="15.971"/>
		<rect x="127.295" y="132.123" fill="#469FCC" width="15.971" height="15.971"/>
		<rect x="127.295" y="110.829" fill="#469FCC" width="15.971" height="15.971"/>
		<rect x="106" y="110.829" fill="#469FCC" width="15.972" height="15.971"/>
	</g>
	<g opacity="0.15">
		<rect x="106" y="110.829" width="15.972" height="5.323"/>
		<rect x="127.295" y="110.829" width="15.971" height="5.323"/>
		<rect x="106" y="132.123" width="15.972" height="5.322"/>
		<rect x="127.295" y="132.123" width="15.971" height="5.322"/>
	</g>
	<polygon opacity="0.1" enable-background="new    " points="98.015,36.298 31.47,105.505 31.47,121.477 98.015,54.932 
		169.884,126.799 169.884,110.829 	"/>
	<path fill="#EF4D4D" d="M183.952,109.727l-78.409-78.41l-3.765-3.764c-2.08-2.08-5.45-2.08-7.527,0l-3.764,3.764l-73.085,73.086
		c-2.08,2.08-2.08,5.447,0,7.527l3.764,3.764c2.085,2.08,5.454,2.08,7.528,0l69.321-69.314l74.646,74.641
		c2.078,2.08,5.44,2.08,7.527,0l3.764-3.765C186.03,115.175,186.03,111.807,183.952,109.727z"/>
	<path fill="#3AAD73" d="M55.135,196.006c1.83-3.146,2.953-6.749,2.953-10.646c0-11.76-9.535-21.295-21.294-21.295
		c-11.759,0-21.294,9.535-21.294,21.295c0,3.898,1.123,7.502,2.953,10.646H55.135z"/>
	<path fill="#3AAD73" d="M164.56,164.064c-8.607,0-15.98,5.131-19.334,12.48c-2.193-1.133-4.643-1.835-7.283-1.835
		c-8.815,0-15.971,7.147-15.971,15.972c0,1.877,0.385,3.648,0.977,5.323h23.271h36.684c1.83-3.146,2.953-6.749,2.953-10.646
		C185.854,173.6,176.319,164.064,164.56,164.064z"/>
	<g opacity="0.2">
		<path d="M145.226,176.547c-2.193-1.133-4.643-1.835-7.283-1.835c-8.815,0-15.971,7.147-15.971,15.972
			c0,1.877,0.385,3.648,0.977,5.323h23.271c-1.83-3.146-2.953-6.749-2.953-10.647C143.266,182.208,143.993,179.24,145.226,176.547z"
			/>
	</g>
</g>
</svg>
