<?xml version="1.0" encoding="utf-8"?>
<!-- Generator: Adobe Illustrator 16.0.0, SVG Export Plug-In . SVG Version: 6.00 Build 0)  -->
<!DOCTYPE svg PUBLIC "-//W3C//DTD SVG 1.1//EN" "http://www.w3.org/Graphics/SVG/1.1/DTD/svg11.dtd">
<svg version="1.1" id="Capa_1" xmlns="http://www.w3.org/2000/svg" xmlns:xlink="http://www.w3.org/1999/xlink" x="0px" y="0px"
	 width="200px" height="200px" viewBox="0 0 200 200" enable-background="new 0 0 200 200" xml:space="preserve">
<rect x="-11" y="-17.5" fill="#E4003F" width="228" height="235"/>
<g>
	<path fill="#434854" d="M108.495,181.98V32.83c0-2.66-2.152-4.812-4.812-4.812h-9.623c-2.66,0-4.816,2.152-4.816,4.812v149.15
		H108.495L108.495,181.98z"/>
	<path fill="#EACA44" d="M161.4,92.973c0,0-2.344,2.404-4.815,2.404c-2.478,0-120.279,0-120.279,0c-2.659,0-4.811-2.15-4.811-4.811
		V42.452c0-2.659,2.152-4.812,4.811-4.812c0,0,118.168,0,120.279,0c2.104,0,4.815,2.406,4.815,2.406l21.649,21.651
		c3.31,3.308,3.232,6.389,0,9.622L161.4,92.973z"/>
	<rect x="89.245" y="95.377" opacity="0.3" enable-background="new    " width="19.25" height="4.812"/>
	<g>
		<path fill="#3AAD73" d="M86.844,181.98c-3.91,0-7.217,0-7.217,0s-4.811-14.435-14.434-14.435
			C79.627,167.548,86.844,177.17,86.844,181.98z"/>
		<path fill="#3AAD73" d="M74.816,157.925c14.429,0,19.246,19.245,19.246,24.058c-3.909,0-7.067,0-7.067,0
			S84.438,162.736,74.816,157.925z"/>
		<path fill="#3AAD73" d="M132.552,167.548c-9.646,0-14.472,14.435-14.472,14.435s-3.316,0-7.234,0
			C110.846,177.17,118.08,167.548,132.552,167.548z"/>
		<path fill="#3AAD73" d="M103.675,180.868c0.597-6.123,5.699-22.943,19.231-22.943c-9.651,4.812-12.213,24.058-12.213,24.058
			s-3.129,0-7.01,0c-0.022,0-0.047,0-0.076,0h-9.546c0,0,0-24.058,4.811-33.68C103.068,156.693,103.604,176.042,103.675,180.868z"/>
	</g>
	<path opacity="0.3" enable-background="new    " d="M95.101,164.409c0.074-0.691,0.158-1.382,0.253-2.072
		c0.033-0.263,0.071-0.526,0.108-0.79c0.084-0.592,0.169-1.179,0.264-1.766c0.061-0.366,0.121-0.725,0.182-1.086
		c0.09-0.498,0.174-0.986,0.268-1.471c0.086-0.438,0.17-0.854,0.264-1.283c0.085-0.403,0.17-0.816,0.264-1.211
		c0.117-0.479,0.239-0.94,0.367-1.4c0.084-0.32,0.163-0.648,0.262-0.954c0.15-0.522,0.32-1.011,0.488-1.495
		c0.081-0.221,0.15-0.46,0.231-0.672c0.258-0.682,0.53-1.325,0.821-1.908c4.195,8.393,4.732,27.741,4.803,32.566
		c0.075-0.768,0.221-1.701,0.445-2.75c0-0.014,0-0.028,0.01-0.037c0.217-1.044,0.521-2.204,0.907-3.421h0.009
		c0.781-2.458,1.912-5.146,3.449-7.64v-7.828c-0.508,0.507-0.986,1.033-1.447,1.578c-0.789-5.525-2.011-10.888-3.871-14.623
		l-4.305-8.607l-4.304,8.607c-1.879,3.765-3.091,9.197-3.881,14.707c-0.456-0.545-0.939-1.076-1.442-1.582v7.889
		c3.439,5.652,4.816,12.264,4.816,14.818c0,0,0.01-8.326,0.986-17.135C95.063,164.7,95.081,164.555,95.101,164.409z"/>
	<g opacity="0.1">
		<path d="M96.438,61.646H53.113c-1.33,0-2.411-1.076-2.411-2.406s1.081-2.406,2.411-2.406h43.325c1.335,0,2.41,1.076,2.41,2.406
			C98.849,60.57,97.773,61.646,96.438,61.646z"/>
		<path d="M53.113,71.27h62.585c1.329,0,2.405,1.076,2.405,2.405s-1.076,2.405-2.405,2.405H53.113c-1.33,0-2.411-1.076-2.411-2.405
			C50.703,72.346,51.783,71.27,53.113,71.27z"/>
	</g>
</g>
</svg>
