<!-- Generated by IcoMoon.io -->
<svg version="1.1" xmlns="http://www.w3.org/2000/svg" width="16" height="16" viewBox="0 0 16 16">
<title>f-face</title>
<path d="M11.999 0.004l-2.075-0.004c-2.331 0-3.838 1.546-3.838 3.938v1.816h-2.086c-0.18 0-0.326 0.146-0.326 0.327v2.631c0 0.181 0.146 0.326 0.326 0.326h2.086v6.637c0 0.181 0.146 0.326 0.326 0.326h2.722c0.181 0 0.326-0.146 0.326-0.326v-6.637h2.439c0.181 0 0.326-0.146 0.326-0.326l0.001-2.63c0-0.087-0.034-0.17-0.095-0.231s-0.145-0.096-0.231-0.096h-2.44v-1.539c0-0.74 0.177-1.115 1.14-1.115l1.398-0.001c0.18 0 0.326-0.146 0.326-0.326v-2.442c0-0.18-0.146-0.326-0.325-0.326z"></path>
</svg>
