<?xml version="1.0" encoding="UTF-8"?>
<!DOCTYPE svg PUBLIC "-//W3C//DTD SVG 1.1//EN" "http://www.w3.org/Graphics/SVG/1.1/DTD/svg11.dtd">
<!-- Creator: CorelDRAW X7 -->
<svg xmlns="http://www.w3.org/2000/svg" xml:space="preserve" width="100%" height="100%" version="1.1" style="shape-rendering:geometricPrecision; text-rendering:geometricPrecision; image-rendering:optimizeQuality; fill-rule:evenodd; clip-rule:evenodd"
viewBox="0 0 16500 2200"
 xmlns:xlink="http://www.w3.org/1999/xlink">
 <defs>
  <style type="text/css">
   <![CDATA[
    .fil2 {fill:#FEFEFE}
    .fil0 {fill:#7C529E}
    .fil1 {fill:white}
    .fil3 {fill:#FEFEFE;fill-rule:nonzero}
   ]]>
  </style>
 </defs>
 <g id="Слой_x0020_1">
  <metadata id="CorelCorpID_0Corel-Layer"/>
  <g id="_2250709427152">
   <path class="fil0" d="M2095 1793c-267,3 -558,-3 -850,-21 -30,-3 -48,12 -66,30 -75,84 -150,168 -228,252 -12,12 -24,36 -45,27 -21,-9 -12,-33 -12,-51 0,-69 -3,-141 0,-210 3,-54 -9,-81 -72,-81 -75,-3 -153,-12 -228,-27 -258,-61 -432,-202 -456,-496 -12,-129 -21,-255 0,-384 42,-264 195,-414 459,-459 384,-63 771,-84 1159,-90 405,-6 810,6 1216,27 195,9 390,36 582,75 231,48 387,225 408,465 12,138 15,276 -6,414 -27,183 -129,312 -297,387 -147,64 -303,85 -459,97 -364,27 -721,48 -1105,45l0 0z"/>
   <path class="fil1" d="M1104 1399c54,0 117,-51 135,-102 18,-48 -18,-69 -48,-93 -21,-18 -45,-33 -66,-48 -45,-33 -87,-33 -120,18 -18,30 -45,30 -72,18 -76,-36 -136,-87 -172,-165 -15,-33 -15,-66 21,-90 18,-12 39,-27 36,-57 -3,-36 -90,-159 -126,-171 -15,-6 -30,-6 -45,0 -81,27 -117,96 -84,174 96,240 270,405 505,507 15,6 30,6 36,9l0 0zm-174 -705c-12,3 -39,-9 -39,18 0,18 21,15 36,18 171,27 252,108 273,282 3,15 -3,39 18,42 24,0 18,-24 18,-39 3,-165 -141,-315 -306,-321l0 0zm1245 354l0 -255c0,-51 18,-93 75,-93 55,0 70,39 70,90l0 33c0,78 0,78 72,57 99,-30 195,9 243,99 57,108 63,216 0,324 -63,108 -183,141 -291,75 -18,-12 -24,-18 -39,3 -22,30 -55,33 -88,18 -33,-15 -42,-45 -42,-81l0 -270 0 0zm358 93c0,-81 -45,-141 -105,-144 -63,-3 -111,54 -111,135 0,78 45,141 105,144 63,6 111,-54 111,-135zm-898 3c48,-126 87,-231 126,-339 6,-18 12,-36 21,-54 18,-42 48,-66 96,-48 51,18 57,57 42,105 -48,126 -99,252 -147,381 -21,54 -42,108 -63,159 -12,30 -33,54 -69,57 -42,0 -63,-24 -75,-60 -69,-177 -141,-357 -210,-534 -18,-48 -9,-90 45,-108 54,-18 78,15 96,60 42,120 87,240 138,381l0 0zm1375 42l-129 0c-33,0 -36,15 -21,39 27,51 105,72 171,48 24,-9 45,-21 69,-33 33,-18 63,-15 84,18 24,36 9,66 -21,87 -96,66 -201,87 -309,42 -105,-45 -150,-135 -150,-246 -3,-144 96,-258 225,-273 132,-12 249,78 273,213 15,75 -6,102 -84,105l-108 0zm-63 -96c12,0 27,3 39,0 24,-3 60,15 66,-12 9,-36 -21,-63 -51,-78 -42,-21 -81,-18 -117,15 -18,18 -39,39 -30,66 9,24 36,9 57,12 12,0 24,-3 36,-3l0 0z"/>
   <path class="fil1" d="M1104 1399c-9,-3 -21,-3 -36,-9 -238,-102 -409,-267 -505,-507 -33,-81 0,-147 84,-174 15,-6 30,-6 45,0 36,12 123,135 126,171 3,27 -18,42 -36,57 -36,24 -36,54 -21,90 36,78 93,132 172,165 27,12 54,12 72,-18 33,-51 75,-48 120,-18 24,15 45,30 66,48 30,24 66,42 48,93 -18,51 -81,102 -135,102l0 0zm2146 -267l0 -180c0,-33 12,-57 42,-72 33,-15 66,-12 87,15 18,27 27,15 42,0 21,-18 48,-27 78,-24 33,6 54,24 60,57 6,33 -6,60 -33,66 -123,30 -141,114 -129,222 3,39 3,78 -3,114 -6,45 -33,72 -78,69 -42,-3 -63,-33 -66,-75 0,-60 0,-126 0,-192l0 0zm-1279 24l0 -171c0,-48 21,-78 72,-78 48,0 69,30 69,75l0 345c0,48 -24,78 -72,78 -48,-3 -69,-33 -69,-81l0 -168zm-1041 -462c165,6 309,156 306,321 0,15 6,39 -18,39 -24,0 -18,-24 -18,-42 -21,-174 -102,-255 -273,-282 -15,-3 -36,0 -36,-18 3,-27 27,-15 39,-18l0 0zm1194 87c-6,45 -27,75 -75,78 -45,3 -81,-33 -81,-78 0,-45 39,-84 81,-81 42,6 69,33 75,81z"/>
   <path class="fil1" d="M1152 985c-3,12 6,33 -15,36 -27,3 -21,-21 -24,-36 -18,-105 -54,-144 -162,-168 -15,-3 -39,0 -36,-24 3,-24 27,-15 42,-12 108,12 195,102 195,204z"/>
   <path class="fil1" d="M1071 967c0,12 0,27 -18,30 -12,0 -18,-9 -21,-21 -3,-45 -27,-69 -72,-75 -12,-3 -27,-6 -21,-24 3,-12 15,-12 27,-12 51,-3 105,51 105,102l0 0z"/>
  </g>
  <g id="_2250709424080">
   <g>
    <path class="fil2" d="M5526 1425c-89,0 -173,-27 -243,-73l-169 54 55 -164c-53,-72 -84,-162 -84,-258 0,-244 197,-442 441,-442 243,0 441,198 441,442 0,243 -198,441 -441,441l0 0 0 0zm0 -966c-290,0 -525,235 -525,525 0,99 28,192 75,271l-94 281 290 -93c78,43 165,65 254,65 0,0 0,0 0,0 290,0 525,-235 525,-524 0,-290 -235,-525 -525,-525z"/>
    <path class="fil2" d="M5403 766c-9,-20 -15,-21 -28,-21 -5,-1 -10,-1 -15,-1 -17,0 -34,5 -45,16 -13,13 -45,44 -45,107 0,64 46,125 52,133 7,9 90,141 220,194 101,42 131,39 155,34 33,-8 76,-33 86,-63 11,-30 11,-55 8,-61 -3,-5 -12,-8 -25,-15 -13,-6 -76,-38 -88,-42 -12,-4 -23,-3 -32,10 -12,17 -24,35 -34,46 -8,8 -21,9 -31,5 -14,-6 -54,-20 -104,-64 -38,-34 -64,-77 -71,-89 -8,-13 -1,-21 5,-28 6,-8 13,-14 19,-21 7,-8 10,-11 14,-20 5,-9 2,-18 -1,-24 -4,-7 -29,-70 -40,-96l0 0z"/>
   </g>
   <g>
    <path class="fil2" d="M6912 1201l-2 0 -112 -453 -136 0 -114 448 -2 0 -104 -448 -144 0 174 658 146 0 110 -448 2 0 111 448 144 0 177 -658 -142 0 -108 453zm691 -230c-13,-17 -31,-31 -53,-40 -23,-10 -51,-14 -86,-14 -25,0 -50,6 -76,19 -26,12 -47,32 -63,60l-3 0 0 -248 -131 0 0 658 131 0 0 -250c0,-48 8,-83 24,-104 16,-22 42,-32 77,-32 31,0 53,9 65,29 13,19 19,48 19,88l0 269 131 0 0 -293c0,-30 -3,-56 -8,-81 -5,-24 -14,-44 -27,-61l0 0zm538 329l0 -248c0,-29 -6,-52 -19,-70 -13,-17 -29,-31 -50,-40 -20,-10 -42,-17 -67,-20 -24,-4 -49,-5 -73,-5 -26,0 -52,2 -78,8 -26,5 -50,13 -71,26 -21,12 -38,28 -51,49 -14,20 -22,45 -23,76l130 0c3,-26 11,-44 26,-55 15,-11 35,-17 61,-17 12,0 22,1 33,2 10,2 19,5 26,10 8,4 14,11 19,19 4,8 7,19 7,34 0,13 -4,23 -12,30 -9,8 -21,13 -35,17 -15,3 -32,6 -51,8 -19,2 -39,4 -58,7 -20,3 -39,7 -58,13 -20,5 -37,13 -52,23 -15,11 -27,25 -37,42 -9,18 -14,40 -14,67 0,24 4,46 12,63 9,18 20,33 35,45 15,11 32,20 51,25 20,6 41,9 64,9 29,0 58,-5 87,-13 28,-9 52,-24 73,-45 1,7 2,15 3,23 2,8 4,15 6,23l133 0c-6,-10 -10,-25 -13,-45 -2,-20 -4,-40 -4,-61 0,0 0,0 0,0l0 0zm-130 -79c0,8 -1,18 -3,30 -1,12 -5,24 -12,36 -7,12 -17,23 -31,31 -15,9 -35,13 -60,13 -10,0 -21,-1 -31,-3 -10,-2 -18,-5 -25,-9 -8,-5 -14,-11 -18,-19 -4,-8 -6,-18 -6,-30 0,-12 2,-22 6,-30 4,-8 10,-15 17,-20 7,-5 15,-9 25,-12 9,-3 19,-6 29,-8 10,-1 21,-3 31,-4 11,-2 21,-3 30,-5 9,-2 18,-4 27,-7 8,-3 15,-6 21,-11l0 48 0 0zm374 -434l-130 0 0 143 -79 0 0 87 79 0 0 281c0,24 4,43 12,58 8,15 18,26 32,34 14,8 30,13 48,16 18,3 38,4 58,4 13,0 26,0 39,-1 14,0 26,-1 37,-3l0 -102c-6,2 -13,3 -19,3 -7,1 -14,1 -21,1 -22,0 -37,-4 -45,-11 -7,-7 -11,-22 -11,-44l0 -236 96 0 0 -87 -96 0 0 -143zm554 401c-8,-15 -20,-28 -34,-38 -14,-10 -30,-18 -48,-25 -18,-6 -37,-11 -56,-15 -18,-4 -37,-8 -54,-12 -18,-4 -34,-8 -48,-12 -14,-5 -25,-11 -33,-18 -9,-8 -13,-17 -13,-29 0,-10 2,-18 7,-23 5,-6 11,-11 18,-14 7,-3 15,-5 23,-6 9,-1 17,-1 24,-1 24,0 44,4 61,13 17,9 27,26 29,51l124 0c-2,-29 -10,-54 -22,-73 -13,-19 -29,-35 -48,-47 -19,-11 -41,-19 -65,-24 -24,-5 -49,-8 -75,-8 -26,0 -51,3 -75,7 -25,5 -47,13 -67,24 -19,11 -35,27 -47,47 -12,19 -18,44 -18,75 0,21 4,39 13,53 8,15 20,26 34,36 14,10 30,17 48,23 18,6 37,11 56,15 47,10 83,20 109,30 26,9 39,24 39,44 0,12 -3,21 -8,29 -5,7 -13,14 -21,18 -8,5 -17,8 -27,10 -10,3 -20,4 -29,4 -13,0 -26,-2 -38,-5 -12,-3 -22,-8 -31,-14 -10,-7 -17,-15 -23,-25 -6,-10 -9,-22 -9,-36l-124 0c1,32 8,58 21,79 14,21 31,38 51,51 21,13 44,22 71,28 26,6 53,8 81,8 0,0 0,0 0,0 27,0 53,-2 79,-8 26,-5 50,-14 70,-27 20,-13 37,-30 49,-51 13,-21 19,-47 19,-79 0,-22 -4,-40 -13,-55l0 0zm247 -440l-249 658 146 0 51 -147 246 0 50 147 150 0 -246 -658 -148 0zm-14 404l86 -242 1 0 83 242 -170 0zm860 -158c-18,-23 -40,-42 -67,-56 -27,-14 -59,-21 -97,-21 -29,0 -56,5 -81,17 -24,12 -45,31 -61,56l-1 0 0 -60 -125 0 0 642 131 0 0 -225 2 0c16,23 36,41 61,53 25,12 52,18 82,18 35,0 65,-7 91,-21 26,-13 48,-31 66,-54 17,-23 30,-49 39,-78 8,-30 13,-60 13,-92 0,-34 -5,-66 -13,-97 -9,-32 -22,-59 -40,-82l0 0zm-84 231c-3,19 -10,35 -19,49 -9,13 -20,25 -35,33 -14,9 -32,13 -53,13 -21,0 -39,-4 -54,-13 -14,-8 -26,-20 -35,-33 -9,-14 -16,-30 -20,-49 -4,-18 -6,-37 -6,-56 0,-20 2,-39 6,-57 4,-18 10,-35 19,-49 9,-14 20,-26 35,-34 14,-9 32,-14 54,-14 21,0 38,5 53,14 14,8 26,20 35,35 9,14 16,30 20,49 4,18 6,37 6,56 0,0 0,0 0,0 0,0 0,0 0,0 0,19 -2,38 -6,56l0 0zm645 -149c-9,-32 -22,-59 -40,-82 -18,-23 -40,-42 -67,-56 -27,-14 -59,-21 -97,-21 -29,0 -56,5 -81,17 -24,12 -44,31 -60,56l-2 0 0 -60 -125 0 0 642 131 0 0 -225 2 0c16,23 37,41 61,53 25,12 52,18 82,18 35,0 65,-7 91,-21 26,-13 48,-31 66,-54 17,-23 30,-49 39,-78 9,-30 13,-60 13,-92 0,-34 -4,-66 -13,-97l0 0zm-124 149c-3,19 -10,35 -18,49 -9,13 -21,25 -35,33 -15,9 -33,13 -54,13 -21,0 -39,-4 -54,-13 -14,-8 -26,-20 -35,-33 -9,-14 -15,-30 -19,-49 -4,-18 -6,-37 -6,-56 0,0 0,0 0,0 0,-20 1,-39 5,-57 4,-19 10,-35 19,-49 9,-14 21,-26 35,-34 14,-9 32,-14 54,-14 21,0 38,5 53,14 14,8 26,20 35,35 10,14 16,30 20,49 4,18 6,37 6,56 0,19 -2,38 -6,56l0 0zm0 0l0 0 0 0z"/>
   </g>
  </g>
  <g>
   <g id="_2250709424048">
    <path class="fil3" d="M12271 1405c-12,0 -27,-2 -42,-9 -3,-1 -5,-3 -7,-4l-341 -261 -120 -58 -208 -70c0,-1 -1,-1 -1,-1 -5,-2 -51,-19 -57,-63 -4,-38 28,-63 58,-73l834 -327c14,-6 57,-22 89,-2 9,6 25,21 25,52 0,2 0,4 0,6l-149 750c-1,2 -1,4 -2,6 -1,3 -15,35 -48,48 -8,4 -18,6 -31,6zm-13 -68l0 0c8,3 15,4 19,2 6,-3 10,-8 11,-11l146 -735c-6,1 -15,3 -21,6 0,0 -1,0 -1,0l-836 328c0,0 -1,0 -1,1 -4,1 -9,3 -12,6 3,2 7,5 11,7l210 70c1,1 2,1 4,2l125 60c2,1 3,2 5,4l340 260z"/>
   </g>
   <g id="_2250709430832">
    <path class="fil3" d="M12030 1204l-136 123c0,4 -22,4 -22,0l26 -227 1 -4c0,0 381,-342 397,-357 15,-14 10,-17 10,-17 1,-18 -28,0 -28,0l-505 320c0,0 64,208 76,248 13,39 20,39 23,39l158 -125z"/>
    <path class="fil3" d="M11883 1363c-6,0 -11,-1 -16,-2 -28,-3 -40,-33 -49,-61 -12,-40 -73,-240 -76,-248 -4,-14 1,-30 14,-37l504 -321c1,0 1,0 1,0 16,-10 39,-19 59,-7 10,6 17,15 18,27 1,2 1,4 2,6 2,19 -11,33 -22,43 -14,14 -332,299 -389,350l-17 154 96 -88c13,-12 34,-11 46,2 12,14 11,35 -2,47l-133 121c-7,8 -18,14 -36,14zm-71 -306l0 0c10,31 27,88 42,137l11 -97c1,-3 1,-5 2,-8l1 -4c2,-5 5,-9 9,-13 59,-53 141,-127 216,-194l-281 179z"/>
   </g>
   <g id="_2250709428976">
    <path class="fil3" d="M12030 1236c-7,0 -14,-2 -20,-7l-132 -103c-15,-11 -17,-32 -6,-46 11,-14 32,-17 46,-5l132 103c14,11 17,31 6,46 -7,8 -16,12 -26,12z"/>
   </g>
  </g>
  <polygon class="fil3" points="13220,828 13008,828 13008,1402 12956,1402 12956,828 12744,828 12744,783 13220,783 "/>
  <path id="1" class="fil3" d="M13445 1411c-31,0 -58,-6 -84,-17 -25,-11 -46,-27 -65,-47 -18,-20 -32,-44 -43,-71 -10,-28 -15,-58 -15,-91l0 -18c0,-35 5,-68 16,-96 11,-29 25,-54 43,-74 18,-20 39,-36 63,-47 24,-11 49,-17 75,-17 29,0 55,6 78,16 23,11 42,25 57,44 16,19 27,41 35,67 8,26 12,54 12,84l0 31 -328 0 0 10c0,26 4,49 11,72 8,22 19,41 33,57 14,17 30,30 49,40 20,9 41,14 65,14 27,0 51,-5 72,-15 20,-10 39,-26 56,-48l32 24c-7,11 -16,22 -26,32 -10,10 -22,18 -35,26 -14,7 -29,13 -45,17 -17,5 -36,7 -56,7zm-10 -434c-19,0 -37,4 -53,11 -17,7 -31,18 -44,31 -13,14 -23,30 -31,50 -8,19 -14,40 -16,63l275 0 0 -5c0,-20 -3,-38 -9,-56 -5,-18 -14,-34 -25,-48 -11,-14 -24,-25 -40,-34 -17,-8 -35,-12 -57,-12z"/>
  <polygon id="2" class="fil3" points="13773,1402 13722,1402 13722,749 13773,749 "/>
  <path id="3" class="fil3" d="M14090 1411c-30,0 -58,-6 -83,-17 -26,-11 -47,-27 -65,-47 -19,-20 -33,-44 -43,-71 -10,-28 -15,-58 -15,-91l0 -18c0,-35 5,-68 15,-96 11,-29 25,-54 44,-74 18,-20 39,-36 62,-47 24,-11 49,-17 75,-17 30,0 56,6 78,16 23,11 42,25 57,44 16,19 28,41 35,67 8,26 12,54 12,84l0 31 -328 0 0 10c0,26 4,49 11,72 8,22 19,41 33,57 14,17 30,30 50,40 19,9 40,14 64,14 27,0 51,-5 72,-15 21,-10 40,-26 57,-48l32 24c-8,11 -17,22 -27,32 -10,10 -22,18 -35,26 -13,7 -28,13 -45,17 -17,5 -36,7 -56,7zm-10 -434c-19,0 -37,4 -53,11 -17,7 -31,18 -44,31 -12,14 -23,30 -31,50 -8,19 -13,40 -16,63l276 0 0 -5c-1,-20 -4,-38 -10,-56 -5,-18 -13,-34 -24,-48 -11,-14 -25,-25 -41,-34 -16,-8 -35,-12 -57,-12z"/>
  <path id="4" class="fil3" d="M14341 1168c0,-36 4,-68 12,-97 8,-29 20,-53 35,-74 16,-20 34,-36 56,-47 22,-11 47,-17 75,-17 33,0 61,7 85,20 23,13 42,32 58,55l2 -66 48 0 0 452c0,30 -4,56 -13,80 -9,24 -21,44 -37,60 -16,17 -36,29 -58,38 -23,9 -49,13 -77,13 -14,0 -29,-1 -44,-4 -15,-4 -29,-9 -43,-15 -14,-7 -28,-15 -40,-25 -13,-9 -24,-21 -33,-34l29 -31c18,23 38,40 59,51 21,10 44,16 69,16 22,0 41,-4 58,-11 17,-6 31,-16 43,-28 11,-13 20,-28 26,-46 7,-18 10,-39 10,-62l0 -53c-16,21 -35,38 -59,50 -23,12 -51,18 -84,18 -27,0 -52,-6 -74,-18 -22,-11 -40,-27 -56,-48 -15,-20 -27,-45 -35,-73 -8,-29 -12,-61 -12,-95l0 -9zm52 9c0,27 2,52 8,75 5,23 13,43 24,60 11,17 25,30 42,40 17,10 37,14 60,14 18,0 34,-2 48,-6 14,-4 26,-10 37,-18 11,-7 20,-16 28,-26 8,-10 15,-22 21,-34l0 -214c-5,-12 -11,-23 -19,-34 -8,-11 -17,-20 -27,-29 -11,-8 -23,-15 -37,-20 -15,-5 -31,-7 -50,-7 -23,0 -44,5 -60,14 -18,10 -32,24 -43,41 -11,17 -19,37 -24,60 -6,23 -8,48 -8,75l0 9z"/>
  <path id="5" class="fil3" d="M15057 985c-10,-2 -22,-3 -34,-3 -18,0 -33,3 -47,8 -14,5 -26,12 -37,21 -10,10 -19,21 -27,33 -7,13 -12,27 -17,42l0 316 -50 0 0 -460 49 0 1 73c13,-25 30,-45 51,-60 21,-14 48,-22 79,-22 6,0 13,1 19,2 7,1 11,3 15,4l-2 46z"/>
  <path id="6" class="fil3" d="M15411 1402c-3,-8 -5,-18 -6,-29 -2,-12 -3,-23 -4,-35 -7,10 -16,19 -27,28 -10,9 -22,16 -35,23 -13,6 -28,12 -43,16 -16,4 -33,6 -51,6 -22,0 -43,-4 -61,-10 -18,-7 -34,-16 -47,-28 -12,-11 -22,-25 -30,-41 -7,-16 -10,-33 -10,-52 0,-22 5,-42 14,-60 10,-18 24,-34 42,-46 18,-13 40,-23 66,-29 26,-7 55,-10 87,-10l95 0 0 -53c0,-33 -10,-58 -31,-77 -20,-19 -49,-29 -88,-29 -18,0 -35,3 -49,8 -16,4 -28,11 -40,20 -10,8 -19,18 -25,29 -6,11 -9,23 -9,36l-51 0c0,-18 4,-34 13,-51 8,-16 20,-30 36,-43 15,-12 34,-22 55,-30 22,-8 46,-12 72,-12 25,0 47,4 68,10 20,6 38,15 53,28 15,12 26,28 34,47 8,18 12,40 12,65l0 223c0,8 1,16 1,25 1,8 2,16 3,24 1,8 3,16 5,23 1,7 3,14 6,19l0 5 -55 0zm-160 -36c19,0 36,-3 51,-7 16,-5 30,-12 43,-20 13,-8 24,-18 33,-28 10,-11 17,-23 23,-36l0 -101 -87 0c-26,0 -50,2 -70,7 -21,4 -38,11 -52,20 -14,9 -25,19 -33,32 -7,13 -11,27 -11,43 0,12 2,24 7,35 5,11 12,20 21,28 9,9 20,15 32,20 13,4 27,7 43,7z"/>
  <path id="7" class="fil3" d="M15633 942l2 75c8,-13 17,-24 27,-34 10,-11 21,-20 34,-27 12,-7 26,-13 40,-17 15,-4 31,-6 48,-6 34,0 63,8 87,22 24,14 41,37 51,68 8,-13 16,-25 27,-36 10,-11 22,-20 35,-28 13,-8 28,-14 44,-19 16,-4 33,-7 51,-7 24,0 45,4 64,10 19,6 35,17 47,30 13,14 23,32 30,53 7,21 10,46 10,76l0 300 -51 0 0 -300c0,-24 -2,-45 -8,-61 -5,-16 -13,-28 -23,-38 -10,-10 -22,-16 -35,-20 -14,-3 -29,-5 -46,-5 -21,0 -40,4 -56,11 -16,8 -30,17 -41,29 -12,11 -20,24 -26,38 -7,15 -10,28 -11,42l0 304 -52 0 0 -304c0,-23 -2,-42 -8,-57 -5,-16 -13,-28 -23,-37 -10,-10 -21,-16 -35,-20 -14,-4 -29,-6 -46,-6 -19,0 -36,3 -51,9 -15,6 -27,14 -38,24 -11,11 -20,22 -27,35 -7,13 -13,27 -17,41l0 315 -51 0 0 -460 48 0z"/>
 </g>
</svg>
