<?xml version="1.0" encoding="UTF-8"?>
<!DOCTYPE svg PUBLIC "-//W3C//DTD SVG 1.1//EN" "http://www.w3.org/Graphics/SVG/1.1/DTD/svg11.dtd">
<!-- Creator: CorelDRAW X7 -->
<svg xmlns="http://www.w3.org/2000/svg" xml:space="preserve" width="100%" height="100%" version="1.1" style="shape-rendering:geometricPrecision; text-rendering:geometricPrecision; image-rendering:optimizeQuality; fill-rule:evenodd; clip-rule:evenodd"
viewBox="0 0 3000 3000"
 xmlns:xlink="http://www.w3.org/1999/xlink">
 <defs>
  <style type="text/css">
   <![CDATA[
    .fil1 {fill:#FEFEFE}
    .fil0 {fill:#0081EF}
   ]]>
  </style>
 </defs>
 <g id="Слой_x0020_1">
  <metadata id="CorelCorpID_0Corel-Layer"/>
  <circle class="fil0" cx="1500" cy="1500" r="1500"/>
  <path class="fil1" d="M1209 447l110 621c0,0 -45,28 -106,6 -61,-22 -128,5 -72,114 57,109 235,453 235,453 30,58 184,392 235,406 25,7 70,12 66,-40 -3,-48 4,-80 44,-112l395 505c-65,85 -223,194 -366,150 -49,-14 -535,-403 -724,-816 -142,-310 -182,-723 -153,-1065 12,-138 217,-206 336,-222zm45 -7l109 622c0,0 69,-21 85,-31 12,-9 8,-30 7,-37 -1,-7 -81,-446 -94,-520 -2,-12 -7,-29 -22,-32 -14,-2 -85,-2 -85,-2zm506 1431l388 498c0,0 51,-51 60,-67 7,-14 -6,-30 -11,-36 -4,-6 -280,-356 -326,-415 -8,-10 -20,-23 -34,-18 -14,4 -77,38 -77,38z"/>
 </g>
</svg>
