{
	"one": {
		"company": "Baxter",
		"design": "Paola Navone",
		"myid": "T121884 \/ 16744",
		"country": "Италия \/ Современный",
		"material": "Металл \n Дерево",
		"size": "59*66*h80 \n 59*66*h80",
		"price": "1 145 890",
		"sale": "1 245 890"
	},
	"empty": {
		"company": "null",
		"design": "null",
		"myid": "null",
		"country": "null",
		"material": "null",
		"size": "null",
		"price": "null",
		"sale": "null"
	}
}