{
	"0": {
		"company": "Draenert",
		"description": "Стул Coco Soft 2023",
		"price": "от 110 484",
		"icanbuy": true
	},
	"1": {
		"company": "Cattelan Italia",
		"description": "Стул Coco Soft 2023",
		"price": "от 120 484",
		"icanbuy": true
	},
	"2": {
		"company": "Magis",
		"description": "Стул Coco Soft 2023",
		"price": "от 130 484",
		"icanbuy": true
	},
	"3": {
		"company": "Draenert",
		"description": "Стул Coco Soft 2023",
		"price": "от 140 484",
		"icanbuy": true
	},
	"4": {
		"company": "Draenert",
		"description": "Стул Coco Soft 2023",
		"price": "от 150 484",
		"icanbuy": true
	},
	"5": {
		"company": "Draenert",
		"description": "Стул Coco Soft 2023",
		"price": "от 160 484",
		"icanbuy": true
	},
	"6": {
		"company": "Draenert",
		"description": "Стул Coco Soft 2023",
		"price": "от 170 484",
		"icanbuy": true
	}
}