staff_id,type,description,initial_amount,amount
alexa,NEW,Car Loan,2000,2200
Rza_an,NEW,Car Loan,20900,22900
alexa,Top Up,House loan,12000,12400
Rza_an,Top Up,House loan,19000,194000
alexa,Emergency,Health loan,1000,1200
Rza_an,Emergency,Health loan,8000,8600
alexa,Emergency,Car insurance,2000,2200
Rza_an,Emergency,Car insurance,52000,5800
alexa,NEW,Bike Loan,12200,12220
Rza_an,NEW,Bike Loan,355200,3552220
