solid Onshape
  facet normal 0 1 0
    outer loop
      vertex 0.021706 1 -0.123101
      vertex 0.0108945 1 -0.124524
      vertex 0 1 7.65404e-18
    endloop
  endfacet
  facet normal 0 1 0
    outer loop
      vertex 0.0108945 1 -0.124524
      vertex 1.53081e-17 1 -0.125
      vertex 0 1 7.65404e-18
    endloop
  endfacet
  facet normal 0 1 0
    outer loop
      vertex 0 1 7.65404e-18
      vertex 1.53081e-17 1 -0.125
      vertex -0.0108945 1 -0.124524
    endloop
  endfacet
  facet normal 0 1 0
    outer loop
      vertex 0.0528273 1 -0.113288
      vertex 0.0427525 1 -0.117462
      vertex 0 1 7.65404e-18
    endloop
  endfacet
  facet normal 0 1 0
    outer loop
      vertex 0.0427525 1 -0.117462
      vertex 0.0323524 1 -0.120741
      vertex 0 1 7.65404e-18
    endloop
  endfacet
  facet normal 0 1 0
    outer loop
      vertex 0 1 7.65404e-18
      vertex 0.0323524 1 -0.120741
      vertex 0.021706 1 -0.123101
    endloop
  endfacet
  facet normal 0 1 0
    outer loop
      vertex 0.0803485 1 -0.0957556
      vertex 0.0716971 1 -0.102394
      vertex 0 1 7.65404e-18
    endloop
  endfacet
  facet normal 0 1 0
    outer loop
      vertex 0.0716971 1 -0.102394
      vertex 0.0625 1 -0.108253
      vertex 0 1 7.65404e-18
    endloop
  endfacet
  facet normal 0 1 0
    outer loop
      vertex 0 1 7.65404e-18
      vertex 0.0625 1 -0.108253
      vertex 0.0528273 1 -0.113288
    endloop
  endfacet
  facet normal 0 1 0
    outer loop
      vertex 0.102394 1 -0.0716971
      vertex 0.0957556 1 -0.0803485
      vertex 0 1 7.65404e-18
    endloop
  endfacet
  facet normal 0 1 0
    outer loop
      vertex 0.0957556 1 -0.0803485
      vertex 0.0883883 1 -0.0883883
      vertex 0 1 7.65404e-18
    endloop
  endfacet
  facet normal 0 1 0
    outer loop
      vertex 0 1 7.65404e-18
      vertex 0.0883883 1 -0.0883883
      vertex 0.0803485 1 -0.0957556
    endloop
  endfacet
  facet normal 0 1 0
    outer loop
      vertex 0.117462 1 -0.0427525
      vertex 0.113288 1 -0.0528273
      vertex 0 1 7.65404e-18
    endloop
  endfacet
  facet normal 0 1 0
    outer loop
      vertex 0.113288 1 -0.0528273
      vertex 0.108253 1 -0.0625
      vertex 0 1 7.65404e-18
    endloop
  endfacet
  facet normal 0 1 0
    outer loop
      vertex 0 1 7.65404e-18
      vertex 0.108253 1 -0.0625
      vertex 0.102394 1 -0.0716971
    endloop
  endfacet
  facet normal 0 1 0
    outer loop
      vertex 0.124524 1 -0.0108945
      vertex 0.123101 1 -0.021706
      vertex 0 1 7.65404e-18
    endloop
  endfacet
  facet normal 0 1 0
    outer loop
      vertex 0.123101 1 -0.021706
      vertex 0.120741 1 -0.0323524
      vertex 0 1 7.65404e-18
    endloop
  endfacet
  facet normal 0 1 0
    outer loop
      vertex 0 1 7.65404e-18
      vertex 0.120741 1 -0.0323524
      vertex 0.117462 1 -0.0427525
    endloop
  endfacet
  facet normal 0 1 0
    outer loop
      vertex 0.123101 1 0.021706
      vertex 0.124524 1 0.0108945
      vertex 0 1 7.65404e-18
    endloop
  endfacet
  facet normal 0 1 0
    outer loop
      vertex 0.124524 1 0.0108945
      vertex 0.125 1 4.30637e-17
      vertex 0 1 7.65404e-18
    endloop
  endfacet
  facet normal 0 1 0
    outer loop
      vertex 0 1 7.65404e-18
      vertex 0.125 1 4.30637e-17
      vertex 0.124524 1 -0.0108945
    endloop
  endfacet
  facet normal 0 1 0
    outer loop
      vertex 0.113288 1 0.0528273
      vertex 0.117462 1 0.0427525
      vertex 0 1 7.65404e-18
    endloop
  endfacet
  facet normal 0 1 0
    outer loop
      vertex 0.117462 1 0.0427525
      vertex 0.120741 1 0.0323524
      vertex 0 1 7.65404e-18
    endloop
  endfacet
  facet normal 0 1 0
    outer loop
      vertex 0 1 7.65404e-18
      vertex 0.120741 1 0.0323524
      vertex 0.123101 1 0.021706
    endloop
  endfacet
  facet normal 0 1 0
    outer loop
      vertex 0.0957556 1 0.0803485
      vertex 0.102394 1 0.0716971
      vertex 0 1 7.65404e-18
    endloop
  endfacet
  facet normal 0 1 0
    outer loop
      vertex 0.102394 1 0.0716971
      vertex 0.108253 1 0.0625
      vertex 0 1 7.65404e-18
    endloop
  endfacet
  facet normal 0 1 0
    outer loop
      vertex 0 1 7.65404e-18
      vertex 0.108253 1 0.0625
      vertex 0.113288 1 0.0528273
    endloop
  endfacet
  facet normal 0 1 0
    outer loop
      vertex 0.0716971 1 0.102394
      vertex 0.0803485 1 0.0957556
      vertex 0 1 7.65404e-18
    endloop
  endfacet
  facet normal 0 1 0
    outer loop
      vertex 0.0803485 1 0.0957556
      vertex 0.0883883 1 0.0883883
      vertex 0 1 7.65404e-18
    endloop
  endfacet
  facet normal 0 1 0
    outer loop
      vertex 0 1 7.65404e-18
      vertex 0.0883883 1 0.0883883
      vertex 0.0957556 1 0.0803485
    endloop
  endfacet
  facet normal 0 1 0
    outer loop
      vertex 0.0427525 1 0.117462
      vertex 0.0528273 1 0.113288
      vertex 0 1 7.65404e-18
    endloop
  endfacet
  facet normal 0 1 0
    outer loop
      vertex 0.0528273 1 0.113288
      vertex 0.0625 1 0.108253
      vertex 0 1 7.65404e-18
    endloop
  endfacet
  facet normal 0 1 0
    outer loop
      vertex 0 1 7.65404e-18
      vertex 0.0625 1 0.108253
      vertex 0.0716971 1 0.102394
    endloop
  endfacet
  facet normal 0 1 0
    outer loop
      vertex 0.0108945 1 0.124524
      vertex 0.021706 1 0.123101
      vertex 0 1 7.65404e-18
    endloop
  endfacet
  facet normal 0 1 0
    outer loop
      vertex 0.021706 1 0.123101
      vertex 0.0323524 1 0.120741
      vertex 0 1 7.65404e-18
    endloop
  endfacet
  facet normal 0 1 0
    outer loop
      vertex 0 1 7.65404e-18
      vertex 0.0323524 1 0.120741
      vertex 0.0427525 1 0.117462
    endloop
  endfacet
  facet normal 0 1 0
    outer loop
      vertex -0.021706 1 0.123101
      vertex -0.0108945 1 0.124524
      vertex 0 1 7.65404e-18
    endloop
  endfacet
  facet normal 0 1 0
    outer loop
      vertex -0.0108945 1 0.124524
      vertex 0 1 0.125
      vertex 0 1 7.65404e-18
    endloop
  endfacet
  facet normal 0 1 0
    outer loop
      vertex 0 1 7.65404e-18
      vertex 0 1 0.125
      vertex 0.0108945 1 0.124524
    endloop
  endfacet
  facet normal 0 1 0
    outer loop
      vertex -0.0528273 1 0.113288
      vertex -0.0427525 1 0.117462
      vertex 0 1 7.65404e-18
    endloop
  endfacet
  facet normal 0 1 0
    outer loop
      vertex -0.0427525 1 0.117462
      vertex -0.0323524 1 0.120741
      vertex 0 1 7.65404e-18
    endloop
  endfacet
  facet normal 0 1 0
    outer loop
      vertex 0 1 7.65404e-18
      vertex -0.0323524 1 0.120741
      vertex -0.021706 1 0.123101
    endloop
  endfacet
  facet normal 0 1 0
    outer loop
      vertex -0.0803485 1 0.0957556
      vertex -0.0716971 1 0.102394
      vertex 0 1 7.65404e-18
    endloop
  endfacet
  facet normal 0 1 0
    outer loop
      vertex -0.0716971 1 0.102394
      vertex -0.0625 1 0.108253
      vertex 0 1 7.65404e-18
    endloop
  endfacet
  facet normal 0 1 0
    outer loop
      vertex 0 1 7.65404e-18
      vertex -0.0625 1 0.108253
      vertex -0.0528273 1 0.113288
    endloop
  endfacet
  facet normal 0 1 0
    outer loop
      vertex -0.102394 1 0.0716971
      vertex -0.0957556 1 0.0803485
      vertex 0 1 7.65404e-18
    endloop
  endfacet
  facet normal 0 1 0
    outer loop
      vertex -0.0957556 1 0.0803485
      vertex -0.0883883 1 0.0883883
      vertex 0 1 7.65404e-18
    endloop
  endfacet
  facet normal 0 1 0
    outer loop
      vertex 0 1 7.65404e-18
      vertex -0.0883883 1 0.0883883
      vertex -0.0803485 1 0.0957556
    endloop
  endfacet
  facet normal 0 1 0
    outer loop
      vertex -0.117462 1 0.0427525
      vertex -0.113288 1 0.0528273
      vertex 0 1 7.65404e-18
    endloop
  endfacet
  facet normal 0 1 0
    outer loop
      vertex -0.113288 1 0.0528273
      vertex -0.108253 1 0.0625
      vertex 0 1 7.65404e-18
    endloop
  endfacet
  facet normal 0 1 0
    outer loop
      vertex 0 1 7.65404e-18
      vertex -0.108253 1 0.0625
      vertex -0.102394 1 0.0716971
    endloop
  endfacet
  facet normal 0 1 0
    outer loop
      vertex -0.124524 1 0.0108945
      vertex -0.123101 1 0.021706
      vertex 0 1 7.65404e-18
    endloop
  endfacet
  facet normal 0 1 0
    outer loop
      vertex -0.123101 1 0.021706
      vertex -0.120741 1 0.0323524
      vertex 0 1 7.65404e-18
    endloop
  endfacet
  facet normal 0 1 0
    outer loop
      vertex 0 1 7.65404e-18
      vertex -0.120741 1 0.0323524
      vertex -0.117462 1 0.0427525
    endloop
  endfacet
  facet normal 0 1 0
    outer loop
      vertex -0.123101 1 -0.021706
      vertex -0.124524 1 -0.0108945
      vertex 0 1 7.65404e-18
    endloop
  endfacet
  facet normal 0 1 0
    outer loop
      vertex -0.124524 1 -0.0108945
      vertex -0.125 1 -1.2633e-16
      vertex 0 1 7.65404e-18
    endloop
  endfacet
  facet normal 0 1 0
    outer loop
      vertex 0 1 7.65404e-18
      vertex -0.125 1 -1.2633e-16
      vertex -0.124524 1 0.0108945
    endloop
  endfacet
  facet normal 0 1 0
    outer loop
      vertex -0.113288 1 -0.0528273
      vertex -0.117462 1 -0.0427525
      vertex 0 1 7.65404e-18
    endloop
  endfacet
  facet normal 0 1 0
    outer loop
      vertex -0.117462 1 -0.0427525
      vertex -0.120741 1 -0.0323524
      vertex 0 1 7.65404e-18
    endloop
  endfacet
  facet normal 0 1 0
    outer loop
      vertex 0 1 7.65404e-18
      vertex -0.120741 1 -0.0323524
      vertex -0.123101 1 -0.021706
    endloop
  endfacet
  facet normal 0 1 0
    outer loop
      vertex -0.0957556 1 -0.0803485
      vertex -0.102394 1 -0.0716971
      vertex 0 1 7.65404e-18
    endloop
  endfacet
  facet normal 0 1 0
    outer loop
      vertex -0.102394 1 -0.0716971
      vertex -0.108253 1 -0.0625
      vertex 0 1 7.65404e-18
    endloop
  endfacet
  facet normal 0 1 0
    outer loop
      vertex 0 1 7.65404e-18
      vertex -0.108253 1 -0.0625
      vertex -0.113288 1 -0.0528273
    endloop
  endfacet
  facet normal 0 1 0
    outer loop
      vertex -0.0716971 1 -0.102394
      vertex -0.0803485 1 -0.0957556
      vertex 0 1 7.65404e-18
    endloop
  endfacet
  facet normal 0 1 0
    outer loop
      vertex -0.0803485 1 -0.0957556
      vertex -0.0883883 1 -0.0883883
      vertex 0 1 7.65404e-18
    endloop
  endfacet
  facet normal 0 1 0
    outer loop
      vertex 0 1 7.65404e-18
      vertex -0.0883883 1 -0.0883883
      vertex -0.0957556 1 -0.0803485
    endloop
  endfacet
  facet normal 0 1 0
    outer loop
      vertex -0.0427525 1 -0.117462
      vertex -0.0528273 1 -0.113288
      vertex 0 1 7.65404e-18
    endloop
  endfacet
  facet normal 0 1 0
    outer loop
      vertex -0.0528273 1 -0.113288
      vertex -0.0625 1 -0.108253
      vertex 0 1 7.65404e-18
    endloop
  endfacet
  facet normal 0 1 0
    outer loop
      vertex 0 1 7.65404e-18
      vertex -0.0625 1 -0.108253
      vertex -0.0716971 1 -0.102394
    endloop
  endfacet
  facet normal 0 1 0
    outer loop
      vertex -0.0108945 1 -0.124524
      vertex -0.021706 1 -0.123101
      vertex 0 1 7.65404e-18
    endloop
  endfacet
  facet normal 0 1 0
    outer loop
      vertex -0.021706 1 -0.123101
      vertex -0.0323524 1 -0.120741
      vertex 0 1 7.65404e-18
    endloop
  endfacet
  facet normal 0 1 0
    outer loop
      vertex 0 1 7.65404e-18
      vertex -0.0323524 1 -0.120741
      vertex -0.0427525 1 -0.117462
    endloop
  endfacet
  facet normal 0.0436191 0 0.999048
    outer loop
      vertex 0 1 0.125
      vertex 0.0108945 -1 0.124524
      vertex 0.0108945 1 0.124524
    endloop
  endfacet
  facet normal 0.130527 0 0.991445
    outer loop
      vertex 0.0108945 -1 0.124524
      vertex 0.021706 -1 0.123101
      vertex 0.0108945 1 0.124524
    endloop
  endfacet
  facet normal 0.130527 0 0.991445
    outer loop
      vertex 0.0108945 1 0.124524
      vertex 0.021706 -1 0.123101
      vertex 0.021706 1 0.123101
    endloop
  endfacet
  facet normal 0.21644 0 0.976296
    outer loop
      vertex 0.021706 -1 0.123101
      vertex 0.0323524 -1 0.120741
      vertex 0.021706 1 0.123101
    endloop
  endfacet
  facet normal 0.21644 0 0.976296
    outer loop
      vertex 0.021706 1 0.123101
      vertex 0.0323524 -1 0.120741
      vertex 0.0323524 1 0.120741
    endloop
  endfacet
  facet normal 0.300706 0 0.953717
    outer loop
      vertex 0.0323524 -1 0.120741
      vertex 0.0427525 -1 0.117462
      vertex 0.0323524 1 0.120741
    endloop
  endfacet
  facet normal 0.300706 0 0.953717
    outer loop
      vertex 0.0323524 1 0.120741
      vertex 0.0427525 -1 0.117462
      vertex 0.0427525 1 0.117462
    endloop
  endfacet
  facet normal 0.382683 0 0.92388
    outer loop
      vertex 0.0427525 -1 0.117462
      vertex 0.0528273 -1 0.113288
      vertex 0.0427525 1 0.117462
    endloop
  endfacet
  facet normal 0.382683 0 0.92388
    outer loop
      vertex 0.0427525 1 0.117462
      vertex 0.0528273 -1 0.113288
      vertex 0.0528273 1 0.113288
    endloop
  endfacet
  facet normal 0.461749 0 0.887011
    outer loop
      vertex 0.0528273 -1 0.113288
      vertex 0.0625 -1 0.108253
      vertex 0.0528273 1 0.113288
    endloop
  endfacet
  facet normal 0.461749 0 0.887011
    outer loop
      vertex 0.0528273 1 0.113288
      vertex 0.0625 -1 0.108253
      vertex 0.0625 1 0.108253
    endloop
  endfacet
  facet normal 0.537299 0 0.843392
    outer loop
      vertex 0.0625 -1 0.108253
      vertex 0.0716971 -1 0.102394
      vertex 0.0625 1 0.108253
    endloop
  endfacet
  facet normal 0.537299 0 0.843392
    outer loop
      vertex 0.0625 1 0.108253
      vertex 0.0716971 -1 0.102394
      vertex 0.0716971 1 0.102394
    endloop
  endfacet
  facet normal 0.608761 0 0.793353
    outer loop
      vertex 0.0716971 -1 0.102394
      vertex 0.0803485 -1 0.0957556
      vertex 0.0716971 1 0.102394
    endloop
  endfacet
  facet normal 0.608761 0 0.793353
    outer loop
      vertex 0.0716971 1 0.102394
      vertex 0.0803485 -1 0.0957556
      vertex 0.0803485 1 0.0957556
    endloop
  endfacet
  facet normal 0.67559 0 0.737277
    outer loop
      vertex 0.0803485 -1 0.0957556
      vertex 0.0883883 -1 0.0883883
      vertex 0.0803485 1 0.0957556
    endloop
  endfacet
  facet normal 0.67559 0 0.737277
    outer loop
      vertex 0.0803485 1 0.0957556
      vertex 0.0883883 -1 0.0883883
      vertex 0.0883883 1 0.0883883
    endloop
  endfacet
  facet normal 0.737277 0 0.67559
    outer loop
      vertex 0.0883883 -1 0.0883883
      vertex 0.0957556 -1 0.0803485
      vertex 0.0883883 1 0.0883883
    endloop
  endfacet
  facet normal 0.737277 0 0.67559
    outer loop
      vertex 0.0883883 1 0.0883883
      vertex 0.0957556 -1 0.0803485
      vertex 0.0957556 1 0.0803485
    endloop
  endfacet
  facet normal 0.793353 0 0.608761
    outer loop
      vertex 0.0957556 -1 0.0803485
      vertex 0.102394 -1 0.0716971
      vertex 0.0957556 1 0.0803485
    endloop
  endfacet
  facet normal 0.793353 0 0.608761
    outer loop
      vertex 0.0957556 1 0.0803485
      vertex 0.102394 -1 0.0716971
      vertex 0.102394 1 0.0716971
    endloop
  endfacet
  facet normal 0.843392 0 0.537299
    outer loop
      vertex 0.102394 -1 0.0716971
      vertex 0.108253 -1 0.0625
      vertex 0.102394 1 0.0716971
    endloop
  endfacet
  facet normal 0.843392 0 0.537299
    outer loop
      vertex 0.102394 1 0.0716971
      vertex 0.108253 -1 0.0625
      vertex 0.108253 1 0.0625
    endloop
  endfacet
  facet normal 0.887011 0 0.461749
    outer loop
      vertex 0.108253 -1 0.0625
      vertex 0.113288 -1 0.0528273
      vertex 0.108253 1 0.0625
    endloop
  endfacet
  facet normal 0.887011 0 0.461749
    outer loop
      vertex 0.108253 1 0.0625
      vertex 0.113288 -1 0.0528273
      vertex 0.113288 1 0.0528273
    endloop
  endfacet
  facet normal 0.92388 0 0.382683
    outer loop
      vertex 0.113288 -1 0.0528273
      vertex 0.117462 -1 0.0427525
      vertex 0.113288 1 0.0528273
    endloop
  endfacet
  facet normal 0.92388 0 0.382683
    outer loop
      vertex 0.113288 1 0.0528273
      vertex 0.117462 -1 0.0427525
      vertex 0.117462 1 0.0427525
    endloop
  endfacet
  facet normal 0.953717 0 0.300706
    outer loop
      vertex 0.117462 -1 0.0427525
      vertex 0.120741 -1 0.0323524
      vertex 0.117462 1 0.0427525
    endloop
  endfacet
  facet normal 0.953717 0 0.300706
    outer loop
      vertex 0.117462 1 0.0427525
      vertex 0.120741 -1 0.0323524
      vertex 0.120741 1 0.0323524
    endloop
  endfacet
  facet normal 0.976296 0 0.21644
    outer loop
      vertex 0.120741 -1 0.0323524
      vertex 0.123101 -1 0.021706
      vertex 0.120741 1 0.0323524
    endloop
  endfacet
  facet normal 0.976296 0 0.21644
    outer loop
      vertex 0.120741 1 0.0323524
      vertex 0.123101 -1 0.021706
      vertex 0.123101 1 0.021706
    endloop
  endfacet
  facet normal 0.991445 0 0.130527
    outer loop
      vertex 0.123101 -1 0.021706
      vertex 0.124524 -1 0.0108945
      vertex 0.123101 1 0.021706
    endloop
  endfacet
  facet normal 0.991445 0 0.130527
    outer loop
      vertex 0.123101 1 0.021706
      vertex 0.124524 -1 0.0108945
      vertex 0.124524 1 0.0108945
    endloop
  endfacet
  facet normal 0.999048 0 0.0436191
    outer loop
      vertex 0.124524 -1 0.0108945
      vertex 0.125 -1 4.30637e-17
      vertex 0.124524 1 0.0108945
    endloop
  endfacet
  facet normal 0.999048 0 0.0436191
    outer loop
      vertex 0.124524 1 0.0108945
      vertex 0.125 -1 4.30637e-17
      vertex 0.125 1 4.30637e-17
    endloop
  endfacet
  facet normal 0.999048 0 -0.0436191
    outer loop
      vertex 0.125 -1 4.30637e-17
      vertex 0.124524 -1 -0.0108945
      vertex 0.125 1 4.30637e-17
    endloop
  endfacet
  facet normal 0.999048 0 -0.0436191
    outer loop
      vertex 0.125 1 4.30637e-17
      vertex 0.124524 -1 -0.0108945
      vertex 0.124524 1 -0.0108945
    endloop
  endfacet
  facet normal 0.991445 0 -0.130527
    outer loop
      vertex 0.124524 -1 -0.0108945
      vertex 0.123101 -1 -0.021706
      vertex 0.124524 1 -0.0108945
    endloop
  endfacet
  facet normal 0.991445 0 -0.130527
    outer loop
      vertex 0.124524 1 -0.0108945
      vertex 0.123101 -1 -0.021706
      vertex 0.123101 1 -0.021706
    endloop
  endfacet
  facet normal 0.976296 0 -0.21644
    outer loop
      vertex 0.123101 -1 -0.021706
      vertex 0.120741 -1 -0.0323524
      vertex 0.123101 1 -0.021706
    endloop
  endfacet
  facet normal 0.976296 0 -0.21644
    outer loop
      vertex 0.123101 1 -0.021706
      vertex 0.120741 -1 -0.0323524
      vertex 0.120741 1 -0.0323524
    endloop
  endfacet
  facet normal 0.953717 0 -0.300706
    outer loop
      vertex 0.120741 -1 -0.0323524
      vertex 0.117462 -1 -0.0427525
      vertex 0.120741 1 -0.0323524
    endloop
  endfacet
  facet normal 0.953717 0 -0.300706
    outer loop
      vertex 0.120741 1 -0.0323524
      vertex 0.117462 -1 -0.0427525
      vertex 0.117462 1 -0.0427525
    endloop
  endfacet
  facet normal 0.92388 0 -0.382683
    outer loop
      vertex 0.117462 -1 -0.0427525
      vertex 0.113288 -1 -0.0528273
      vertex 0.117462 1 -0.0427525
    endloop
  endfacet
  facet normal 0.92388 0 -0.382683
    outer loop
      vertex 0.117462 1 -0.0427525
      vertex 0.113288 -1 -0.0528273
      vertex 0.113288 1 -0.0528273
    endloop
  endfacet
  facet normal 0.887011 0 -0.461749
    outer loop
      vertex 0.113288 -1 -0.0528273
      vertex 0.108253 -1 -0.0625
      vertex 0.113288 1 -0.0528273
    endloop
  endfacet
  facet normal 0.887011 0 -0.461749
    outer loop
      vertex 0.113288 1 -0.0528273
      vertex 0.108253 -1 -0.0625
      vertex 0.108253 1 -0.0625
    endloop
  endfacet
  facet normal 0.843392 0 -0.537299
    outer loop
      vertex 0.108253 -1 -0.0625
      vertex 0.102394 -1 -0.0716971
      vertex 0.108253 1 -0.0625
    endloop
  endfacet
  facet normal 0.843392 0 -0.537299
    outer loop
      vertex 0.108253 1 -0.0625
      vertex 0.102394 -1 -0.0716971
      vertex 0.102394 1 -0.0716971
    endloop
  endfacet
  facet normal 0.793353 0 -0.608761
    outer loop
      vertex 0.102394 -1 -0.0716971
      vertex 0.0957556 -1 -0.0803485
      vertex 0.102394 1 -0.0716971
    endloop
  endfacet
  facet normal 0.793353 0 -0.608761
    outer loop
      vertex 0.102394 1 -0.0716971
      vertex 0.0957556 -1 -0.0803485
      vertex 0.0957556 1 -0.0803485
    endloop
  endfacet
  facet normal 0.737277 0 -0.67559
    outer loop
      vertex 0.0957556 -1 -0.0803485
      vertex 0.0883883 -1 -0.0883883
      vertex 0.0957556 1 -0.0803485
    endloop
  endfacet
  facet normal 0.737277 0 -0.67559
    outer loop
      vertex 0.0957556 1 -0.0803485
      vertex 0.0883883 -1 -0.0883883
      vertex 0.0883883 1 -0.0883883
    endloop
  endfacet
  facet normal 0.67559 0 -0.737277
    outer loop
      vertex 0.0883883 -1 -0.0883883
      vertex 0.0803485 -1 -0.0957556
      vertex 0.0883883 1 -0.0883883
    endloop
  endfacet
  facet normal 0.67559 0 -0.737277
    outer loop
      vertex 0.0883883 1 -0.0883883
      vertex 0.0803485 -1 -0.0957556
      vertex 0.0803485 1 -0.0957556
    endloop
  endfacet
  facet normal 0.608761 0 -0.793353
    outer loop
      vertex 0.0803485 -1 -0.0957556
      vertex 0.0716971 -1 -0.102394
      vertex 0.0803485 1 -0.0957556
    endloop
  endfacet
  facet normal 0.608761 0 -0.793353
    outer loop
      vertex 0.0803485 1 -0.0957556
      vertex 0.0716971 -1 -0.102394
      vertex 0.0716971 1 -0.102394
    endloop
  endfacet
  facet normal 0.537299 0 -0.843392
    outer loop
      vertex 0.0716971 -1 -0.102394
      vertex 0.0625 -1 -0.108253
      vertex 0.0716971 1 -0.102394
    endloop
  endfacet
  facet normal 0.537299 0 -0.843392
    outer loop
      vertex 0.0716971 1 -0.102394
      vertex 0.0625 -1 -0.108253
      vertex 0.0625 1 -0.108253
    endloop
  endfacet
  facet normal 0.461749 0 -0.887011
    outer loop
      vertex 0.0625 -1 -0.108253
      vertex 0.0528273 -1 -0.113288
      vertex 0.0625 1 -0.108253
    endloop
  endfacet
  facet normal 0.461749 0 -0.887011
    outer loop
      vertex 0.0625 1 -0.108253
      vertex 0.0528273 -1 -0.113288
      vertex 0.0528273 1 -0.113288
    endloop
  endfacet
  facet normal 0.382683 0 -0.92388
    outer loop
      vertex 0.0528273 -1 -0.113288
      vertex 0.0427525 -1 -0.117462
      vertex 0.0528273 1 -0.113288
    endloop
  endfacet
  facet normal 0.382683 0 -0.92388
    outer loop
      vertex 0.0528273 1 -0.113288
      vertex 0.0427525 -1 -0.117462
      vertex 0.0427525 1 -0.117462
    endloop
  endfacet
  facet normal 0.300706 0 -0.953717
    outer loop
      vertex 0.0427525 -1 -0.117462
      vertex 0.0323524 -1 -0.120741
      vertex 0.0427525 1 -0.117462
    endloop
  endfacet
  facet normal 0.300706 0 -0.953717
    outer loop
      vertex 0.0427525 1 -0.117462
      vertex 0.0323524 -1 -0.120741
      vertex 0.0323524 1 -0.120741
    endloop
  endfacet
  facet normal 0.21644 0 -0.976296
    outer loop
      vertex 0.0323524 -1 -0.120741
      vertex 0.021706 -1 -0.123101
      vertex 0.0323524 1 -0.120741
    endloop
  endfacet
  facet normal 0.21644 0 -0.976296
    outer loop
      vertex 0.0323524 1 -0.120741
      vertex 0.021706 -1 -0.123101
      vertex 0.021706 1 -0.123101
    endloop
  endfacet
  facet normal 0.130527 0 -0.991445
    outer loop
      vertex 0.021706 -1 -0.123101
      vertex 0.0108945 -1 -0.124524
      vertex 0.021706 1 -0.123101
    endloop
  endfacet
  facet normal 0.130527 0 -0.991445
    outer loop
      vertex 0.021706 1 -0.123101
      vertex 0.0108945 -1 -0.124524
      vertex 0.0108945 1 -0.124524
    endloop
  endfacet
  facet normal 0.0436191 0 -0.999048
    outer loop
      vertex 0.0108945 -1 -0.124524
      vertex 4.59243e-17 -1 -0.125
      vertex 0.0108945 1 -0.124524
    endloop
  endfacet
  facet normal 0.0436191 6.21399e-19 -0.999048
    outer loop
      vertex 0.0108945 1 -0.124524
      vertex 4.59243e-17 -1 -0.125
      vertex 1.53081e-17 1 -0.125
    endloop
  endfacet
  facet normal -0.0436191 -6.67725e-19 -0.999048
    outer loop
      vertex 4.59243e-17 -1 -0.125
      vertex -0.0108945 -1 -0.124524
      vertex 1.53081e-17 1 -0.125
    endloop
  endfacet
  facet normal -0.0436191 0 -0.999048
    outer loop
      vertex 1.53081e-17 1 -0.125
      vertex -0.0108945 -1 -0.124524
      vertex -0.0108945 1 -0.124524
    endloop
  endfacet
  facet normal -0.130527 0 -0.991445
    outer loop
      vertex -0.0108945 -1 -0.124524
      vertex -0.021706 -1 -0.123101
      vertex -0.0108945 1 -0.124524
    endloop
  endfacet
  facet normal -0.130527 0 -0.991445
    outer loop
      vertex -0.0108945 1 -0.124524
      vertex -0.021706 -1 -0.123101
      vertex -0.021706 1 -0.123101
    endloop
  endfacet
  facet normal -0.21644 0 -0.976296
    outer loop
      vertex -0.021706 -1 -0.123101
      vertex -0.0323524 -1 -0.120741
      vertex -0.021706 1 -0.123101
    endloop
  endfacet
  facet normal -0.21644 0 -0.976296
    outer loop
      vertex -0.021706 1 -0.123101
      vertex -0.0323524 -1 -0.120741
      vertex -0.0323524 1 -0.120741
    endloop
  endfacet
  facet normal -0.300706 0 -0.953717
    outer loop
      vertex -0.0323524 -1 -0.120741
      vertex -0.0427525 -1 -0.117462
      vertex -0.0323524 1 -0.120741
    endloop
  endfacet
  facet normal -0.300706 0 -0.953717
    outer loop
      vertex -0.0323524 1 -0.120741
      vertex -0.0427525 -1 -0.117462
      vertex -0.0427525 1 -0.117462
    endloop
  endfacet
  facet normal -0.382683 0 -0.92388
    outer loop
      vertex -0.0427525 -1 -0.117462
      vertex -0.0528273 -1 -0.113288
      vertex -0.0427525 1 -0.117462
    endloop
  endfacet
  facet normal -0.382683 0 -0.92388
    outer loop
      vertex -0.0427525 1 -0.117462
      vertex -0.0528273 -1 -0.113288
      vertex -0.0528273 1 -0.113288
    endloop
  endfacet
  facet normal -0.461749 0 -0.887011
    outer loop
      vertex -0.0528273 -1 -0.113288
      vertex -0.0625 -1 -0.108253
      vertex -0.0528273 1 -0.113288
    endloop
  endfacet
  facet normal -0.461749 0 -0.887011
    outer loop
      vertex -0.0528273 1 -0.113288
      vertex -0.0625 -1 -0.108253
      vertex -0.0625 1 -0.108253
    endloop
  endfacet
  facet normal -0.537299 0 -0.843392
    outer loop
      vertex -0.0625 -1 -0.108253
      vertex -0.0716971 -1 -0.102394
      vertex -0.0625 1 -0.108253
    endloop
  endfacet
  facet normal -0.537299 0 -0.843392
    outer loop
      vertex -0.0625 1 -0.108253
      vertex -0.0716971 -1 -0.102394
      vertex -0.0716971 1 -0.102394
    endloop
  endfacet
  facet normal -0.608761 0 -0.793353
    outer loop
      vertex -0.0716971 -1 -0.102394
      vertex -0.0803485 -1 -0.0957556
      vertex -0.0716971 1 -0.102394
    endloop
  endfacet
  facet normal -0.608761 0 -0.793353
    outer loop
      vertex -0.0716971 1 -0.102394
      vertex -0.0803485 -1 -0.0957556
      vertex -0.0803485 1 -0.0957556
    endloop
  endfacet
  facet normal -0.67559 0 -0.737277
    outer loop
      vertex -0.0803485 -1 -0.0957556
      vertex -0.0883883 -1 -0.0883883
      vertex -0.0803485 1 -0.0957556
    endloop
  endfacet
  facet normal -0.67559 0 -0.737277
    outer loop
      vertex -0.0803485 1 -0.0957556
      vertex -0.0883883 -1 -0.0883883
      vertex -0.0883883 1 -0.0883883
    endloop
  endfacet
  facet normal -0.737277 0 -0.67559
    outer loop
      vertex -0.0883883 -1 -0.0883883
      vertex -0.0957556 -1 -0.0803485
      vertex -0.0883883 1 -0.0883883
    endloop
  endfacet
  facet normal -0.737277 0 -0.67559
    outer loop
      vertex -0.0883883 1 -0.0883883
      vertex -0.0957556 -1 -0.0803485
      vertex -0.0957556 1 -0.0803485
    endloop
  endfacet
  facet normal -0.793353 0 -0.608761
    outer loop
      vertex -0.0957556 -1 -0.0803485
      vertex -0.102394 -1 -0.0716971
      vertex -0.0957556 1 -0.0803485
    endloop
  endfacet
  facet normal -0.793353 0 -0.608761
    outer loop
      vertex -0.0957556 1 -0.0803485
      vertex -0.102394 -1 -0.0716971
      vertex -0.102394 1 -0.0716971
    endloop
  endfacet
  facet normal -0.843392 0 -0.537299
    outer loop
      vertex -0.102394 -1 -0.0716971
      vertex -0.108253 -1 -0.0625
      vertex -0.102394 1 -0.0716971
    endloop
  endfacet
  facet normal -0.843392 0 -0.537299
    outer loop
      vertex -0.102394 1 -0.0716971
      vertex -0.108253 -1 -0.0625
      vertex -0.108253 1 -0.0625
    endloop
  endfacet
  facet normal -0.887011 0 -0.461749
    outer loop
      vertex -0.108253 -1 -0.0625
      vertex -0.113288 -1 -0.0528273
      vertex -0.108253 1 -0.0625
    endloop
  endfacet
  facet normal -0.887011 0 -0.461749
    outer loop
      vertex -0.108253 1 -0.0625
      vertex -0.113288 -1 -0.0528273
      vertex -0.113288 1 -0.0528273
    endloop
  endfacet
  facet normal -0.92388 0 -0.382683
    outer loop
      vertex -0.113288 -1 -0.0528273
      vertex -0.117462 -1 -0.0427525
      vertex -0.113288 1 -0.0528273
    endloop
  endfacet
  facet normal -0.92388 0 -0.382683
    outer loop
      vertex -0.113288 1 -0.0528273
      vertex -0.117462 -1 -0.0427525
      vertex -0.117462 1 -0.0427525
    endloop
  endfacet
  facet normal -0.953717 0 -0.300706
    outer loop
      vertex -0.117462 -1 -0.0427525
      vertex -0.120741 -1 -0.0323524
      vertex -0.117462 1 -0.0427525
    endloop
  endfacet
  facet normal -0.953717 0 -0.300706
    outer loop
      vertex -0.117462 1 -0.0427525
      vertex -0.120741 -1 -0.0323524
      vertex -0.120741 1 -0.0323524
    endloop
  endfacet
  facet normal -0.976296 0 -0.21644
    outer loop
      vertex -0.120741 -1 -0.0323524
      vertex -0.123101 -1 -0.021706
      vertex -0.120741 1 -0.0323524
    endloop
  endfacet
  facet normal -0.976296 0 -0.21644
    outer loop
      vertex -0.120741 1 -0.0323524
      vertex -0.123101 -1 -0.021706
      vertex -0.123101 1 -0.021706
    endloop
  endfacet
  facet normal -0.991445 0 -0.130527
    outer loop
      vertex -0.123101 -1 -0.021706
      vertex -0.124524 -1 -0.0108945
      vertex -0.123101 1 -0.021706
    endloop
  endfacet
  facet normal -0.991445 0 -0.130527
    outer loop
      vertex -0.123101 1 -0.021706
      vertex -0.124524 -1 -0.0108945
      vertex -0.124524 1 -0.0108945
    endloop
  endfacet
  facet normal -0.999048 0 -0.0436191
    outer loop
      vertex -0.124524 -1 -0.0108945
      vertex -0.125 -1 -1.2633e-16
      vertex -0.124524 1 -0.0108945
    endloop
  endfacet
  facet normal -0.999048 0 -0.0436191
    outer loop
      vertex -0.124524 1 -0.0108945
      vertex -0.125 -1 -1.2633e-16
      vertex -0.125 1 -1.2633e-16
    endloop
  endfacet
  facet normal -0.999048 0 0.0436191
    outer loop
      vertex -0.125 -1 -1.2633e-16
      vertex -0.124524 -1 0.0108945
      vertex -0.125 1 -1.2633e-16
    endloop
  endfacet
  facet normal -0.999048 0 0.0436191
    outer loop
      vertex -0.125 1 -1.2633e-16
      vertex -0.124524 -1 0.0108945
      vertex -0.124524 1 0.0108945
    endloop
  endfacet
  facet normal -0.991445 0 0.130527
    outer loop
      vertex -0.124524 -1 0.0108945
      vertex -0.123101 -1 0.021706
      vertex -0.124524 1 0.0108945
    endloop
  endfacet
  facet normal -0.991445 0 0.130527
    outer loop
      vertex -0.124524 1 0.0108945
      vertex -0.123101 -1 0.021706
      vertex -0.123101 1 0.021706
    endloop
  endfacet
  facet normal -0.976296 0 0.21644
    outer loop
      vertex -0.123101 -1 0.021706
      vertex -0.120741 -1 0.0323524
      vertex -0.123101 1 0.021706
    endloop
  endfacet
  facet normal -0.976296 0 0.21644
    outer loop
      vertex -0.123101 1 0.021706
      vertex -0.120741 -1 0.0323524
      vertex -0.120741 1 0.0323524
    endloop
  endfacet
  facet normal -0.953717 0 0.300706
    outer loop
      vertex -0.120741 -1 0.0323524
      vertex -0.117462 -1 0.0427525
      vertex -0.120741 1 0.0323524
    endloop
  endfacet
  facet normal -0.953717 0 0.300706
    outer loop
      vertex -0.120741 1 0.0323524
      vertex -0.117462 -1 0.0427525
      vertex -0.117462 1 0.0427525
    endloop
  endfacet
  facet normal -0.92388 0 0.382683
    outer loop
      vertex -0.117462 -1 0.0427525
      vertex -0.113288 -1 0.0528273
      vertex -0.117462 1 0.0427525
    endloop
  endfacet
  facet normal -0.92388 0 0.382683
    outer loop
      vertex -0.117462 1 0.0427525
      vertex -0.113288 -1 0.0528273
      vertex -0.113288 1 0.0528273
    endloop
  endfacet
  facet normal -0.887011 0 0.461749
    outer loop
      vertex -0.113288 -1 0.0528273
      vertex -0.108253 -1 0.0625
      vertex -0.113288 1 0.0528273
    endloop
  endfacet
  facet normal -0.887011 0 0.461749
    outer loop
      vertex -0.113288 1 0.0528273
      vertex -0.108253 -1 0.0625
      vertex -0.108253 1 0.0625
    endloop
  endfacet
  facet normal -0.843392 0 0.537299
    outer loop
      vertex -0.108253 -1 0.0625
      vertex -0.102394 -1 0.0716971
      vertex -0.108253 1 0.0625
    endloop
  endfacet
  facet normal -0.843392 0 0.537299
    outer loop
      vertex -0.108253 1 0.0625
      vertex -0.102394 -1 0.0716971
      vertex -0.102394 1 0.0716971
    endloop
  endfacet
  facet normal -0.793353 0 0.608761
    outer loop
      vertex -0.102394 -1 0.0716971
      vertex -0.0957556 -1 0.0803485
      vertex -0.102394 1 0.0716971
    endloop
  endfacet
  facet normal -0.793353 0 0.608761
    outer loop
      vertex -0.102394 1 0.0716971
      vertex -0.0957556 -1 0.0803485
      vertex -0.0957556 1 0.0803485
    endloop
  endfacet
  facet normal -0.737277 0 0.67559
    outer loop
      vertex -0.0957556 -1 0.0803485
      vertex -0.0883883 -1 0.0883883
      vertex -0.0957556 1 0.0803485
    endloop
  endfacet
  facet normal -0.737277 0 0.67559
    outer loop
      vertex -0.0957556 1 0.0803485
      vertex -0.0883883 -1 0.0883883
      vertex -0.0883883 1 0.0883883
    endloop
  endfacet
  facet normal -0.67559 0 0.737277
    outer loop
      vertex -0.0883883 -1 0.0883883
      vertex -0.0803485 -1 0.0957556
      vertex -0.0883883 1 0.0883883
    endloop
  endfacet
  facet normal -0.67559 0 0.737277
    outer loop
      vertex -0.0883883 1 0.0883883
      vertex -0.0803485 -1 0.0957556
      vertex -0.0803485 1 0.0957556
    endloop
  endfacet
  facet normal -0.608761 0 0.793353
    outer loop
      vertex -0.0803485 -1 0.0957556
      vertex -0.0716971 -1 0.102394
      vertex -0.0803485 1 0.0957556
    endloop
  endfacet
  facet normal -0.608761 0 0.793353
    outer loop
      vertex -0.0803485 1 0.0957556
      vertex -0.0716971 -1 0.102394
      vertex -0.0716971 1 0.102394
    endloop
  endfacet
  facet normal -0.537299 0 0.843392
    outer loop
      vertex -0.0716971 -1 0.102394
      vertex -0.0625 -1 0.108253
      vertex -0.0716971 1 0.102394
    endloop
  endfacet
  facet normal -0.537299 0 0.843392
    outer loop
      vertex -0.0716971 1 0.102394
      vertex -0.0625 -1 0.108253
      vertex -0.0625 1 0.108253
    endloop
  endfacet
  facet normal -0.461749 0 0.887011
    outer loop
      vertex -0.0625 -1 0.108253
      vertex -0.0528273 -1 0.113288
      vertex -0.0625 1 0.108253
    endloop
  endfacet
  facet normal -0.461749 0 0.887011
    outer loop
      vertex -0.0625 1 0.108253
      vertex -0.0528273 -1 0.113288
      vertex -0.0528273 1 0.113288
    endloop
  endfacet
  facet normal -0.382683 0 0.92388
    outer loop
      vertex -0.0528273 -1 0.113288
      vertex -0.0427525 -1 0.117462
      vertex -0.0528273 1 0.113288
    endloop
  endfacet
  facet normal -0.382683 0 0.92388
    outer loop
      vertex -0.0528273 1 0.113288
      vertex -0.0427525 -1 0.117462
      vertex -0.0427525 1 0.117462
    endloop
  endfacet
  facet normal -0.300706 0 0.953717
    outer loop
      vertex -0.0427525 -1 0.117462
      vertex -0.0323524 -1 0.120741
      vertex -0.0427525 1 0.117462
    endloop
  endfacet
  facet normal -0.300706 0 0.953717
    outer loop
      vertex -0.0427525 1 0.117462
      vertex -0.0323524 -1 0.120741
      vertex -0.0323524 1 0.120741
    endloop
  endfacet
  facet normal -0.21644 0 0.976296
    outer loop
      vertex -0.0323524 -1 0.120741
      vertex -0.021706 -1 0.123101
      vertex -0.0323524 1 0.120741
    endloop
  endfacet
  facet normal -0.21644 0 0.976296
    outer loop
      vertex -0.0323524 1 0.120741
      vertex -0.021706 -1 0.123101
      vertex -0.021706 1 0.123101
    endloop
  endfacet
  facet normal -0.130527 0 0.991445
    outer loop
      vertex -0.021706 -1 0.123101
      vertex -0.0108945 -1 0.124524
      vertex -0.021706 1 0.123101
    endloop
  endfacet
  facet normal -0.130527 0 0.991445
    outer loop
      vertex -0.021706 1 0.123101
      vertex -0.0108945 -1 0.124524
      vertex -0.0108945 1 0.124524
    endloop
  endfacet
  facet normal -0.0436191 0 0.999048
    outer loop
      vertex -0.0108945 -1 0.124524
      vertex 0 -1 0.125
      vertex -0.0108945 1 0.124524
    endloop
  endfacet
  facet normal -0.0436191 0 0.999048
    outer loop
      vertex -0.0108945 1 0.124524
      vertex 0 -1 0.125
      vertex 0 1 0.125
    endloop
  endfacet
  facet normal 0.0436191 0 0.999048
    outer loop
      vertex 0 -1 0.125
      vertex 0.0108945 -1 0.124524
      vertex 0 1 0.125
    endloop
  endfacet
  facet normal 0 -1 0
    outer loop
      vertex -0.021706 -1 -0.123101
      vertex -0.0108945 -1 -0.124524
      vertex 0 -1 7.65404e-18
    endloop
  endfacet
  facet normal 0 -1 0
    outer loop
      vertex -0.0108945 -1 -0.124524
      vertex 4.59243e-17 -1 -0.125
      vertex 0 -1 7.65404e-18
    endloop
  endfacet
  facet normal 0 -1 0
    outer loop
      vertex 0 -1 7.65404e-18
      vertex 4.59243e-17 -1 -0.125
      vertex 0.0108945 -1 -0.124524
    endloop
  endfacet
  facet normal 0 -1 0
    outer loop
      vertex -0.0528273 -1 -0.113288
      vertex -0.0427525 -1 -0.117462
      vertex 0 -1 7.65404e-18
    endloop
  endfacet
  facet normal 0 -1 0
    outer loop
      vertex -0.0427525 -1 -0.117462
      vertex -0.0323524 -1 -0.120741
      vertex 0 -1 7.65404e-18
    endloop
  endfacet
  facet normal 0 -1 0
    outer loop
      vertex 0 -1 7.65404e-18
      vertex -0.0323524 -1 -0.120741
      vertex -0.021706 -1 -0.123101
    endloop
  endfacet
  facet normal 0 -1 0
    outer loop
      vertex -0.0803485 -1 -0.0957556
      vertex -0.0716971 -1 -0.102394
      vertex 0 -1 7.65404e-18
    endloop
  endfacet
  facet normal 0 -1 0
    outer loop
      vertex -0.0716971 -1 -0.102394
      vertex -0.0625 -1 -0.108253
      vertex 0 -1 7.65404e-18
    endloop
  endfacet
  facet normal 0 -1 0
    outer loop
      vertex 0 -1 7.65404e-18
      vertex -0.0625 -1 -0.108253
      vertex -0.0528273 -1 -0.113288
    endloop
  endfacet
  facet normal 0 -1 0
    outer loop
      vertex -0.102394 -1 -0.0716971
      vertex -0.0957556 -1 -0.0803485
      vertex 0 -1 7.65404e-18
    endloop
  endfacet
  facet normal 0 -1 0
    outer loop
      vertex -0.0957556 -1 -0.0803485
      vertex -0.0883883 -1 -0.0883883
      vertex 0 -1 7.65404e-18
    endloop
  endfacet
  facet normal 0 -1 0
    outer loop
      vertex 0 -1 7.65404e-18
      vertex -0.0883883 -1 -0.0883883
      vertex -0.0803485 -1 -0.0957556
    endloop
  endfacet
  facet normal 0 -1 0
    outer loop
      vertex -0.117462 -1 -0.0427525
      vertex -0.113288 -1 -0.0528273
      vertex 0 -1 7.65404e-18
    endloop
  endfacet
  facet normal 0 -1 0
    outer loop
      vertex -0.113288 -1 -0.0528273
      vertex -0.108253 -1 -0.0625
      vertex 0 -1 7.65404e-18
    endloop
  endfacet
  facet normal 0 -1 0
    outer loop
      vertex 0 -1 7.65404e-18
      vertex -0.108253 -1 -0.0625
      vertex -0.102394 -1 -0.0716971
    endloop
  endfacet
  facet normal 0 -1 0
    outer loop
      vertex -0.124524 -1 -0.0108945
      vertex -0.123101 -1 -0.021706
      vertex 0 -1 7.65404e-18
    endloop
  endfacet
  facet normal 0 -1 0
    outer loop
      vertex -0.123101 -1 -0.021706
      vertex -0.120741 -1 -0.0323524
      vertex 0 -1 7.65404e-18
    endloop
  endfacet
  facet normal 0 -1 0
    outer loop
      vertex 0 -1 7.65404e-18
      vertex -0.120741 -1 -0.0323524
      vertex -0.117462 -1 -0.0427525
    endloop
  endfacet
  facet normal 0 -1 0
    outer loop
      vertex -0.123101 -1 0.021706
      vertex -0.124524 -1 0.0108945
      vertex 0 -1 7.65404e-18
    endloop
  endfacet
  facet normal 0 -1 0
    outer loop
      vertex -0.124524 -1 0.0108945
      vertex -0.125 -1 -1.2633e-16
      vertex 0 -1 7.65404e-18
    endloop
  endfacet
  facet normal 0 -1 0
    outer loop
      vertex 0 -1 7.65404e-18
      vertex -0.125 -1 -1.2633e-16
      vertex -0.124524 -1 -0.0108945
    endloop
  endfacet
  facet normal 0 -1 0
    outer loop
      vertex -0.113288 -1 0.0528273
      vertex -0.117462 -1 0.0427525
      vertex 0 -1 7.65404e-18
    endloop
  endfacet
  facet normal 0 -1 0
    outer loop
      vertex -0.117462 -1 0.0427525
      vertex -0.120741 -1 0.0323524
      vertex 0 -1 7.65404e-18
    endloop
  endfacet
  facet normal 0 -1 0
    outer loop
      vertex 0 -1 7.65404e-18
      vertex -0.120741 -1 0.0323524
      vertex -0.123101 -1 0.021706
    endloop
  endfacet
  facet normal 0 -1 0
    outer loop
      vertex -0.0957556 -1 0.0803485
      vertex -0.102394 -1 0.0716971
      vertex 0 -1 7.65404e-18
    endloop
  endfacet
  facet normal 0 -1 0
    outer loop
      vertex -0.102394 -1 0.0716971
      vertex -0.108253 -1 0.0625
      vertex 0 -1 7.65404e-18
    endloop
  endfacet
  facet normal 0 -1 0
    outer loop
      vertex 0 -1 7.65404e-18
      vertex -0.108253 -1 0.0625
      vertex -0.113288 -1 0.0528273
    endloop
  endfacet
  facet normal 0 -1 0
    outer loop
      vertex -0.0716971 -1 0.102394
      vertex -0.0803485 -1 0.0957556
      vertex 0 -1 7.65404e-18
    endloop
  endfacet
  facet normal 0 -1 0
    outer loop
      vertex -0.0803485 -1 0.0957556
      vertex -0.0883883 -1 0.0883883
      vertex 0 -1 7.65404e-18
    endloop
  endfacet
  facet normal 0 -1 0
    outer loop
      vertex 0 -1 7.65404e-18
      vertex -0.0883883 -1 0.0883883
      vertex -0.0957556 -1 0.0803485
    endloop
  endfacet
  facet normal 0 -1 0
    outer loop
      vertex -0.0427525 -1 0.117462
      vertex -0.0528273 -1 0.113288
      vertex 0 -1 7.65404e-18
    endloop
  endfacet
  facet normal 0 -1 0
    outer loop
      vertex -0.0528273 -1 0.113288
      vertex -0.0625 -1 0.108253
      vertex 0 -1 7.65404e-18
    endloop
  endfacet
  facet normal 0 -1 0
    outer loop
      vertex 0 -1 7.65404e-18
      vertex -0.0625 -1 0.108253
      vertex -0.0716971 -1 0.102394
    endloop
  endfacet
  facet normal 0 -1 0
    outer loop
      vertex -0.0108945 -1 0.124524
      vertex -0.021706 -1 0.123101
      vertex 0 -1 7.65404e-18
    endloop
  endfacet
  facet normal 0 -1 0
    outer loop
      vertex -0.021706 -1 0.123101
      vertex -0.0323524 -1 0.120741
      vertex 0 -1 7.65404e-18
    endloop
  endfacet
  facet normal 0 -1 0
    outer loop
      vertex 0 -1 7.65404e-18
      vertex -0.0323524 -1 0.120741
      vertex -0.0427525 -1 0.117462
    endloop
  endfacet
  facet normal 0 -1 0
    outer loop
      vertex 0.021706 -1 0.123101
      vertex 0.0108945 -1 0.124524
      vertex 0 -1 7.65404e-18
    endloop
  endfacet
  facet normal 0 -1 0
    outer loop
      vertex 0.0108945 -1 0.124524
      vertex 0 -1 0.125
      vertex 0 -1 7.65404e-18
    endloop
  endfacet
  facet normal 0 -1 0
    outer loop
      vertex 0 -1 7.65404e-18
      vertex 0 -1 0.125
      vertex -0.0108945 -1 0.124524
    endloop
  endfacet
  facet normal 0 -1 0
    outer loop
      vertex 0.0528273 -1 0.113288
      vertex 0.0427525 -1 0.117462
      vertex 0 -1 7.65404e-18
    endloop
  endfacet
  facet normal 0 -1 0
    outer loop
      vertex 0.0427525 -1 0.117462
      vertex 0.0323524 -1 0.120741
      vertex 0 -1 7.65404e-18
    endloop
  endfacet
  facet normal 0 -1 0
    outer loop
      vertex 0 -1 7.65404e-18
      vertex 0.0323524 -1 0.120741
      vertex 0.021706 -1 0.123101
    endloop
  endfacet
  facet normal 0 -1 0
    outer loop
      vertex 0.0803485 -1 0.0957556
      vertex 0.0716971 -1 0.102394
      vertex 0 -1 7.65404e-18
    endloop
  endfacet
  facet normal 0 -1 0
    outer loop
      vertex 0.0716971 -1 0.102394
      vertex 0.0625 -1 0.108253
      vertex 0 -1 7.65404e-18
    endloop
  endfacet
  facet normal 0 -1 0
    outer loop
      vertex 0 -1 7.65404e-18
      vertex 0.0625 -1 0.108253
      vertex 0.0528273 -1 0.113288
    endloop
  endfacet
  facet normal 0 -1 0
    outer loop
      vertex 0.102394 -1 0.0716971
      vertex 0.0957556 -1 0.0803485
      vertex 0 -1 7.65404e-18
    endloop
  endfacet
  facet normal 0 -1 0
    outer loop
      vertex 0.0957556 -1 0.0803485
      vertex 0.0883883 -1 0.0883883
      vertex 0 -1 7.65404e-18
    endloop
  endfacet
  facet normal 0 -1 0
    outer loop
      vertex 0 -1 7.65404e-18
      vertex 0.0883883 -1 0.0883883
      vertex 0.0803485 -1 0.0957556
    endloop
  endfacet
  facet normal 0 -1 0
    outer loop
      vertex 0.117462 -1 0.0427525
      vertex 0.113288 -1 0.0528273
      vertex 0 -1 7.65404e-18
    endloop
  endfacet
  facet normal 0 -1 0
    outer loop
      vertex 0.113288 -1 0.0528273
      vertex 0.108253 -1 0.0625
      vertex 0 -1 7.65404e-18
    endloop
  endfacet
  facet normal 0 -1 0
    outer loop
      vertex 0 -1 7.65404e-18
      vertex 0.108253 -1 0.0625
      vertex 0.102394 -1 0.0716971
    endloop
  endfacet
  facet normal 0 -1 0
    outer loop
      vertex 0.124524 -1 0.0108945
      vertex 0.123101 -1 0.021706
      vertex 0 -1 7.65404e-18
    endloop
  endfacet
  facet normal 0 -1 0
    outer loop
      vertex 0.123101 -1 0.021706
      vertex 0.120741 -1 0.0323524
      vertex 0 -1 7.65404e-18
    endloop
  endfacet
  facet normal 0 -1 0
    outer loop
      vertex 0 -1 7.65404e-18
      vertex 0.120741 -1 0.0323524
      vertex 0.117462 -1 0.0427525
    endloop
  endfacet
  facet normal 0 -1 0
    outer loop
      vertex 0.123101 -1 -0.021706
      vertex 0.124524 -1 -0.0108945
      vertex 0 -1 7.65404e-18
    endloop
  endfacet
  facet normal 0 -1 0
    outer loop
      vertex 0.124524 -1 -0.0108945
      vertex 0.125 -1 4.30637e-17
      vertex 0 -1 7.65404e-18
    endloop
  endfacet
  facet normal 0 -1 0
    outer loop
      vertex 0 -1 7.65404e-18
      vertex 0.125 -1 4.30637e-17
      vertex 0.124524 -1 0.0108945
    endloop
  endfacet
  facet normal 0 -1 0
    outer loop
      vertex 0.113288 -1 -0.0528273
      vertex 0.117462 -1 -0.0427525
      vertex 0 -1 7.65404e-18
    endloop
  endfacet
  facet normal 0 -1 0
    outer loop
      vertex 0.117462 -1 -0.0427525
      vertex 0.120741 -1 -0.0323524
      vertex 0 -1 7.65404e-18
    endloop
  endfacet
  facet normal 0 -1 0
    outer loop
      vertex 0 -1 7.65404e-18
      vertex 0.120741 -1 -0.0323524
      vertex 0.123101 -1 -0.021706
    endloop
  endfacet
  facet normal 0 -1 0
    outer loop
      vertex 0.0957556 -1 -0.0803485
      vertex 0.102394 -1 -0.0716971
      vertex 0 -1 7.65404e-18
    endloop
  endfacet
  facet normal 0 -1 0
    outer loop
      vertex 0.102394 -1 -0.0716971
      vertex 0.108253 -1 -0.0625
      vertex 0 -1 7.65404e-18
    endloop
  endfacet
  facet normal 0 -1 0
    outer loop
      vertex 0 -1 7.65404e-18
      vertex 0.108253 -1 -0.0625
      vertex 0.113288 -1 -0.0528273
    endloop
  endfacet
  facet normal 0 -1 0
    outer loop
      vertex 0.0716971 -1 -0.102394
      vertex 0.0803485 -1 -0.0957556
      vertex 0 -1 7.65404e-18
    endloop
  endfacet
  facet normal 0 -1 0
    outer loop
      vertex 0.0803485 -1 -0.0957556
      vertex 0.0883883 -1 -0.0883883
      vertex 0 -1 7.65404e-18
    endloop
  endfacet
  facet normal 0 -1 0
    outer loop
      vertex 0 -1 7.65404e-18
      vertex 0.0883883 -1 -0.0883883
      vertex 0.0957556 -1 -0.0803485
    endloop
  endfacet
  facet normal 0 -1 0
    outer loop
      vertex 0.0427525 -1 -0.117462
      vertex 0.0528273 -1 -0.113288
      vertex 0 -1 7.65404e-18
    endloop
  endfacet
  facet normal 0 -1 0
    outer loop
      vertex 0.0528273 -1 -0.113288
      vertex 0.0625 -1 -0.108253
      vertex 0 -1 7.65404e-18
    endloop
  endfacet
  facet normal 0 -1 0
    outer loop
      vertex 0 -1 7.65404e-18
      vertex 0.0625 -1 -0.108253
      vertex 0.0716971 -1 -0.102394
    endloop
  endfacet
  facet normal 0 -1 0
    outer loop
      vertex 0.0108945 -1 -0.124524
      vertex 0.021706 -1 -0.123101
      vertex 0 -1 7.65404e-18
    endloop
  endfacet
  facet normal 0 -1 0
    outer loop
      vertex 0.021706 -1 -0.123101
      vertex 0.0323524 -1 -0.120741
      vertex 0 -1 7.65404e-18
    endloop
  endfacet
  facet normal 0 -1 0
    outer loop
      vertex 0 -1 7.65404e-18
      vertex 0.0323524 -1 -0.120741
      vertex 0.0427525 -1 -0.117462
    endloop
  endfacet
endsolid Onshape
