solid Onshape
  facet normal 0 0 -1
    outer loop
      vertex 0.123101 0.021706 -1
      vertex 0.124524 0.0108945 -1
      vertex -4.16334e-17 -4.85723e-17 -1
    endloop
  endfacet
  facet normal 0 0 -1
    outer loop
      vertex 0.124524 0.0108945 -1
      vertex 0.125 -3.32642e-17 -1
      vertex -4.16334e-17 -4.85723e-17 -1
    endloop
  endfacet
  facet normal 0 0 -1
    outer loop
      vertex -4.16334e-17 -4.85723e-17 -1
      vertex 0.125 -3.32642e-17 -1
      vertex 0.124524 -0.0108945 -1
    endloop
  endfacet
  facet normal 0 0 -1
    outer loop
      vertex 0.113288 0.0528273 -1
      vertex 0.117462 0.0427525 -1
      vertex -4.16334e-17 -4.85723e-17 -1
    endloop
  endfacet
  facet normal 0 0 -1
    outer loop
      vertex 0.117462 0.0427525 -1
      vertex 0.120741 0.0323524 -1
      vertex -4.16334e-17 -4.85723e-17 -1
    endloop
  endfacet
  facet normal 0 0 -1
    outer loop
      vertex -4.16334e-17 -4.85723e-17 -1
      vertex 0.120741 0.0323524 -1
      vertex 0.123101 0.021706 -1
    endloop
  endfacet
  facet normal 0 0 -1
    outer loop
      vertex 0.0957556 0.0803485 -1
      vertex 0.102394 0.0716971 -1
      vertex -4.16334e-17 -4.85723e-17 -1
    endloop
  endfacet
  facet normal 0 0 -1
    outer loop
      vertex 0.102394 0.0716971 -1
      vertex 0.108253 0.0625 -1
      vertex -4.16334e-17 -4.85723e-17 -1
    endloop
  endfacet
  facet normal 0 0 -1
    outer loop
      vertex -4.16334e-17 -4.85723e-17 -1
      vertex 0.108253 0.0625 -1
      vertex 0.113288 0.0528273 -1
    endloop
  endfacet
  facet normal 0 0 -1
    outer loop
      vertex 0.0716971 0.102394 -1
      vertex 0.0803485 0.0957556 -1
      vertex -4.16334e-17 -4.85723e-17 -1
    endloop
  endfacet
  facet normal 0 0 -1
    outer loop
      vertex 0.0803485 0.0957556 -1
      vertex 0.0883883 0.0883883 -1
      vertex -4.16334e-17 -4.85723e-17 -1
    endloop
  endfacet
  facet normal 0 0 -1
    outer loop
      vertex -4.16334e-17 -4.85723e-17 -1
      vertex 0.0883883 0.0883883 -1
      vertex 0.0957556 0.0803485 -1
    endloop
  endfacet
  facet normal 0 0 -1
    outer loop
      vertex 0.0427525 0.117462 -1
      vertex 0.0528273 0.113288 -1
      vertex -4.16334e-17 -4.85723e-17 -1
    endloop
  endfacet
  facet normal 0 0 -1
    outer loop
      vertex 0.0528273 0.113288 -1
      vertex 0.0625 0.108253 -1
      vertex -4.16334e-17 -4.85723e-17 -1
    endloop
  endfacet
  facet normal 0 0 -1
    outer loop
      vertex -4.16334e-17 -4.85723e-17 -1
      vertex 0.0625 0.108253 -1
      vertex 0.0716971 0.102394 -1
    endloop
  endfacet
  facet normal 0 0 -1
    outer loop
      vertex 0.0108945 0.124524 -1
      vertex 0.021706 0.123101 -1
      vertex -4.16334e-17 -4.85723e-17 -1
    endloop
  endfacet
  facet normal 0 0 -1
    outer loop
      vertex 0.021706 0.123101 -1
      vertex 0.0323524 0.120741 -1
      vertex -4.16334e-17 -4.85723e-17 -1
    endloop
  endfacet
  facet normal 0 0 -1
    outer loop
      vertex -4.16334e-17 -4.85723e-17 -1
      vertex 0.0323524 0.120741 -1
      vertex 0.0427525 0.117462 -1
    endloop
  endfacet
  facet normal 0 0 -1
    outer loop
      vertex -0.021706 0.123101 -1
      vertex -0.0108945 0.124524 -1
      vertex -4.16334e-17 -4.85723e-17 -1
    endloop
  endfacet
  facet normal 0 0 -1
    outer loop
      vertex -0.0108945 0.124524 -1
      vertex -7.7043e-17 0.125 -1
      vertex -4.16334e-17 -4.85723e-17 -1
    endloop
  endfacet
  facet normal 0 0 -1
    outer loop
      vertex -4.16334e-17 -4.85723e-17 -1
      vertex -7.7043e-17 0.125 -1
      vertex 0.0108945 0.124524 -1
    endloop
  endfacet
  facet normal 0 0 -1
    outer loop
      vertex -0.0528273 0.113288 -1
      vertex -0.0427525 0.117462 -1
      vertex -4.16334e-17 -4.85723e-17 -1
    endloop
  endfacet
  facet normal 0 0 -1
    outer loop
      vertex -0.0427525 0.117462 -1
      vertex -0.0323524 0.120741 -1
      vertex -4.16334e-17 -4.85723e-17 -1
    endloop
  endfacet
  facet normal 0 0 -1
    outer loop
      vertex -4.16334e-17 -4.85723e-17 -1
      vertex -0.0323524 0.120741 -1
      vertex -0.021706 0.123101 -1
    endloop
  endfacet
  facet normal 0 0 -1
    outer loop
      vertex -0.0803485 0.0957556 -1
      vertex -0.0716971 0.102394 -1
      vertex -4.16334e-17 -4.85723e-17 -1
    endloop
  endfacet
  facet normal 0 0 -1
    outer loop
      vertex -0.0716971 0.102394 -1
      vertex -0.0625 0.108253 -1
      vertex -4.16334e-17 -4.85723e-17 -1
    endloop
  endfacet
  facet normal 0 0 -1
    outer loop
      vertex -4.16334e-17 -4.85723e-17 -1
      vertex -0.0625 0.108253 -1
      vertex -0.0528273 0.113288 -1
    endloop
  endfacet
  facet normal 0 0 -1
    outer loop
      vertex -0.102394 0.0716971 -1
      vertex -0.0957556 0.0803485 -1
      vertex -4.16334e-17 -4.85723e-17 -1
    endloop
  endfacet
  facet normal 0 0 -1
    outer loop
      vertex -0.0957556 0.0803485 -1
      vertex -0.0883883 0.0883883 -1
      vertex -4.16334e-17 -4.85723e-17 -1
    endloop
  endfacet
  facet normal 0 0 -1
    outer loop
      vertex -4.16334e-17 -4.85723e-17 -1
      vertex -0.0883883 0.0883883 -1
      vertex -0.0803485 0.0957556 -1
    endloop
  endfacet
  facet normal 0 0 -1
    outer loop
      vertex -0.117462 0.0427525 -1
      vertex -0.113288 0.0528273 -1
      vertex -4.16334e-17 -4.85723e-17 -1
    endloop
  endfacet
  facet normal 0 0 -1
    outer loop
      vertex -0.113288 0.0528273 -1
      vertex -0.108253 0.0625 -1
      vertex -4.16334e-17 -4.85723e-17 -1
    endloop
  endfacet
  facet normal 0 0 -1
    outer loop
      vertex -4.16334e-17 -4.85723e-17 -1
      vertex -0.108253 0.0625 -1
      vertex -0.102394 0.0716971 -1
    endloop
  endfacet
  facet normal 0 0 -1
    outer loop
      vertex -0.124524 0.0108945 -1
      vertex -0.123101 0.021706 -1
      vertex -4.16334e-17 -4.85723e-17 -1
    endloop
  endfacet
  facet normal 0 0 -1
    outer loop
      vertex -0.123101 0.021706 -1
      vertex -0.120741 0.0323524 -1
      vertex -4.16334e-17 -4.85723e-17 -1
    endloop
  endfacet
  facet normal 0 0 -1
    outer loop
      vertex -4.16334e-17 -4.85723e-17 -1
      vertex -0.120741 0.0323524 -1
      vertex -0.117462 0.0427525 -1
    endloop
  endfacet
  facet normal 0 0 -1
    outer loop
      vertex -0.123101 -0.021706 -1
      vertex -0.124524 -0.0108945 -1
      vertex -4.16334e-17 -4.85723e-17 -1
    endloop
  endfacet
  facet normal 0 0 -1
    outer loop
      vertex -0.124524 -0.0108945 -1
      vertex -0.125 -4.85723e-17 -1
      vertex -4.16334e-17 -4.85723e-17 -1
    endloop
  endfacet
  facet normal 0 0 -1
    outer loop
      vertex -4.16334e-17 -4.85723e-17 -1
      vertex -0.125 -4.85723e-17 -1
      vertex -0.124524 0.0108945 -1
    endloop
  endfacet
  facet normal 0 0 -1
    outer loop
      vertex -0.113288 -0.0528273 -1
      vertex -0.117462 -0.0427525 -1
      vertex -4.16334e-17 -4.85723e-17 -1
    endloop
  endfacet
  facet normal 0 0 -1
    outer loop
      vertex -0.117462 -0.0427525 -1
      vertex -0.120741 -0.0323524 -1
      vertex -4.16334e-17 -4.85723e-17 -1
    endloop
  endfacet
  facet normal 0 0 -1
    outer loop
      vertex -4.16334e-17 -4.85723e-17 -1
      vertex -0.120741 -0.0323524 -1
      vertex -0.123101 -0.021706 -1
    endloop
  endfacet
  facet normal 0 0 -1
    outer loop
      vertex -0.0957556 -0.0803485 -1
      vertex -0.102394 -0.0716971 -1
      vertex -4.16334e-17 -4.85723e-17 -1
    endloop
  endfacet
  facet normal 0 0 -1
    outer loop
      vertex -0.102394 -0.0716971 -1
      vertex -0.108253 -0.0625 -1
      vertex -4.16334e-17 -4.85723e-17 -1
    endloop
  endfacet
  facet normal 0 0 -1
    outer loop
      vertex -4.16334e-17 -4.85723e-17 -1
      vertex -0.108253 -0.0625 -1
      vertex -0.113288 -0.0528273 -1
    endloop
  endfacet
  facet normal 0 0 -1
    outer loop
      vertex -0.0716971 -0.102394 -1
      vertex -0.0803485 -0.0957556 -1
      vertex -4.16334e-17 -4.85723e-17 -1
    endloop
  endfacet
  facet normal 0 0 -1
    outer loop
      vertex -0.0803485 -0.0957556 -1
      vertex -0.0883883 -0.0883883 -1
      vertex -4.16334e-17 -4.85723e-17 -1
    endloop
  endfacet
  facet normal 0 0 -1
    outer loop
      vertex -4.16334e-17 -4.85723e-17 -1
      vertex -0.0883883 -0.0883883 -1
      vertex -0.0957556 -0.0803485 -1
    endloop
  endfacet
  facet normal 0 0 -1
    outer loop
      vertex -0.0427525 -0.117462 -1
      vertex -0.0528273 -0.113288 -1
      vertex -4.16334e-17 -4.85723e-17 -1
    endloop
  endfacet
  facet normal 0 0 -1
    outer loop
      vertex -0.0528273 -0.113288 -1
      vertex -0.0625 -0.108253 -1
      vertex -4.16334e-17 -4.85723e-17 -1
    endloop
  endfacet
  facet normal 0 0 -1
    outer loop
      vertex -4.16334e-17 -4.85723e-17 -1
      vertex -0.0625 -0.108253 -1
      vertex -0.0716971 -0.102394 -1
    endloop
  endfacet
  facet normal 0 0 -1
    outer loop
      vertex -0.0108945 -0.124524 -1
      vertex -0.021706 -0.123101 -1
      vertex -4.16334e-17 -4.85723e-17 -1
    endloop
  endfacet
  facet normal 0 0 -1
    outer loop
      vertex -0.021706 -0.123101 -1
      vertex -0.0323524 -0.120741 -1
      vertex -4.16334e-17 -4.85723e-17 -1
    endloop
  endfacet
  facet normal 0 0 -1
    outer loop
      vertex -4.16334e-17 -4.85723e-17 -1
      vertex -0.0323524 -0.120741 -1
      vertex -0.0427525 -0.117462 -1
    endloop
  endfacet
  facet normal 0 0 -1
    outer loop
      vertex 0.021706 -0.123101 -1
      vertex 0.0108945 -0.124524 -1
      vertex -4.16334e-17 -4.85723e-17 -1
    endloop
  endfacet
  facet normal 0 0 -1
    outer loop
      vertex 0.0108945 -0.124524 -1
      vertex 9.23511e-17 -0.125 -1
      vertex -4.16334e-17 -4.85723e-17 -1
    endloop
  endfacet
  facet normal 0 0 -1
    outer loop
      vertex -4.16334e-17 -4.85723e-17 -1
      vertex 9.23511e-17 -0.125 -1
      vertex -0.0108945 -0.124524 -1
    endloop
  endfacet
  facet normal 0 0 -1
    outer loop
      vertex 0.0528273 -0.113288 -1
      vertex 0.0427525 -0.117462 -1
      vertex -4.16334e-17 -4.85723e-17 -1
    endloop
  endfacet
  facet normal 0 0 -1
    outer loop
      vertex 0.0427525 -0.117462 -1
      vertex 0.0323524 -0.120741 -1
      vertex -4.16334e-17 -4.85723e-17 -1
    endloop
  endfacet
  facet normal 0 0 -1
    outer loop
      vertex -4.16334e-17 -4.85723e-17 -1
      vertex 0.0323524 -0.120741 -1
      vertex 0.021706 -0.123101 -1
    endloop
  endfacet
  facet normal 0 0 -1
    outer loop
      vertex 0.0803485 -0.0957556 -1
      vertex 0.0716971 -0.102394 -1
      vertex -4.16334e-17 -4.85723e-17 -1
    endloop
  endfacet
  facet normal 0 0 -1
    outer loop
      vertex 0.0716971 -0.102394 -1
      vertex 0.0625 -0.108253 -1
      vertex -4.16334e-17 -4.85723e-17 -1
    endloop
  endfacet
  facet normal 0 0 -1
    outer loop
      vertex -4.16334e-17 -4.85723e-17 -1
      vertex 0.0625 -0.108253 -1
      vertex 0.0528273 -0.113288 -1
    endloop
  endfacet
  facet normal 0 0 -1
    outer loop
      vertex 0.102394 -0.0716971 -1
      vertex 0.0957556 -0.0803485 -1
      vertex -4.16334e-17 -4.85723e-17 -1
    endloop
  endfacet
  facet normal 0 0 -1
    outer loop
      vertex 0.0957556 -0.0803485 -1
      vertex 0.0883883 -0.0883883 -1
      vertex -4.16334e-17 -4.85723e-17 -1
    endloop
  endfacet
  facet normal 0 0 -1
    outer loop
      vertex -4.16334e-17 -4.85723e-17 -1
      vertex 0.0883883 -0.0883883 -1
      vertex 0.0803485 -0.0957556 -1
    endloop
  endfacet
  facet normal 0 0 -1
    outer loop
      vertex 0.117462 -0.0427525 -1
      vertex 0.113288 -0.0528273 -1
      vertex -4.16334e-17 -4.85723e-17 -1
    endloop
  endfacet
  facet normal 0 0 -1
    outer loop
      vertex 0.113288 -0.0528273 -1
      vertex 0.108253 -0.0625 -1
      vertex -4.16334e-17 -4.85723e-17 -1
    endloop
  endfacet
  facet normal 0 0 -1
    outer loop
      vertex -4.16334e-17 -4.85723e-17 -1
      vertex 0.108253 -0.0625 -1
      vertex 0.102394 -0.0716971 -1
    endloop
  endfacet
  facet normal 0 0 -1
    outer loop
      vertex 0.124524 -0.0108945 -1
      vertex 0.123101 -0.021706 -1
      vertex -4.16334e-17 -4.85723e-17 -1
    endloop
  endfacet
  facet normal 0 0 -1
    outer loop
      vertex 0.123101 -0.021706 -1
      vertex 0.120741 -0.0323524 -1
      vertex -4.16334e-17 -4.85723e-17 -1
    endloop
  endfacet
  facet normal 0 0 -1
    outer loop
      vertex -4.16334e-17 -4.85723e-17 -1
      vertex 0.120741 -0.0323524 -1
      vertex 0.117462 -0.0427525 -1
    endloop
  endfacet
  facet normal -0.999048 0.0436191 0
    outer loop
      vertex -0.125 -4.85723e-17 -1
      vertex -0.124524 0.0108945 1
      vertex -0.124524 0.0108945 -1
    endloop
  endfacet
  facet normal -0.991445 0.130527 0
    outer loop
      vertex -0.124524 0.0108945 1
      vertex -0.123101 0.021706 1
      vertex -0.124524 0.0108945 -1
    endloop
  endfacet
  facet normal -0.991445 0.130527 0
    outer loop
      vertex -0.124524 0.0108945 -1
      vertex -0.123101 0.021706 1
      vertex -0.123101 0.021706 -1
    endloop
  endfacet
  facet normal -0.976296 0.21644 0
    outer loop
      vertex -0.123101 0.021706 1
      vertex -0.120741 0.0323524 1
      vertex -0.123101 0.021706 -1
    endloop
  endfacet
  facet normal -0.976296 0.21644 0
    outer loop
      vertex -0.123101 0.021706 -1
      vertex -0.120741 0.0323524 1
      vertex -0.120741 0.0323524 -1
    endloop
  endfacet
  facet normal -0.953717 0.300706 0
    outer loop
      vertex -0.120741 0.0323524 1
      vertex -0.117462 0.0427525 1
      vertex -0.120741 0.0323524 -1
    endloop
  endfacet
  facet normal -0.953717 0.300706 0
    outer loop
      vertex -0.120741 0.0323524 -1
      vertex -0.117462 0.0427525 1
      vertex -0.117462 0.0427525 -1
    endloop
  endfacet
  facet normal -0.92388 0.382683 0
    outer loop
      vertex -0.117462 0.0427525 1
      vertex -0.113288 0.0528273 1
      vertex -0.117462 0.0427525 -1
    endloop
  endfacet
  facet normal -0.92388 0.382683 0
    outer loop
      vertex -0.117462 0.0427525 -1
      vertex -0.113288 0.0528273 1
      vertex -0.113288 0.0528273 -1
    endloop
  endfacet
  facet normal -0.887011 0.461749 0
    outer loop
      vertex -0.113288 0.0528273 1
      vertex -0.108253 0.0625 1
      vertex -0.113288 0.0528273 -1
    endloop
  endfacet
  facet normal -0.887011 0.461749 0
    outer loop
      vertex -0.113288 0.0528273 -1
      vertex -0.108253 0.0625 1
      vertex -0.108253 0.0625 -1
    endloop
  endfacet
  facet normal -0.843392 0.537299 0
    outer loop
      vertex -0.108253 0.0625 1
      vertex -0.102394 0.0716971 1
      vertex -0.108253 0.0625 -1
    endloop
  endfacet
  facet normal -0.843392 0.537299 0
    outer loop
      vertex -0.108253 0.0625 -1
      vertex -0.102394 0.0716971 1
      vertex -0.102394 0.0716971 -1
    endloop
  endfacet
  facet normal -0.793353 0.608761 0
    outer loop
      vertex -0.102394 0.0716971 1
      vertex -0.0957556 0.0803485 1
      vertex -0.102394 0.0716971 -1
    endloop
  endfacet
  facet normal -0.793353 0.608761 0
    outer loop
      vertex -0.102394 0.0716971 -1
      vertex -0.0957556 0.0803485 1
      vertex -0.0957556 0.0803485 -1
    endloop
  endfacet
  facet normal -0.737277 0.67559 0
    outer loop
      vertex -0.0957556 0.0803485 1
      vertex -0.0883883 0.0883883 1
      vertex -0.0957556 0.0803485 -1
    endloop
  endfacet
  facet normal -0.737277 0.67559 0
    outer loop
      vertex -0.0957556 0.0803485 -1
      vertex -0.0883883 0.0883883 1
      vertex -0.0883883 0.0883883 -1
    endloop
  endfacet
  facet normal -0.67559 0.737277 0
    outer loop
      vertex -0.0883883 0.0883883 1
      vertex -0.0803485 0.0957556 1
      vertex -0.0883883 0.0883883 -1
    endloop
  endfacet
  facet normal -0.67559 0.737277 0
    outer loop
      vertex -0.0883883 0.0883883 -1
      vertex -0.0803485 0.0957556 1
      vertex -0.0803485 0.0957556 -1
    endloop
  endfacet
  facet normal -0.608761 0.793353 0
    outer loop
      vertex -0.0803485 0.0957556 1
      vertex -0.0716971 0.102394 1
      vertex -0.0803485 0.0957556 -1
    endloop
  endfacet
  facet normal -0.608761 0.793353 0
    outer loop
      vertex -0.0803485 0.0957556 -1
      vertex -0.0716971 0.102394 1
      vertex -0.0716971 0.102394 -1
    endloop
  endfacet
  facet normal -0.537299 0.843392 0
    outer loop
      vertex -0.0716971 0.102394 1
      vertex -0.0625 0.108253 1
      vertex -0.0716971 0.102394 -1
    endloop
  endfacet
  facet normal -0.537299 0.843392 0
    outer loop
      vertex -0.0716971 0.102394 -1
      vertex -0.0625 0.108253 1
      vertex -0.0625 0.108253 -1
    endloop
  endfacet
  facet normal -0.461749 0.887011 0
    outer loop
      vertex -0.0625 0.108253 1
      vertex -0.0528273 0.113288 1
      vertex -0.0625 0.108253 -1
    endloop
  endfacet
  facet normal -0.461749 0.887011 0
    outer loop
      vertex -0.0625 0.108253 -1
      vertex -0.0528273 0.113288 1
      vertex -0.0528273 0.113288 -1
    endloop
  endfacet
  facet normal -0.382683 0.92388 0
    outer loop
      vertex -0.0528273 0.113288 1
      vertex -0.0427525 0.117462 1
      vertex -0.0528273 0.113288 -1
    endloop
  endfacet
  facet normal -0.382683 0.92388 0
    outer loop
      vertex -0.0528273 0.113288 -1
      vertex -0.0427525 0.117462 1
      vertex -0.0427525 0.117462 -1
    endloop
  endfacet
  facet normal -0.300706 0.953717 0
    outer loop
      vertex -0.0427525 0.117462 1
      vertex -0.0323524 0.120741 1
      vertex -0.0427525 0.117462 -1
    endloop
  endfacet
  facet normal -0.300706 0.953717 0
    outer loop
      vertex -0.0427525 0.117462 -1
      vertex -0.0323524 0.120741 1
      vertex -0.0323524 0.120741 -1
    endloop
  endfacet
  facet normal -0.21644 0.976296 0
    outer loop
      vertex -0.0323524 0.120741 1
      vertex -0.021706 0.123101 1
      vertex -0.0323524 0.120741 -1
    endloop
  endfacet
  facet normal -0.21644 0.976296 0
    outer loop
      vertex -0.0323524 0.120741 -1
      vertex -0.021706 0.123101 1
      vertex -0.021706 0.123101 -1
    endloop
  endfacet
  facet normal -0.130527 0.991445 0
    outer loop
      vertex -0.021706 0.123101 1
      vertex -0.0108945 0.124524 1
      vertex -0.021706 0.123101 -1
    endloop
  endfacet
  facet normal -0.130527 0.991445 0
    outer loop
      vertex -0.021706 0.123101 -1
      vertex -0.0108945 0.124524 1
      vertex -0.0108945 0.124524 -1
    endloop
  endfacet
  facet normal -0.0436191 0.999048 0
    outer loop
      vertex -0.0108945 0.124524 1
      vertex -7.7043e-17 0.125 1
      vertex -0.0108945 0.124524 -1
    endloop
  endfacet
  facet normal -0.0436191 0.999048 0
    outer loop
      vertex -0.0108945 0.124524 -1
      vertex -7.7043e-17 0.125 1
      vertex -7.7043e-17 0.125 -1
    endloop
  endfacet
  facet normal 0.0436191 0.999048 0
    outer loop
      vertex -7.7043e-17 0.125 1
      vertex 0.0108945 0.124524 1
      vertex -7.7043e-17 0.125 -1
    endloop
  endfacet
  facet normal 0.0436191 0.999048 0
    outer loop
      vertex -7.7043e-17 0.125 -1
      vertex 0.0108945 0.124524 1
      vertex 0.0108945 0.124524 -1
    endloop
  endfacet
  facet normal 0.130527 0.991445 0
    outer loop
      vertex 0.0108945 0.124524 1
      vertex 0.021706 0.123101 1
      vertex 0.0108945 0.124524 -1
    endloop
  endfacet
  facet normal 0.130527 0.991445 0
    outer loop
      vertex 0.0108945 0.124524 -1
      vertex 0.021706 0.123101 1
      vertex 0.021706 0.123101 -1
    endloop
  endfacet
  facet normal 0.21644 0.976296 0
    outer loop
      vertex 0.021706 0.123101 1
      vertex 0.0323524 0.120741 1
      vertex 0.021706 0.123101 -1
    endloop
  endfacet
  facet normal 0.21644 0.976296 0
    outer loop
      vertex 0.021706 0.123101 -1
      vertex 0.0323524 0.120741 1
      vertex 0.0323524 0.120741 -1
    endloop
  endfacet
  facet normal 0.300706 0.953717 0
    outer loop
      vertex 0.0323524 0.120741 1
      vertex 0.0427525 0.117462 1
      vertex 0.0323524 0.120741 -1
    endloop
  endfacet
  facet normal 0.300706 0.953717 0
    outer loop
      vertex 0.0323524 0.120741 -1
      vertex 0.0427525 0.117462 1
      vertex 0.0427525 0.117462 -1
    endloop
  endfacet
  facet normal 0.382683 0.92388 0
    outer loop
      vertex 0.0427525 0.117462 1
      vertex 0.0528273 0.113288 1
      vertex 0.0427525 0.117462 -1
    endloop
  endfacet
  facet normal 0.382683 0.92388 0
    outer loop
      vertex 0.0427525 0.117462 -1
      vertex 0.0528273 0.113288 1
      vertex 0.0528273 0.113288 -1
    endloop
  endfacet
  facet normal 0.461749 0.887011 0
    outer loop
      vertex 0.0528273 0.113288 1
      vertex 0.0625 0.108253 1
      vertex 0.0528273 0.113288 -1
    endloop
  endfacet
  facet normal 0.461749 0.887011 0
    outer loop
      vertex 0.0528273 0.113288 -1
      vertex 0.0625 0.108253 1
      vertex 0.0625 0.108253 -1
    endloop
  endfacet
  facet normal 0.537299 0.843392 0
    outer loop
      vertex 0.0625 0.108253 1
      vertex 0.0716971 0.102394 1
      vertex 0.0625 0.108253 -1
    endloop
  endfacet
  facet normal 0.537299 0.843392 0
    outer loop
      vertex 0.0625 0.108253 -1
      vertex 0.0716971 0.102394 1
      vertex 0.0716971 0.102394 -1
    endloop
  endfacet
  facet normal 0.608761 0.793353 0
    outer loop
      vertex 0.0716971 0.102394 1
      vertex 0.0803485 0.0957556 1
      vertex 0.0716971 0.102394 -1
    endloop
  endfacet
  facet normal 0.608761 0.793353 0
    outer loop
      vertex 0.0716971 0.102394 -1
      vertex 0.0803485 0.0957556 1
      vertex 0.0803485 0.0957556 -1
    endloop
  endfacet
  facet normal 0.67559 0.737277 0
    outer loop
      vertex 0.0803485 0.0957556 1
      vertex 0.0883883 0.0883883 1
      vertex 0.0803485 0.0957556 -1
    endloop
  endfacet
  facet normal 0.67559 0.737277 0
    outer loop
      vertex 0.0803485 0.0957556 -1
      vertex 0.0883883 0.0883883 1
      vertex 0.0883883 0.0883883 -1
    endloop
  endfacet
  facet normal 0.737277 0.67559 0
    outer loop
      vertex 0.0883883 0.0883883 1
      vertex 0.0957556 0.0803485 1
      vertex 0.0883883 0.0883883 -1
    endloop
  endfacet
  facet normal 0.737277 0.67559 0
    outer loop
      vertex 0.0883883 0.0883883 -1
      vertex 0.0957556 0.0803485 1
      vertex 0.0957556 0.0803485 -1
    endloop
  endfacet
  facet normal 0.793353 0.608761 0
    outer loop
      vertex 0.0957556 0.0803485 1
      vertex 0.102394 0.0716971 1
      vertex 0.0957556 0.0803485 -1
    endloop
  endfacet
  facet normal 0.793353 0.608761 0
    outer loop
      vertex 0.0957556 0.0803485 -1
      vertex 0.102394 0.0716971 1
      vertex 0.102394 0.0716971 -1
    endloop
  endfacet
  facet normal 0.843392 0.537299 0
    outer loop
      vertex 0.102394 0.0716971 1
      vertex 0.108253 0.0625 1
      vertex 0.102394 0.0716971 -1
    endloop
  endfacet
  facet normal 0.843392 0.537299 0
    outer loop
      vertex 0.102394 0.0716971 -1
      vertex 0.108253 0.0625 1
      vertex 0.108253 0.0625 -1
    endloop
  endfacet
  facet normal 0.887011 0.461749 0
    outer loop
      vertex 0.108253 0.0625 1
      vertex 0.113288 0.0528273 1
      vertex 0.108253 0.0625 -1
    endloop
  endfacet
  facet normal 0.887011 0.461749 0
    outer loop
      vertex 0.108253 0.0625 -1
      vertex 0.113288 0.0528273 1
      vertex 0.113288 0.0528273 -1
    endloop
  endfacet
  facet normal 0.92388 0.382683 0
    outer loop
      vertex 0.113288 0.0528273 1
      vertex 0.117462 0.0427525 1
      vertex 0.113288 0.0528273 -1
    endloop
  endfacet
  facet normal 0.92388 0.382683 0
    outer loop
      vertex 0.113288 0.0528273 -1
      vertex 0.117462 0.0427525 1
      vertex 0.117462 0.0427525 -1
    endloop
  endfacet
  facet normal 0.953717 0.300706 0
    outer loop
      vertex 0.117462 0.0427525 1
      vertex 0.120741 0.0323524 1
      vertex 0.117462 0.0427525 -1
    endloop
  endfacet
  facet normal 0.953717 0.300706 0
    outer loop
      vertex 0.117462 0.0427525 -1
      vertex 0.120741 0.0323524 1
      vertex 0.120741 0.0323524 -1
    endloop
  endfacet
  facet normal 0.976296 0.21644 0
    outer loop
      vertex 0.120741 0.0323524 1
      vertex 0.123101 0.021706 1
      vertex 0.120741 0.0323524 -1
    endloop
  endfacet
  facet normal 0.976296 0.21644 0
    outer loop
      vertex 0.120741 0.0323524 -1
      vertex 0.123101 0.021706 1
      vertex 0.123101 0.021706 -1
    endloop
  endfacet
  facet normal 0.991445 0.130527 0
    outer loop
      vertex 0.123101 0.021706 1
      vertex 0.124524 0.0108945 1
      vertex 0.123101 0.021706 -1
    endloop
  endfacet
  facet normal 0.991445 0.130527 0
    outer loop
      vertex 0.123101 0.021706 -1
      vertex 0.124524 0.0108945 1
      vertex 0.124524 0.0108945 -1
    endloop
  endfacet
  facet normal 0.999048 0.0436191 0
    outer loop
      vertex 0.124524 0.0108945 1
      vertex 0.125 -2.648e-18 1
      vertex 0.124524 0.0108945 -1
    endloop
  endfacet
  facet normal 0.999048 0.0436191 -6.60237e-19
    outer loop
      vertex 0.124524 0.0108945 -1
      vertex 0.125 -2.648e-18 1
      vertex 0.125 -3.32642e-17 -1
    endloop
  endfacet
  facet normal 0.999048 -0.0436191 6.67725e-19
    outer loop
      vertex 0.125 -2.648e-18 1
      vertex 0.124524 -0.0108945 1
      vertex 0.125 -3.32642e-17 -1
    endloop
  endfacet
  facet normal 0.999048 -0.0436191 0
    outer loop
      vertex 0.125 -3.32642e-17 -1
      vertex 0.124524 -0.0108945 1
      vertex 0.124524 -0.0108945 -1
    endloop
  endfacet
  facet normal 0.991445 -0.130527 0
    outer loop
      vertex 0.124524 -0.0108945 1
      vertex 0.123101 -0.021706 1
      vertex 0.124524 -0.0108945 -1
    endloop
  endfacet
  facet normal 0.991445 -0.130527 0
    outer loop
      vertex 0.124524 -0.0108945 -1
      vertex 0.123101 -0.021706 1
      vertex 0.123101 -0.021706 -1
    endloop
  endfacet
  facet normal 0.976296 -0.21644 0
    outer loop
      vertex 0.123101 -0.021706 1
      vertex 0.120741 -0.0323524 1
      vertex 0.123101 -0.021706 -1
    endloop
  endfacet
  facet normal 0.976296 -0.21644 0
    outer loop
      vertex 0.123101 -0.021706 -1
      vertex 0.120741 -0.0323524 1
      vertex 0.120741 -0.0323524 -1
    endloop
  endfacet
  facet normal 0.953717 -0.300706 0
    outer loop
      vertex 0.120741 -0.0323524 1
      vertex 0.117462 -0.0427525 1
      vertex 0.120741 -0.0323524 -1
    endloop
  endfacet
  facet normal 0.953717 -0.300706 0
    outer loop
      vertex 0.120741 -0.0323524 -1
      vertex 0.117462 -0.0427525 1
      vertex 0.117462 -0.0427525 -1
    endloop
  endfacet
  facet normal 0.92388 -0.382683 0
    outer loop
      vertex 0.117462 -0.0427525 1
      vertex 0.113288 -0.0528273 1
      vertex 0.117462 -0.0427525 -1
    endloop
  endfacet
  facet normal 0.92388 -0.382683 0
    outer loop
      vertex 0.117462 -0.0427525 -1
      vertex 0.113288 -0.0528273 1
      vertex 0.113288 -0.0528273 -1
    endloop
  endfacet
  facet normal 0.887011 -0.461749 0
    outer loop
      vertex 0.113288 -0.0528273 1
      vertex 0.108253 -0.0625 1
      vertex 0.113288 -0.0528273 -1
    endloop
  endfacet
  facet normal 0.887011 -0.461749 0
    outer loop
      vertex 0.113288 -0.0528273 -1
      vertex 0.108253 -0.0625 1
      vertex 0.108253 -0.0625 -1
    endloop
  endfacet
  facet normal 0.843392 -0.537299 0
    outer loop
      vertex 0.108253 -0.0625 1
      vertex 0.102394 -0.0716971 1
      vertex 0.108253 -0.0625 -1
    endloop
  endfacet
  facet normal 0.843392 -0.537299 0
    outer loop
      vertex 0.108253 -0.0625 -1
      vertex 0.102394 -0.0716971 1
      vertex 0.102394 -0.0716971 -1
    endloop
  endfacet
  facet normal 0.793353 -0.608761 0
    outer loop
      vertex 0.102394 -0.0716971 1
      vertex 0.0957556 -0.0803485 1
      vertex 0.102394 -0.0716971 -1
    endloop
  endfacet
  facet normal 0.793353 -0.608761 0
    outer loop
      vertex 0.102394 -0.0716971 -1
      vertex 0.0957556 -0.0803485 1
      vertex 0.0957556 -0.0803485 -1
    endloop
  endfacet
  facet normal 0.737277 -0.67559 0
    outer loop
      vertex 0.0957556 -0.0803485 1
      vertex 0.0883883 -0.0883883 1
      vertex 0.0957556 -0.0803485 -1
    endloop
  endfacet
  facet normal 0.737277 -0.67559 0
    outer loop
      vertex 0.0957556 -0.0803485 -1
      vertex 0.0883883 -0.0883883 1
      vertex 0.0883883 -0.0883883 -1
    endloop
  endfacet
  facet normal 0.67559 -0.737277 0
    outer loop
      vertex 0.0883883 -0.0883883 1
      vertex 0.0803485 -0.0957556 1
      vertex 0.0883883 -0.0883883 -1
    endloop
  endfacet
  facet normal 0.67559 -0.737277 0
    outer loop
      vertex 0.0883883 -0.0883883 -1
      vertex 0.0803485 -0.0957556 1
      vertex 0.0803485 -0.0957556 -1
    endloop
  endfacet
  facet normal 0.608761 -0.793353 0
    outer loop
      vertex 0.0803485 -0.0957556 1
      vertex 0.0716971 -0.102394 1
      vertex 0.0803485 -0.0957556 -1
    endloop
  endfacet
  facet normal 0.608761 -0.793353 0
    outer loop
      vertex 0.0803485 -0.0957556 -1
      vertex 0.0716971 -0.102394 1
      vertex 0.0716971 -0.102394 -1
    endloop
  endfacet
  facet normal 0.537299 -0.843392 0
    outer loop
      vertex 0.0716971 -0.102394 1
      vertex 0.0625 -0.108253 1
      vertex 0.0716971 -0.102394 -1
    endloop
  endfacet
  facet normal 0.537299 -0.843392 0
    outer loop
      vertex 0.0716971 -0.102394 -1
      vertex 0.0625 -0.108253 1
      vertex 0.0625 -0.108253 -1
    endloop
  endfacet
  facet normal 0.461749 -0.887011 0
    outer loop
      vertex 0.0625 -0.108253 1
      vertex 0.0528273 -0.113288 1
      vertex 0.0625 -0.108253 -1
    endloop
  endfacet
  facet normal 0.461749 -0.887011 0
    outer loop
      vertex 0.0625 -0.108253 -1
      vertex 0.0528273 -0.113288 1
      vertex 0.0528273 -0.113288 -1
    endloop
  endfacet
  facet normal 0.382683 -0.92388 0
    outer loop
      vertex 0.0528273 -0.113288 1
      vertex 0.0427525 -0.117462 1
      vertex 0.0528273 -0.113288 -1
    endloop
  endfacet
  facet normal 0.382683 -0.92388 0
    outer loop
      vertex 0.0528273 -0.113288 -1
      vertex 0.0427525 -0.117462 1
      vertex 0.0427525 -0.117462 -1
    endloop
  endfacet
  facet normal 0.300706 -0.953717 0
    outer loop
      vertex 0.0427525 -0.117462 1
      vertex 0.0323524 -0.120741 1
      vertex 0.0427525 -0.117462 -1
    endloop
  endfacet
  facet normal 0.300706 -0.953717 0
    outer loop
      vertex 0.0427525 -0.117462 -1
      vertex 0.0323524 -0.120741 1
      vertex 0.0323524 -0.120741 -1
    endloop
  endfacet
  facet normal 0.21644 -0.976296 0
    outer loop
      vertex 0.0323524 -0.120741 1
      vertex 0.021706 -0.123101 1
      vertex 0.0323524 -0.120741 -1
    endloop
  endfacet
  facet normal 0.21644 -0.976296 0
    outer loop
      vertex 0.0323524 -0.120741 -1
      vertex 0.021706 -0.123101 1
      vertex 0.021706 -0.123101 -1
    endloop
  endfacet
  facet normal 0.130527 -0.991445 0
    outer loop
      vertex 0.021706 -0.123101 1
      vertex 0.0108945 -0.124524 1
      vertex 0.021706 -0.123101 -1
    endloop
  endfacet
  facet normal 0.130527 -0.991445 0
    outer loop
      vertex 0.021706 -0.123101 -1
      vertex 0.0108945 -0.124524 1
      vertex 0.0108945 -0.124524 -1
    endloop
  endfacet
  facet normal 0.0436191 -0.999048 0
    outer loop
      vertex 0.0108945 -0.124524 1
      vertex 9.23511e-17 -0.125 1
      vertex 0.0108945 -0.124524 -1
    endloop
  endfacet
  facet normal 0.0436191 -0.999048 0
    outer loop
      vertex 0.0108945 -0.124524 -1
      vertex 9.23511e-17 -0.125 1
      vertex 9.23511e-17 -0.125 -1
    endloop
  endfacet
  facet normal -0.0436191 -0.999048 0
    outer loop
      vertex 9.23511e-17 -0.125 1
      vertex -0.0108945 -0.124524 1
      vertex 9.23511e-17 -0.125 -1
    endloop
  endfacet
  facet normal -0.0436191 -0.999048 0
    outer loop
      vertex 9.23511e-17 -0.125 -1
      vertex -0.0108945 -0.124524 1
      vertex -0.0108945 -0.124524 -1
    endloop
  endfacet
  facet normal -0.130527 -0.991445 0
    outer loop
      vertex -0.0108945 -0.124524 1
      vertex -0.021706 -0.123101 1
      vertex -0.0108945 -0.124524 -1
    endloop
  endfacet
  facet normal -0.130527 -0.991445 0
    outer loop
      vertex -0.0108945 -0.124524 -1
      vertex -0.021706 -0.123101 1
      vertex -0.021706 -0.123101 -1
    endloop
  endfacet
  facet normal -0.21644 -0.976296 0
    outer loop
      vertex -0.021706 -0.123101 1
      vertex -0.0323524 -0.120741 1
      vertex -0.021706 -0.123101 -1
    endloop
  endfacet
  facet normal -0.21644 -0.976296 0
    outer loop
      vertex -0.021706 -0.123101 -1
      vertex -0.0323524 -0.120741 1
      vertex -0.0323524 -0.120741 -1
    endloop
  endfacet
  facet normal -0.300706 -0.953717 0
    outer loop
      vertex -0.0323524 -0.120741 1
      vertex -0.0427525 -0.117462 1
      vertex -0.0323524 -0.120741 -1
    endloop
  endfacet
  facet normal -0.300706 -0.953717 0
    outer loop
      vertex -0.0323524 -0.120741 -1
      vertex -0.0427525 -0.117462 1
      vertex -0.0427525 -0.117462 -1
    endloop
  endfacet
  facet normal -0.382683 -0.92388 0
    outer loop
      vertex -0.0427525 -0.117462 1
      vertex -0.0528273 -0.113288 1
      vertex -0.0427525 -0.117462 -1
    endloop
  endfacet
  facet normal -0.382683 -0.92388 0
    outer loop
      vertex -0.0427525 -0.117462 -1
      vertex -0.0528273 -0.113288 1
      vertex -0.0528273 -0.113288 -1
    endloop
  endfacet
  facet normal -0.461749 -0.887011 0
    outer loop
      vertex -0.0528273 -0.113288 1
      vertex -0.0625 -0.108253 1
      vertex -0.0528273 -0.113288 -1
    endloop
  endfacet
  facet normal -0.461749 -0.887011 0
    outer loop
      vertex -0.0528273 -0.113288 -1
      vertex -0.0625 -0.108253 1
      vertex -0.0625 -0.108253 -1
    endloop
  endfacet
  facet normal -0.537299 -0.843392 0
    outer loop
      vertex -0.0625 -0.108253 1
      vertex -0.0716971 -0.102394 1
      vertex -0.0625 -0.108253 -1
    endloop
  endfacet
  facet normal -0.537299 -0.843392 0
    outer loop
      vertex -0.0625 -0.108253 -1
      vertex -0.0716971 -0.102394 1
      vertex -0.0716971 -0.102394 -1
    endloop
  endfacet
  facet normal -0.608761 -0.793353 0
    outer loop
      vertex -0.0716971 -0.102394 1
      vertex -0.0803485 -0.0957556 1
      vertex -0.0716971 -0.102394 -1
    endloop
  endfacet
  facet normal -0.608761 -0.793353 0
    outer loop
      vertex -0.0716971 -0.102394 -1
      vertex -0.0803485 -0.0957556 1
      vertex -0.0803485 -0.0957556 -1
    endloop
  endfacet
  facet normal -0.67559 -0.737277 0
    outer loop
      vertex -0.0803485 -0.0957556 1
      vertex -0.0883883 -0.0883883 1
      vertex -0.0803485 -0.0957556 -1
    endloop
  endfacet
  facet normal -0.67559 -0.737277 0
    outer loop
      vertex -0.0803485 -0.0957556 -1
      vertex -0.0883883 -0.0883883 1
      vertex -0.0883883 -0.0883883 -1
    endloop
  endfacet
  facet normal -0.737277 -0.67559 0
    outer loop
      vertex -0.0883883 -0.0883883 1
      vertex -0.0957556 -0.0803485 1
      vertex -0.0883883 -0.0883883 -1
    endloop
  endfacet
  facet normal -0.737277 -0.67559 0
    outer loop
      vertex -0.0883883 -0.0883883 -1
      vertex -0.0957556 -0.0803485 1
      vertex -0.0957556 -0.0803485 -1
    endloop
  endfacet
  facet normal -0.793353 -0.608761 0
    outer loop
      vertex -0.0957556 -0.0803485 1
      vertex -0.102394 -0.0716971 1
      vertex -0.0957556 -0.0803485 -1
    endloop
  endfacet
  facet normal -0.793353 -0.608761 0
    outer loop
      vertex -0.0957556 -0.0803485 -1
      vertex -0.102394 -0.0716971 1
      vertex -0.102394 -0.0716971 -1
    endloop
  endfacet
  facet normal -0.843392 -0.537299 0
    outer loop
      vertex -0.102394 -0.0716971 1
      vertex -0.108253 -0.0625 1
      vertex -0.102394 -0.0716971 -1
    endloop
  endfacet
  facet normal -0.843392 -0.537299 0
    outer loop
      vertex -0.102394 -0.0716971 -1
      vertex -0.108253 -0.0625 1
      vertex -0.108253 -0.0625 -1
    endloop
  endfacet
  facet normal -0.887011 -0.461749 0
    outer loop
      vertex -0.108253 -0.0625 1
      vertex -0.113288 -0.0528273 1
      vertex -0.108253 -0.0625 -1
    endloop
  endfacet
  facet normal -0.887011 -0.461749 0
    outer loop
      vertex -0.108253 -0.0625 -1
      vertex -0.113288 -0.0528273 1
      vertex -0.113288 -0.0528273 -1
    endloop
  endfacet
  facet normal -0.92388 -0.382683 0
    outer loop
      vertex -0.113288 -0.0528273 1
      vertex -0.117462 -0.0427525 1
      vertex -0.113288 -0.0528273 -1
    endloop
  endfacet
  facet normal -0.92388 -0.382683 0
    outer loop
      vertex -0.113288 -0.0528273 -1
      vertex -0.117462 -0.0427525 1
      vertex -0.117462 -0.0427525 -1
    endloop
  endfacet
  facet normal -0.953717 -0.300706 0
    outer loop
      vertex -0.117462 -0.0427525 1
      vertex -0.120741 -0.0323524 1
      vertex -0.117462 -0.0427525 -1
    endloop
  endfacet
  facet normal -0.953717 -0.300706 0
    outer loop
      vertex -0.117462 -0.0427525 -1
      vertex -0.120741 -0.0323524 1
      vertex -0.120741 -0.0323524 -1
    endloop
  endfacet
  facet normal -0.976296 -0.21644 0
    outer loop
      vertex -0.120741 -0.0323524 1
      vertex -0.123101 -0.021706 1
      vertex -0.120741 -0.0323524 -1
    endloop
  endfacet
  facet normal -0.976296 -0.21644 0
    outer loop
      vertex -0.120741 -0.0323524 -1
      vertex -0.123101 -0.021706 1
      vertex -0.123101 -0.021706 -1
    endloop
  endfacet
  facet normal -0.991445 -0.130527 0
    outer loop
      vertex -0.123101 -0.021706 1
      vertex -0.124524 -0.0108945 1
      vertex -0.123101 -0.021706 -1
    endloop
  endfacet
  facet normal -0.991445 -0.130527 0
    outer loop
      vertex -0.123101 -0.021706 -1
      vertex -0.124524 -0.0108945 1
      vertex -0.124524 -0.0108945 -1
    endloop
  endfacet
  facet normal -0.999048 -0.0436191 0
    outer loop
      vertex -0.124524 -0.0108945 1
      vertex -0.125 -4.85723e-17 1
      vertex -0.124524 -0.0108945 -1
    endloop
  endfacet
  facet normal -0.999048 -0.0436191 0
    outer loop
      vertex -0.124524 -0.0108945 -1
      vertex -0.125 -4.85723e-17 1
      vertex -0.125 -4.85723e-17 -1
    endloop
  endfacet
  facet normal -0.999048 0.0436191 0
    outer loop
      vertex -0.125 -4.85723e-17 1
      vertex -0.124524 0.0108945 1
      vertex -0.125 -4.85723e-17 -1
    endloop
  endfacet
  facet normal 0 0 1
    outer loop
      vertex 0.123101 -0.021706 1
      vertex 0.124524 -0.0108945 1
      vertex -4.16334e-17 -4.85723e-17 1
    endloop
  endfacet
  facet normal 0 0 1
    outer loop
      vertex 0.124524 -0.0108945 1
      vertex 0.125 -2.648e-18 1
      vertex -4.16334e-17 -4.85723e-17 1
    endloop
  endfacet
  facet normal 0 0 1
    outer loop
      vertex -4.16334e-17 -4.85723e-17 1
      vertex 0.125 -2.648e-18 1
      vertex 0.124524 0.0108945 1
    endloop
  endfacet
  facet normal 0 0 1
    outer loop
      vertex 0.113288 -0.0528273 1
      vertex 0.117462 -0.0427525 1
      vertex -4.16334e-17 -4.85723e-17 1
    endloop
  endfacet
  facet normal 0 0 1
    outer loop
      vertex 0.117462 -0.0427525 1
      vertex 0.120741 -0.0323524 1
      vertex -4.16334e-17 -4.85723e-17 1
    endloop
  endfacet
  facet normal 0 0 1
    outer loop
      vertex -4.16334e-17 -4.85723e-17 1
      vertex 0.120741 -0.0323524 1
      vertex 0.123101 -0.021706 1
    endloop
  endfacet
  facet normal 0 0 1
    outer loop
      vertex 0.0957556 -0.0803485 1
      vertex 0.102394 -0.0716971 1
      vertex -4.16334e-17 -4.85723e-17 1
    endloop
  endfacet
  facet normal 0 0 1
    outer loop
      vertex 0.102394 -0.0716971 1
      vertex 0.108253 -0.0625 1
      vertex -4.16334e-17 -4.85723e-17 1
    endloop
  endfacet
  facet normal 0 0 1
    outer loop
      vertex -4.16334e-17 -4.85723e-17 1
      vertex 0.108253 -0.0625 1
      vertex 0.113288 -0.0528273 1
    endloop
  endfacet
  facet normal 0 0 1
    outer loop
      vertex 0.0716971 -0.102394 1
      vertex 0.0803485 -0.0957556 1
      vertex -4.16334e-17 -4.85723e-17 1
    endloop
  endfacet
  facet normal 0 0 1
    outer loop
      vertex 0.0803485 -0.0957556 1
      vertex 0.0883883 -0.0883883 1
      vertex -4.16334e-17 -4.85723e-17 1
    endloop
  endfacet
  facet normal 0 0 1
    outer loop
      vertex -4.16334e-17 -4.85723e-17 1
      vertex 0.0883883 -0.0883883 1
      vertex 0.0957556 -0.0803485 1
    endloop
  endfacet
  facet normal 0 0 1
    outer loop
      vertex 0.0427525 -0.117462 1
      vertex 0.0528273 -0.113288 1
      vertex -4.16334e-17 -4.85723e-17 1
    endloop
  endfacet
  facet normal 0 0 1
    outer loop
      vertex 0.0528273 -0.113288 1
      vertex 0.0625 -0.108253 1
      vertex -4.16334e-17 -4.85723e-17 1
    endloop
  endfacet
  facet normal 0 0 1
    outer loop
      vertex -4.16334e-17 -4.85723e-17 1
      vertex 0.0625 -0.108253 1
      vertex 0.0716971 -0.102394 1
    endloop
  endfacet
  facet normal 0 0 1
    outer loop
      vertex 0.0108945 -0.124524 1
      vertex 0.021706 -0.123101 1
      vertex -4.16334e-17 -4.85723e-17 1
    endloop
  endfacet
  facet normal 0 0 1
    outer loop
      vertex 0.021706 -0.123101 1
      vertex 0.0323524 -0.120741 1
      vertex -4.16334e-17 -4.85723e-17 1
    endloop
  endfacet
  facet normal 0 0 1
    outer loop
      vertex -4.16334e-17 -4.85723e-17 1
      vertex 0.0323524 -0.120741 1
      vertex 0.0427525 -0.117462 1
    endloop
  endfacet
  facet normal 0 0 1
    outer loop
      vertex -0.021706 -0.123101 1
      vertex -0.0108945 -0.124524 1
      vertex -4.16334e-17 -4.85723e-17 1
    endloop
  endfacet
  facet normal 0 0 1
    outer loop
      vertex -0.0108945 -0.124524 1
      vertex 9.23511e-17 -0.125 1
      vertex -4.16334e-17 -4.85723e-17 1
    endloop
  endfacet
  facet normal 0 0 1
    outer loop
      vertex -4.16334e-17 -4.85723e-17 1
      vertex 9.23511e-17 -0.125 1
      vertex 0.0108945 -0.124524 1
    endloop
  endfacet
  facet normal 0 0 1
    outer loop
      vertex -0.0528273 -0.113288 1
      vertex -0.0427525 -0.117462 1
      vertex -4.16334e-17 -4.85723e-17 1
    endloop
  endfacet
  facet normal 0 0 1
    outer loop
      vertex -0.0427525 -0.117462 1
      vertex -0.0323524 -0.120741 1
      vertex -4.16334e-17 -4.85723e-17 1
    endloop
  endfacet
  facet normal 0 0 1
    outer loop
      vertex -4.16334e-17 -4.85723e-17 1
      vertex -0.0323524 -0.120741 1
      vertex -0.021706 -0.123101 1
    endloop
  endfacet
  facet normal 0 0 1
    outer loop
      vertex -0.0803485 -0.0957556 1
      vertex -0.0716971 -0.102394 1
      vertex -4.16334e-17 -4.85723e-17 1
    endloop
  endfacet
  facet normal 0 0 1
    outer loop
      vertex -0.0716971 -0.102394 1
      vertex -0.0625 -0.108253 1
      vertex -4.16334e-17 -4.85723e-17 1
    endloop
  endfacet
  facet normal 0 0 1
    outer loop
      vertex -4.16334e-17 -4.85723e-17 1
      vertex -0.0625 -0.108253 1
      vertex -0.0528273 -0.113288 1
    endloop
  endfacet
  facet normal 0 0 1
    outer loop
      vertex -0.102394 -0.0716971 1
      vertex -0.0957556 -0.0803485 1
      vertex -4.16334e-17 -4.85723e-17 1
    endloop
  endfacet
  facet normal 0 0 1
    outer loop
      vertex -0.0957556 -0.0803485 1
      vertex -0.0883883 -0.0883883 1
      vertex -4.16334e-17 -4.85723e-17 1
    endloop
  endfacet
  facet normal 0 0 1
    outer loop
      vertex -4.16334e-17 -4.85723e-17 1
      vertex -0.0883883 -0.0883883 1
      vertex -0.0803485 -0.0957556 1
    endloop
  endfacet
  facet normal 0 0 1
    outer loop
      vertex -0.117462 -0.0427525 1
      vertex -0.113288 -0.0528273 1
      vertex -4.16334e-17 -4.85723e-17 1
    endloop
  endfacet
  facet normal 0 0 1
    outer loop
      vertex -0.113288 -0.0528273 1
      vertex -0.108253 -0.0625 1
      vertex -4.16334e-17 -4.85723e-17 1
    endloop
  endfacet
  facet normal 0 0 1
    outer loop
      vertex -4.16334e-17 -4.85723e-17 1
      vertex -0.108253 -0.0625 1
      vertex -0.102394 -0.0716971 1
    endloop
  endfacet
  facet normal 0 0 1
    outer loop
      vertex -0.124524 -0.0108945 1
      vertex -0.123101 -0.021706 1
      vertex -4.16334e-17 -4.85723e-17 1
    endloop
  endfacet
  facet normal 0 0 1
    outer loop
      vertex -0.123101 -0.021706 1
      vertex -0.120741 -0.0323524 1
      vertex -4.16334e-17 -4.85723e-17 1
    endloop
  endfacet
  facet normal 0 0 1
    outer loop
      vertex -4.16334e-17 -4.85723e-17 1
      vertex -0.120741 -0.0323524 1
      vertex -0.117462 -0.0427525 1
    endloop
  endfacet
  facet normal 0 0 1
    outer loop
      vertex -0.123101 0.021706 1
      vertex -0.124524 0.0108945 1
      vertex -4.16334e-17 -4.85723e-17 1
    endloop
  endfacet
  facet normal 0 0 1
    outer loop
      vertex -0.124524 0.0108945 1
      vertex -0.125 -4.85723e-17 1
      vertex -4.16334e-17 -4.85723e-17 1
    endloop
  endfacet
  facet normal 0 0 1
    outer loop
      vertex -4.16334e-17 -4.85723e-17 1
      vertex -0.125 -4.85723e-17 1
      vertex -0.124524 -0.0108945 1
    endloop
  endfacet
  facet normal 0 0 1
    outer loop
      vertex -0.113288 0.0528273 1
      vertex -0.117462 0.0427525 1
      vertex -4.16334e-17 -4.85723e-17 1
    endloop
  endfacet
  facet normal 0 0 1
    outer loop
      vertex -0.117462 0.0427525 1
      vertex -0.120741 0.0323524 1
      vertex -4.16334e-17 -4.85723e-17 1
    endloop
  endfacet
  facet normal 0 0 1
    outer loop
      vertex -4.16334e-17 -4.85723e-17 1
      vertex -0.120741 0.0323524 1
      vertex -0.123101 0.021706 1
    endloop
  endfacet
  facet normal 0 0 1
    outer loop
      vertex -0.0957556 0.0803485 1
      vertex -0.102394 0.0716971 1
      vertex -4.16334e-17 -4.85723e-17 1
    endloop
  endfacet
  facet normal 0 0 1
    outer loop
      vertex -0.102394 0.0716971 1
      vertex -0.108253 0.0625 1
      vertex -4.16334e-17 -4.85723e-17 1
    endloop
  endfacet
  facet normal 0 0 1
    outer loop
      vertex -4.16334e-17 -4.85723e-17 1
      vertex -0.108253 0.0625 1
      vertex -0.113288 0.0528273 1
    endloop
  endfacet
  facet normal 0 0 1
    outer loop
      vertex -0.0716971 0.102394 1
      vertex -0.0803485 0.0957556 1
      vertex -4.16334e-17 -4.85723e-17 1
    endloop
  endfacet
  facet normal 0 0 1
    outer loop
      vertex -0.0803485 0.0957556 1
      vertex -0.0883883 0.0883883 1
      vertex -4.16334e-17 -4.85723e-17 1
    endloop
  endfacet
  facet normal 0 0 1
    outer loop
      vertex -4.16334e-17 -4.85723e-17 1
      vertex -0.0883883 0.0883883 1
      vertex -0.0957556 0.0803485 1
    endloop
  endfacet
  facet normal 0 0 1
    outer loop
      vertex -0.0427525 0.117462 1
      vertex -0.0528273 0.113288 1
      vertex -4.16334e-17 -4.85723e-17 1
    endloop
  endfacet
  facet normal 0 0 1
    outer loop
      vertex -0.0528273 0.113288 1
      vertex -0.0625 0.108253 1
      vertex -4.16334e-17 -4.85723e-17 1
    endloop
  endfacet
  facet normal 0 0 1
    outer loop
      vertex -4.16334e-17 -4.85723e-17 1
      vertex -0.0625 0.108253 1
      vertex -0.0716971 0.102394 1
    endloop
  endfacet
  facet normal 0 0 1
    outer loop
      vertex -0.0108945 0.124524 1
      vertex -0.021706 0.123101 1
      vertex -4.16334e-17 -4.85723e-17 1
    endloop
  endfacet
  facet normal 0 0 1
    outer loop
      vertex -0.021706 0.123101 1
      vertex -0.0323524 0.120741 1
      vertex -4.16334e-17 -4.85723e-17 1
    endloop
  endfacet
  facet normal 0 0 1
    outer loop
      vertex -4.16334e-17 -4.85723e-17 1
      vertex -0.0323524 0.120741 1
      vertex -0.0427525 0.117462 1
    endloop
  endfacet
  facet normal 0 0 1
    outer loop
      vertex 0.021706 0.123101 1
      vertex 0.0108945 0.124524 1
      vertex -4.16334e-17 -4.85723e-17 1
    endloop
  endfacet
  facet normal 0 0 1
    outer loop
      vertex 0.0108945 0.124524 1
      vertex -7.7043e-17 0.125 1
      vertex -4.16334e-17 -4.85723e-17 1
    endloop
  endfacet
  facet normal 0 0 1
    outer loop
      vertex -4.16334e-17 -4.85723e-17 1
      vertex -7.7043e-17 0.125 1
      vertex -0.0108945 0.124524 1
    endloop
  endfacet
  facet normal 0 0 1
    outer loop
      vertex 0.0528273 0.113288 1
      vertex 0.0427525 0.117462 1
      vertex -4.16334e-17 -4.85723e-17 1
    endloop
  endfacet
  facet normal 0 0 1
    outer loop
      vertex 0.0427525 0.117462 1
      vertex 0.0323524 0.120741 1
      vertex -4.16334e-17 -4.85723e-17 1
    endloop
  endfacet
  facet normal 0 0 1
    outer loop
      vertex -4.16334e-17 -4.85723e-17 1
      vertex 0.0323524 0.120741 1
      vertex 0.021706 0.123101 1
    endloop
  endfacet
  facet normal 0 0 1
    outer loop
      vertex 0.0803485 0.0957556 1
      vertex 0.0716971 0.102394 1
      vertex -4.16334e-17 -4.85723e-17 1
    endloop
  endfacet
  facet normal 0 0 1
    outer loop
      vertex 0.0716971 0.102394 1
      vertex 0.0625 0.108253 1
      vertex -4.16334e-17 -4.85723e-17 1
    endloop
  endfacet
  facet normal 0 0 1
    outer loop
      vertex -4.16334e-17 -4.85723e-17 1
      vertex 0.0625 0.108253 1
      vertex 0.0528273 0.113288 1
    endloop
  endfacet
  facet normal 0 0 1
    outer loop
      vertex 0.102394 0.0716971 1
      vertex 0.0957556 0.0803485 1
      vertex -4.16334e-17 -4.85723e-17 1
    endloop
  endfacet
  facet normal 0 0 1
    outer loop
      vertex 0.0957556 0.0803485 1
      vertex 0.0883883 0.0883883 1
      vertex -4.16334e-17 -4.85723e-17 1
    endloop
  endfacet
  facet normal 0 0 1
    outer loop
      vertex -4.16334e-17 -4.85723e-17 1
      vertex 0.0883883 0.0883883 1
      vertex 0.0803485 0.0957556 1
    endloop
  endfacet
  facet normal 0 0 1
    outer loop
      vertex 0.117462 0.0427525 1
      vertex 0.113288 0.0528273 1
      vertex -4.16334e-17 -4.85723e-17 1
    endloop
  endfacet
  facet normal 0 0 1
    outer loop
      vertex 0.113288 0.0528273 1
      vertex 0.108253 0.0625 1
      vertex -4.16334e-17 -4.85723e-17 1
    endloop
  endfacet
  facet normal 0 0 1
    outer loop
      vertex -4.16334e-17 -4.85723e-17 1
      vertex 0.108253 0.0625 1
      vertex 0.102394 0.0716971 1
    endloop
  endfacet
  facet normal 0 0 1
    outer loop
      vertex 0.124524 0.0108945 1
      vertex 0.123101 0.021706 1
      vertex -4.16334e-17 -4.85723e-17 1
    endloop
  endfacet
  facet normal 0 0 1
    outer loop
      vertex 0.123101 0.021706 1
      vertex 0.120741 0.0323524 1
      vertex -4.16334e-17 -4.85723e-17 1
    endloop
  endfacet
  facet normal 0 0 1
    outer loop
      vertex -4.16334e-17 -4.85723e-17 1
      vertex 0.120741 0.0323524 1
      vertex 0.117462 0.0427525 1
    endloop
  endfacet
endsolid Onshape
