^D:\HOME WORK\2.2\HOME-WORK-2.2\HOME-WORK-2.2\DEBUG\MAIN.OBJ
D:\HOME WORK\2.2\HOME-WORK-2.2\DEBUG\HOME-WORK-2.2.EXE
D:\HOME WORK\2.2\HOME-WORK-2.2\HOME-WORK-2.2\DEBUG\HOME-WORK-2.2.ILK
D:\HOME WORK\2.2\HOME-WORK-2.2\DEBUG\HOME-WORK-2.2.PDB
