^C:\УЧЁБА C++\19.5 2 ПОПЫТКА\19.5 2 ПОПЫТКА\19.5 2 ПОПЫТКА.CPP
C:\Учёба C++\19.5 2 попытка\19.5 2 попытка\DEBUG\VC142.PDB
C:\Учёба C++\19.5 2 попытка\19.5 2 попытка\DEBUG\VC142.IDB
C:\Учёба C++\19.5 2 попытка\19.5 2 попытка\DEBUG\19.5 2 попытка.OBJ
