          final loss : 0.2795
          test error : 0.0778
      training error : 0.07755
       training time : 36.149

       learning_rate : 1e-005
            max_iter : 1000
         target_loss : 1e-007

-0.0000000 0.0000000 0.0000000 0.0000000 0.0000000 0.0000000 0.0000000 -0.0000000 0.0000000 -0.0000000 
-0.0000000 -0.0000000 -0.0000000 0.0000000 -0.0000000 -0.0000000 -0.0000000 0.0000000 -0.0000000 0.0000000 
-0.0000000 0.0000000 0.0000000 -0.0000000 0.0000000 0.0000000 -0.0000000 -0.0000000 -0.0000000 0.0000000 
0.0000000 -0.0000000 0.0000000 0.0000000 -0.0000000 0.0000000 0.0000000 0.0000000 0.0000000 0.0000000 
0.0000000 -0.0000000 0.0000000 -0.0000000 -0.0000000 0.0000000 -0.0000000 -0.0000000 -0.0000000 0.0000000 
-0.0000000 -0.0000000 -0.0000000 -0.0000000 -0.0000000 -0.0000000 -0.0000000 -0.0000000 -0.0000000 0.0000000 
-0.0000000 0.0000000 -0.0000000 -0.0000000 0.0000000 -0.0000000 -0.0000000 -0.0000000 0.0000000 0.0000000 
0.0000000 -0.0000000 -0.0000000 0.0000000 -0.0000000 -0.0000000 0.0000000 -0.0000000 0.0000000 -0.0000000 
0.0000000 -0.0000000 0.0000000 0.0000000 0.0000000 -0.0000000 -0.0000000 -0.0000000 -0.0000000 -0.0000000 
-0.0000000 0.0000000 0.0000000 -0.0000000 0.0000000 -0.0000000 0.0000000 0.0000000 -0.0000000 -0.0000000 
0.0000000 -0.0000000 -0.0000000 -0.0000000 0.0000000 -0.0000000 0.0000000 0.0000000 0.0000000 -0.0000000 
0.0000000 0.0000000 -0.0000000 -0.0000000 -0.0000000 -0.0000000 -0.0000000 -0.0000000 0.0000000 -0.0000000 
-0.0000035 -0.0000051 -0.0001570 -0.0000218 -0.0013429 -0.0000306 0.0017810 -0.0000058 -0.0000440 -0.0001704 
-0.0000150 -0.0000153 -0.0001298 -0.0000535 -0.0030489 -0.0000697 0.0038474 -0.0000194 -0.0001060 -0.0003899 
-0.0000082 -0.0000046 0.0002381 -0.0000064 -0.0001207 -0.0000030 -0.0000584 -0.0000074 -0.0000109 -0.0000186 
-0.0000003 -0.0000002 0.0000099 -0.0000003 -0.0000050 -0.0000001 -0.0000024 -0.0000003 -0.0000005 -0.0000008 
0.0000000 -0.0000000 0.0000000 0.0000000 -0.0000000 0.0000000 -0.0000000 0.0000000 0.0000000 -0.0000000 
0.0000000 -0.0000000 0.0000000 0.0000000 -0.0000000 0.0000000 -0.0000000 0.0000000 0.0000000 0.0000000 
-0.0000000 0.0000000 0.0000000 -0.0000000 0.0000000 -0.0000000 -0.0000000 -0.0000000 0.0000000 0.0000000 
0.0000000 0.0000000 -0.0000000 0.0000000 0.0000000 0.0000000 0.0000000 -0.0000000 -0.0000000 0.0000000 
0.0000000 -0.0000000 0.0000000 0.0000000 0.0000000 -0.0000000 -0.0000000 0.0000000 0.0000000 0.0000000 
0.0000000 0.0000000 -0.0000000 0.0000000 0.0000000 -0.0000000 -0.0000000 -0.0000000 -0.0000000 -0.0000000 
-0.0000000 0.0000000 -0.0000000 0.0000000 -0.0000000 -0.0000000 -0.0000000 -0.0000000 0.0000000 0.0000000 
-0.0000000 0.0000000 0.0000000 0.0000000 0.0000000 -0.0000000 0.0000000 -0.0000000 0.0000000 -0.0000000 
-0.0000000 0.0000000 0.0000000 -0.0000000 0.0000000 -0.0000000 0.0000000 0.0000000 0.0000000 -0.0000000 
0.0000000 -0.0000000 -0.0000000 -0.0000000 0.0000000 -0.0000000 0.0000000 0.0000000 -0.0000000 0.0000000 
0.0000000 0.0000000 0.0000000 -0.0000000 0.0000000 -0.0000000 -0.0000000 0.0000000 0.0000000 0.0000000 
0.0000000 -0.0000000 -0.0000000 0.0000000 -0.0000000 -0.0000000 0.0000000 -0.0000000 -0.0000000 0.0000000 
0.0000000 0.0000000 -0.0000000 0.0000000 0.0000000 0.0000000 -0.0000000 -0.0000000 -0.0000000 0.0000000 
0.0000000 0.0000000 0.0000000 0.0000000 0.0000000 0.0000000 -0.0000000 -0.0000000 0.0000000 0.0000000 
0.0000000 -0.0000000 0.0000000 -0.0000000 -0.0000000 0.0000000 0.0000000 -0.0000000 0.0000000 0.0000000 
-0.0000000 0.0000000 0.0000000 0.0000000 0.0000000 0.0000000 0.0000000 0.0000000 -0.0000000 -0.0000000 
-0.0000004 -0.0000003 -0.0000055 -0.0000002 -0.0000149 -0.0000004 0.0000242 -0.0000003 -0.0000007 -0.0000015 
-0.0000015 -0.0000008 -0.0000174 -0.0000006 -0.0000861 -0.0000014 0.0001163 -0.0000013 -0.0000021 -0.0000050 
-0.0000183 -0.0000043 -0.0001779 -0.0000113 -0.0061606 -0.0000165 0.0065108 -0.0000405 -0.0000096 -0.0000719 
-0.0000542 -0.0000414 -0.0006741 -0.0000314 -0.0144526 -0.0000378 0.0157114 -0.0001727 -0.0000545 -0.0001927 
-0.0001539 -0.0012936 -0.0013379 -0.0001331 -0.0147433 -0.0000903 0.0194203 -0.0007611 -0.0004750 -0.0004322 
-0.0002465 -0.0010874 -0.0032031 -0.0001484 -0.0083951 -0.0001035 0.0147676 -0.0005913 -0.0005615 -0.0004308 
-0.0007186 -0.0007800 -0.0033238 -0.0001868 -0.0154311 -0.0002635 0.0227374 -0.0005496 -0.0006020 -0.0008822 
0.0030526 -0.0004986 -0.0050495 -0.0002669 -0.0232047 -0.0003505 0.0318399 -0.0023726 -0.0007928 -0.0023570 
0.0071409 -0.0004012 -0.0067484 -0.0004362 -0.0380612 -0.0014420 0.0489344 -0.0043384 -0.0008123 -0.0038356 
0.0028267 -0.0003282 -0.0047147 -0.0003676 -0.0241338 -0.0014788 0.0328926 -0.0016222 -0.0008759 -0.0021982 
-0.0008180 0.0048075 -0.0009506 -0.0012483 -0.0115984 -0.0010373 0.0136900 -0.0003817 -0.0012034 -0.0012598 
0.0023293 0.0072640 0.0076270 -0.0015854 -0.0241549 -0.0011280 0.0149517 -0.0006454 -0.0012064 -0.0034520 
0.0076673 -0.0016759 0.0232997 -0.0007720 -0.0256870 -0.0009972 0.0075673 -0.0010145 -0.0017321 -0.0066555 
0.0034847 -0.0011689 0.0023803 -0.0003327 -0.0102290 -0.0006814 0.0121143 -0.0004970 -0.0012566 -0.0038136 
-0.0004946 -0.0002031 -0.0040782 -0.0001216 -0.0051326 -0.0008410 0.0127747 -0.0001899 -0.0007914 -0.0009223 
-0.0003978 -0.0001348 -0.0038269 -0.0001173 -0.0060275 -0.0008220 0.0127755 -0.0001743 -0.0005631 -0.0007118 
-0.0003034 -0.0001364 -0.0024871 -0.0001342 -0.0044577 -0.0005816 0.0092255 -0.0001013 -0.0004425 -0.0005814 
-0.0001463 -0.0001077 -0.0013813 -0.0000611 -0.0048044 -0.0001605 0.0072956 -0.0000273 -0.0003513 -0.0002558 
-0.0000395 -0.0000197 -0.0002059 -0.0000120 -0.0053337 -0.0000225 0.0058635 -0.0000161 -0.0000894 -0.0001248 
-0.0000038 -0.0000027 -0.0000518 -0.0000026 -0.0012935 -0.0000072 0.0014399 -0.0000125 -0.0000199 -0.0000461 
0.0000000 -0.0000000 -0.0000000 0.0000000 0.0000000 -0.0000000 -0.0000000 0.0000000 -0.0000000 0.0000000 
0.0000000 0.0000000 0.0000000 -0.0000000 0.0000000 -0.0000000 -0.0000000 0.0000000 0.0000000 0.0000000 
-0.0000000 -0.0000000 0.0000000 -0.0000000 -0.0000000 0.0000000 0.0000000 -0.0000000 -0.0000000 -0.0000000 
0.0000000 -0.0000000 -0.0000000 -0.0000000 -0.0000000 -0.0000000 0.0000000 -0.0000000 -0.0000000 0.0000000 
-0.0000000 0.0000000 0.0000000 0.0000000 0.0000000 -0.0000000 -0.0000000 0.0000000 -0.0000000 0.0000000 
0.0000000 0.0000000 -0.0000000 0.0000000 0.0000000 0.0000000 -0.0000000 0.0000000 0.0000000 -0.0000000 
-0.0000015 -0.0000005 -0.0000019 -0.0000008 -0.0000035 -0.0000017 0.0000139 -0.0000005 -0.0000016 -0.0000020 
0.0002422 -0.0000004 -0.0000094 -0.0000011 -0.0001953 -0.0000215 0.0000554 -0.0000302 -0.0000060 -0.0000337 
0.0000873 -0.0000083 -0.0002294 -0.0000078 -0.0002919 -0.0000171 0.0005546 -0.0000222 -0.0000270 -0.0000381 
-0.0000990 -0.0000067 -0.0000728 -0.0000229 -0.0002376 -0.0000086 0.0004917 -0.0000096 -0.0000167 -0.0000178 
-0.0024029 -0.0000606 -0.0009717 -0.0001860 -0.0068404 -0.0000859 0.0110863 -0.0002371 -0.0001393 -0.0001624 
-0.0030451 -0.0009559 -0.0025979 -0.0008580 -0.0251627 -0.0007227 0.0356817 -0.0009063 -0.0006454 -0.0007877 
-0.0042227 -0.0063086 -0.0011513 -0.0028178 -0.0336910 -0.0012269 0.0546032 -0.0020890 -0.0016963 -0.0013995 
-0.0074799 -0.0108980 0.0088080 -0.0058899 -0.0366431 -0.0036437 0.0663935 -0.0036986 -0.0046376 -0.0023108 
-0.0086955 -0.0114164 0.0070376 -0.0039302 -0.0714344 -0.0087890 0.1174894 -0.0058378 -0.0086905 -0.0057333 
-0.0109286 -0.0122988 0.0173358 0.0026113 -0.0863833 -0.0171031 0.1381150 -0.0105579 -0.0120396 -0.0087509 
-0.0132712 -0.0002335 0.0240035 0.0028236 -0.1160496 -0.0228427 0.1652979 -0.0103633 -0.0158988 -0.0134659 
-0.0203256 0.0225961 0.0245412 -0.0035724 -0.1062648 -0.0295548 0.1577839 -0.0079052 -0.0213770 -0.0159215 
-0.0327149 0.0276427 0.0297667 -0.0032703 -0.0851244 -0.0351786 0.1490219 -0.0086894 -0.0246443 -0.0168093 
-0.0388831 0.0509839 0.0382174 -0.0100921 -0.0880629 -0.0274860 0.1299292 -0.0096827 -0.0266782 -0.0182455 
-0.0342869 0.0295174 0.0401883 -0.0077540 -0.0841043 -0.0124201 0.1236689 -0.0069234 -0.0275549 -0.0203309 
-0.0297288 0.0022551 0.0097639 -0.0058459 -0.0524509 0.0009653 0.1163734 -0.0050806 -0.0209128 -0.0153387 
-0.0227393 -0.0053307 -0.0189568 -0.0092270 -0.0352164 0.0038971 0.1130601 -0.0035012 -0.0112255 -0.0107603 
-0.0179434 -0.0013569 -0.0363622 -0.0070214 -0.0193166 -0.0006071 0.1064660 -0.0023477 -0.0138552 -0.0076555 
-0.0131016 -0.0049267 -0.0215653 -0.0038748 -0.0109830 -0.0127583 0.0791699 -0.0014666 -0.0066948 -0.0037989 
-0.0074609 -0.0043228 -0.0185120 -0.0034861 -0.0085213 -0.0112603 0.0623991 -0.0010089 -0.0050637 -0.0027631 
-0.0036657 -0.0025774 -0.0151927 -0.0024754 -0.0086946 -0.0054477 0.0438057 -0.0005997 -0.0036614 -0.0014911 
-0.0015340 -0.0014537 -0.0055293 -0.0008667 -0.0052362 -0.0048925 0.0217592 -0.0001351 -0.0017447 -0.0003671 
-0.0003785 -0.0005266 0.0045738 -0.0001846 -0.0011620 -0.0030093 0.0017574 -0.0000504 -0.0009248 -0.0000949 
-0.0000278 -0.0000649 0.0042122 -0.0000093 -0.0002240 -0.0004898 -0.0030574 -0.0000063 -0.0003100 -0.0000227 
0.0000000 -0.0000000 -0.0000000 -0.0000000 -0.0000000 -0.0000000 0.0000000 0.0000000 -0.0000000 -0.0000000 
-0.0000000 -0.0000000 -0.0000000 0.0000000 -0.0000000 0.0000000 0.0000000 -0.0000000 0.0000000 -0.0000000 
-0.0000000 -0.0000000 -0.0000000 0.0000000 -0.0000000 -0.0000000 0.0000000 -0.0000000 -0.0000000 0.0000000 
0.0000000 0.0000000 -0.0000000 -0.0000000 0.0000000 -0.0000000 0.0000000 0.0000000 -0.0000000 0.0000000 
-0.0000038 0.0001013 -0.0000172 -0.0000060 -0.0000085 -0.0000053 -0.0000303 -0.0000017 -0.0000231 -0.0000054 
0.0003521 0.0000207 -0.0000710 -0.0000205 -0.0007238 -0.0000283 0.0008317 -0.0000987 -0.0001240 -0.0001383 
-0.0019404 -0.0000261 -0.0009525 -0.0006294 -0.0006036 0.0020182 0.0027083 -0.0003677 -0.0001143 -0.0000925 
-0.0110225 -0.0004316 -0.0001673 0.0168894 -0.0012794 -0.0071116 0.0048693 -0.0004542 -0.0010300 -0.0002621 
-0.0148048 -0.0011699 0.0008807 0.0145858 -0.0119680 -0.0057314 0.0227224 -0.0010030 -0.0025869 -0.0009252 
-0.0187246 -0.0065591 0.0150600 0.0226705 -0.0282508 -0.0119794 0.0421811 -0.0051398 -0.0068346 -0.0024232 
-0.0103212 -0.0204359 0.0433593 0.0279025 -0.0594315 -0.0161012 0.0646349 -0.0125689 -0.0115796 -0.0054584 
-0.0260022 -0.0352968 0.1231027 0.0174607 -0.0926010 -0.0290977 0.0918768 -0.0183607 -0.0206847 -0.0103971 
-0.0282556 -0.0583013 0.1531585 0.0411384 -0.1258062 -0.0330964 0.1303441 -0.0295905 -0.0307350 -0.0188559 
-0.0260759 -0.0791139 0.1923403 0.1050291 -0.1583623 -0.0594072 0.1411227 -0.0417993 -0.0451469 -0.0285866 
-0.0378395 -0.0492804 0.2074621 0.1543212 -0.2102973 -0.0535837 0.1252190 -0.0372599 -0.0596327 -0.0391088 
-0.0249699 -0.0200153 0.2184748 0.1494605 -0.2462177 -0.0637182 0.1476269 -0.0389146 -0.0679751 -0.0537514 
-0.0364975 -0.0146441 0.1606022 0.1994400 -0.2140073 -0.0494756 0.1535378 -0.0408486 -0.0892757 -0.0688311 
-0.0449951 0.0264379 0.1064826 0.1863038 -0.2026768 -0.0159982 0.1508112 -0.0411501 -0.0852208 -0.0799944 
-0.0455824 0.0205939 0.1051000 0.1599808 -0.1707500 0.0001119 0.1294285 -0.0352246 -0.0913342 -0.0723240 
-0.0588087 -0.0392520 0.0416704 0.1455295 -0.1308046 0.0474698 0.1550529 -0.0283602 -0.0787208 -0.0537762 
-0.1001348 -0.0594114 -0.0488355 0.1126119 -0.0883583 0.0871980 0.2009680 -0.0238557 -0.0471680 -0.0330143 
-0.1007054 -0.0459091 -0.0803363 0.0710329 -0.0343467 0.0808484 0.2143517 -0.0162470 -0.0589573 -0.0297310 
-0.0754908 -0.0398754 -0.0864929 0.0475083 -0.0067121 0.0784836 0.1566851 -0.0120906 -0.0394575 -0.0225576 
-0.0626240 -0.0317314 -0.0699281 -0.0168133 0.0050851 0.0637136 0.1453381 -0.0071608 -0.0135209 -0.0123581 
-0.0394988 -0.0240010 -0.0594832 -0.0289298 0.0026592 0.0353991 0.1222464 -0.0031859 -0.0001861 -0.0050198 
-0.0196016 -0.0152893 -0.0417857 -0.0145479 0.0023163 -0.0066197 0.0929860 -0.0014071 0.0061809 -0.0022317 
-0.0082066 -0.0103860 -0.0117825 -0.0048573 -0.0032920 -0.0085784 0.0493049 -0.0004732 -0.0010381 -0.0006909 
-0.0024573 -0.0024640 0.0020544 -0.0003677 -0.0003444 0.0047943 -0.0006359 -0.0000376 -0.0004528 -0.0000890 
-0.0005487 -0.0030816 -0.0002170 -0.0000206 -0.0000985 0.0011320 0.0036374 -0.0000030 -0.0007931 -0.0000070 
0.0000000 0.0000000 -0.0000000 -0.0000000 -0.0000000 0.0000000 0.0000000 0.0000000 0.0000000 0.0000000 
-0.0000000 0.0000000 0.0000000 -0.0000000 -0.0000000 -0.0000000 0.0000000 -0.0000000 0.0000000 -0.0000000 
-0.0000007 -0.0000007 -0.0000090 0.0000190 -0.0000011 -0.0000039 -0.0000008 -0.0000005 -0.0000018 -0.0000005 
-0.0000225 0.0003438 -0.0001930 0.0002208 -0.0000124 -0.0001800 -0.0002126 -0.0000040 0.0000674 -0.0000075 
-0.0000562 -0.0000233 -0.0009830 0.0032494 -0.0002494 -0.0013323 -0.0003639 0.0001937 -0.0003103 -0.0001247 
-0.0034260 0.0008914 -0.0081449 0.0147410 0.0053909 -0.0093892 0.0030772 -0.0005766 -0.0019826 -0.0005812 
-0.0202291 0.0058257 0.0063230 0.0607131 0.0047408 -0.0394251 0.0013109 -0.0065100 -0.0093332 -0.0034161 
-0.0250292 -0.0023826 0.0380439 0.0929854 -0.0126665 -0.0606196 0.0022165 -0.0080683 -0.0189346 -0.0055449 
-0.0214427 -0.0207287 0.0555319 0.1293087 -0.0217466 -0.0791470 0.0165929 -0.0202720 -0.0258222 -0.0122743 
-0.0183009 -0.0347982 0.1040497 0.1801597 -0.0647146 -0.1320440 0.0455517 -0.0365909 -0.0181938 -0.0251188 
-0.0144557 -0.0622538 0.2126104 0.1900818 -0.1084574 -0.1319172 0.0343323 -0.0613304 -0.0117575 -0.0468524 
-0.0258380 -0.0605393 0.2296388 0.2392981 -0.1709812 -0.0973220 0.0556710 -0.0894648 -0.0143926 -0.0660700 
-0.0095193 -0.0670885 0.2626242 0.2785765 -0.1965324 -0.0621933 -0.0180046 -0.1103337 0.0113738 -0.0889027 
-0.0320568 0.0079261 0.2720887 0.2873237 -0.2239344 -0.0914320 -0.0469819 -0.1302746 0.0815699 -0.1242286 
-0.0006171 0.1060542 0.2029098 0.2929463 -0.2164860 -0.1423893 -0.0368102 -0.1501404 0.0975699 -0.1530373 
-0.0160988 0.1266689 0.1843345 0.2416271 -0.2362559 -0.0573097 -0.0376738 -0.1652744 0.1543099 -0.1943277 
0.0162825 0.1194357 0.1158969 0.2188427 -0.2306738 0.0611232 -0.0424917 -0.1684430 0.1369588 -0.2269314 
-0.0275615 0.0603797 0.1063994 0.1991718 -0.1673927 0.0882524 0.0481993 -0.1589329 0.0904683 -0.2389839 
-0.0080566 -0.0013174 0.0775574 0.1259290 -0.1221473 0.1232325 0.1215359 -0.1332762 0.0107625 -0.1942197 
-0.0524409 0.0041196 0.0044354 0.1310334 -0.0896110 0.1375846 0.1409195 -0.1071790 -0.0185470 -0.1503147 
-0.0757973 0.0774386 -0.0719403 0.0482239 0.0027380 0.0584194 0.1970271 -0.0781495 -0.0339376 -0.1240223 
-0.0683756 0.0946482 -0.0999016 -0.0467291 0.0580199 -0.0079281 0.2277929 -0.0570132 -0.0122349 -0.0882784 
-0.0679439 0.0951733 -0.1404002 -0.0951388 0.0625857 0.0855276 0.2197173 -0.0350732 -0.0577936 -0.0666541 
-0.0508819 0.0562279 -0.1448415 -0.0857173 0.0761274 0.0841293 0.2032483 -0.0236857 -0.0760652 -0.0385414 
-0.0454215 0.0193787 -0.1015378 -0.0838157 0.0667350 0.0969961 0.1371782 -0.0110845 -0.0610134 -0.0174151 
-0.0396132 -0.0302988 -0.0487426 -0.0209313 0.0389717 0.0816291 0.0357145 -0.0041798 -0.0057994 -0.0067500 
-0.0134576 -0.0182319 -0.0064988 -0.0023186 0.0034253 0.0262777 0.0061205 -0.0010681 0.0075878 -0.0018364 
-0.0017569 -0.0020783 -0.0009852 -0.0001467 -0.0022514 0.0028181 0.0005655 -0.0002215 0.0045397 -0.0004831 
-0.0000307 -0.0009289 -0.0007030 -0.0000196 -0.0004772 -0.0005601 0.0023774 -0.0000135 0.0003918 -0.0000362 
0.0000000 -0.0000000 -0.0000000 0.0000000 0.0000000 0.0000000 -0.0000000 -0.0000000 -0.0000000 -0.0000000 
0.0000000 0.0000000 -0.0000000 0.0000000 -0.0000000 -0.0000000 0.0000000 0.0000000 0.0000000 0.0000000 
-0.0001097 0.0002669 0.0000231 0.0007202 -0.0000495 -0.0006826 0.0000899 -0.0000780 -0.0001557 -0.0000247 
-0.0008513 0.0016003 0.0005230 0.0198107 0.0003554 -0.0100615 -0.0059804 -0.0002066 -0.0042343 -0.0009551 
-0.0107766 0.0023355 0.0036121 0.0614987 0.0106244 -0.0467661 0.0001145 -0.0028263 -0.0131007 -0.0047155 
-0.0358419 0.0115087 0.0245090 0.1396930 0.0238423 -0.0886060 -0.0329129 0.0091637 -0.0338425 -0.0175135 
-0.0347342 -0.0089774 0.0688733 0.1952900 0.0245513 -0.1319772 -0.0249823 0.0028800 -0.0498276 -0.0410957 
-0.0394352 -0.0490575 0.1241321 0.2076358 0.0140113 -0.1117778 -0.0203081 -0.0048588 -0.0509705 -0.0693712 
-0.0396049 -0.1140754 0.1996899 0.1829371 -0.0084769 -0.0829713 0.0200485 -0.0069893 -0.0536972 -0.0968605 
-0.0375645 -0.1330963 0.2280652 0.1794094 -0.0207761 -0.0169911 -0.0041689 -0.0352801 -0.0286461 -0.1309514 
0.0092494 -0.1098636 0.2345051 0.1876464 -0.0899742 0.0288680 -0.0109856 -0.0952308 -0.0489626 -0.1052521 
0.0174496 -0.0888567 0.2512452 0.1493809 -0.1270957 0.0276233 -0.1517516 -0.1575571 0.0869325 -0.0073703 
0.0190496 -0.0161004 0.2308147 0.0969678 -0.1547473 -0.0347483 -0.1223463 -0.2002549 0.1790371 0.0023280 
0.1222401 0.0706409 0.2225293 0.0878084 -0.1908282 -0.0636696 -0.1494258 -0.2577183 0.1522471 0.0061762 
0.1560971 0.0923283 0.1991515 0.0489359 -0.0973388 -0.0800355 -0.0858497 -0.2908270 0.1701076 -0.1125694 
0.1534834 0.1050688 0.2077472 0.1117849 -0.0698781 -0.0801788 -0.0989597 -0.3035697 0.1465535 -0.1720515 
0.1400159 -0.0106980 0.2520042 0.1468644 -0.0027280 0.0172099 -0.0867996 -0.3064010 0.1618998 -0.3113678 
0.1751049 -0.0729242 0.2231629 0.0089019 0.0012784 0.0895664 0.0061767 -0.3113125 0.1777165 -0.2976712 
0.1421752 -0.0035738 0.1304780 0.0090943 0.0423490 0.0911014 0.1018200 -0.2758889 0.0402089 -0.2777642 
0.0535223 0.0649930 0.0100649 -0.0057364 0.0810323 0.0355531 0.1649777 -0.2443384 0.0736940 -0.2337625 
-0.0051761 0.1306268 -0.0386732 -0.0902710 0.0795238 0.1089792 0.1471839 -0.1966642 0.0732719 -0.2088011 
0.0086449 0.1884153 -0.0650350 -0.1570318 0.0969441 0.1093095 0.1319316 -0.1294119 -0.0032294 -0.1805374 
-0.0186032 0.1558341 -0.1140631 -0.1647178 0.1623669 0.1875590 0.1095917 -0.0843083 -0.0814247 -0.1522346 
-0.0754033 0.0825796 -0.1340555 -0.1453822 0.1982424 0.2067234 0.1078070 -0.0500029 -0.0908497 -0.0996588 
-0.0755316 0.0083932 -0.0794381 -0.0544457 0.0831936 0.1700904 0.0462047 -0.0185951 -0.0340781 -0.0457933 
-0.0367410 -0.0318107 -0.0190360 -0.0111890 0.0053667 0.0914245 0.0014478 -0.0056549 0.0200866 -0.0138939 
-0.0096082 -0.0059966 -0.0039641 -0.0015573 -0.0047780 0.0250330 0.0049619 -0.0021253 0.0001099 -0.0020755 
-0.0020882 -0.0011364 -0.0010343 -0.0000634 -0.0001093 0.0017773 0.0035197 -0.0000742 -0.0007632 -0.0000281 
0.0000000 -0.0000000 -0.0000000 0.0000000 0.0000000 -0.0000000 0.0000000 -0.0000000 0.0000000 0.0000000 
-0.0000014 -0.0000014 -0.0000059 0.0000867 -0.0000006 -0.0000095 -0.0000004 -0.0000030 -0.0000069 -0.0000576 
-0.0003919 -0.0019569 -0.0013285 0.0025593 -0.0007571 -0.0000296 -0.0001739 0.0043343 -0.0009885 -0.0012671 
-0.0020495 0.0016456 0.0045813 0.0435892 -0.0050025 -0.0327686 -0.0102076 0.0187915 -0.0117903 -0.0067891 
-0.0191320 0.0008065 0.0250689 0.1078042 0.0224463 -0.0824046 -0.0126497 0.0103814 -0.0260002 -0.0263208 
-0.0289124 -0.0205209 0.0594940 0.1748344 0.0584282 -0.1076995 -0.0429188 0.0349123 -0.0461094 -0.0815077 
-0.0364174 -0.0459159 0.1153079 0.2177894 0.0588003 -0.1184637 -0.0623245 0.0689678 -0.0724792 -0.1252648 
-0.0450237 -0.1024807 0.1633915 0.1567777 0.0547209 -0.0500810 -0.0342082 0.0854986 -0.0555463 -0.1730488 
-0.0664310 -0.1695056 0.1600414 0.1444691 0.0199032 0.0228464 -0.0323746 0.1136821 -0.0069326 -0.1856985 
-0.0844176 -0.2093723 0.1671044 0.1860004 -0.0038229 0.0493462 -0.0678229 0.0906624 0.0007478 -0.1284255 
-0.0043257 -0.1697471 0.1308807 0.1749853 -0.0784891 0.0610978 -0.1424612 0.0986725 -0.0145622 -0.0560511 
0.0168438 -0.1132476 0.0571371 0.1026293 -0.1669195 0.0589908 -0.1471945 0.0920081 0.0460829 0.0536696 
0.0332367 -0.1014280 0.0502784 0.0921331 -0.1989027 0.0293526 -0.1228245 0.0013379 0.1152582 0.1015582 
0.1176346 -0.0834997 0.0810533 0.1744150 -0.2523687 -0.0127582 -0.1707264 -0.1154552 0.0596810 0.2020242 
0.1194641 -0.1017562 0.0958276 0.1260793 -0.2806398 0.0488927 -0.1497822 -0.1369432 0.0581080 0.2207498 
0.0999998 -0.1645823 0.0971508 0.1358530 -0.2772161 -0.0298238 -0.1209023 -0.1088450 0.2027392 0.1656267 
0.1513083 -0.1963742 0.0939697 0.1589474 -0.2288228 -0.0367410 -0.1470091 -0.0829647 0.1284302 0.1592561 
0.1954370 -0.1957454 0.0494652 0.0908224 -0.1729709 0.0062201 -0.1126753 -0.0918750 0.1030875 0.1282343 
0.1965950 -0.0756047 0.0299332 0.1215927 -0.1587088 0.0644756 -0.1039542 -0.1424196 -0.0281693 0.0962601 
0.1217631 -0.0137774 -0.0309012 -0.0065607 -0.0479108 0.1139891 -0.0681764 -0.1383650 0.0909210 -0.0209816 
0.0801661 0.0828662 -0.0678956 0.0048579 -0.0116102 0.1090529 -0.0513763 -0.1213778 0.0611428 -0.0858260 
0.1330279 0.0977806 -0.0740467 -0.0455498 0.0759859 0.0703887 -0.0391455 -0.0718248 0.0244844 -0.1711006 
0.1086763 0.0757206 -0.1206074 -0.1398147 0.2334954 0.1791542 -0.0248850 -0.0820344 0.0005099 -0.2302151 
-0.0337282 0.0286988 -0.1867591 -0.1596373 0.2782501 0.3012944 -0.0091230 -0.0872381 0.0626437 -0.1944013 
-0.1222010 -0.0263676 -0.1027819 -0.0806396 0.1106939 0.3652907 -0.0105417 -0.0478856 0.0245256 -0.1100927 
-0.0837281 -0.0379917 -0.0294737 -0.0242033 0.0173221 0.2089119 -0.0139763 -0.0222473 0.0282067 -0.0428203 
-0.0324542 -0.0053829 -0.0049951 -0.0031213 0.0058497 0.0722183 -0.0058931 -0.0070822 -0.0074605 -0.0116787 
-0.0067412 -0.0013106 -0.0008800 -0.0001483 -0.0005380 0.0093241 0.0028248 -0.0004386 -0.0011582 -0.0009341 
-0.0000005 -0.0000004 -0.0000007 -0.0000024 -0.0000017 -0.0000007 -0.0000005 0.0000148 -0.0000009 -0.0000070 
-0.0001189 -0.0001328 -0.0003186 0.0036554 -0.0001449 -0.0005084 -0.0000317 0.0004484 -0.0007207 -0.0021278 
-0.0018390 -0.0016083 0.0069533 -0.0015261 -0.0013154 -0.0056165 -0.0010038 0.0132888 -0.0023144 -0.0050185 
-0.0050280 -0.0025800 0.0125799 0.0490086 -0.0022040 -0.0451783 -0.0184850 0.0481685 -0.0120772 -0.0242044 
-0.0283122 -0.0063324 0.0647599 0.1756782 0.0243663 -0.1532257 -0.0188234 0.0431237 -0.0246030 -0.0766313 
-0.0329139 -0.0460901 0.0972864 0.2259901 0.0695406 -0.1538986 -0.0483166 0.0861801 -0.0394235 -0.1583546 
-0.0386145 -0.0978872 0.1667795 0.1859978 0.0426759 -0.1001254 -0.0849474 0.1543812 -0.0340804 -0.1941794 
-0.0644535 -0.1303153 0.1266040 0.0956514 0.0306448 -0.0036989 -0.0481189 0.1951699 0.0304697 -0.2319532 
-0.1026738 -0.2226899 0.1203236 0.0574096 -0.0189225 0.1204982 -0.0652606 0.1736650 0.0821796 -0.1445293 
-0.0199859 -0.2408328 0.0564047 0.0808664 -0.0561898 0.0950969 -0.1004605 0.2117060 0.0284348 -0.0550399 
0.0221809 -0.2261502 0.0237873 0.0487205 -0.1371914 0.1316360 -0.1499275 0.2350666 0.0311113 0.0207664 
0.0454932 -0.1969872 0.0683204 0.0488331 -0.2131988 0.1229133 -0.1252728 0.2122064 -0.0454368 0.0831292 
0.0438046 -0.1233553 0.0154848 0.1277692 -0.3279791 0.0542358 -0.1414163 0.1787618 -0.0380776 0.2107722 
0.0730615 -0.1284438 0.0824626 0.1209561 -0.3118840 -0.0295859 -0.1994195 0.0901676 -0.0396262 0.3423116 
0.0755152 -0.1380180 0.0476520 0.1915563 -0.3880318 0.0420064 -0.1639760 -0.0096237 -0.1169970 0.4599166 
0.0914959 -0.2222489 -0.0142209 0.1727472 -0.4235276 -0.0739738 -0.1564322 0.0447491 0.0714604 0.5099508 
0.1418010 -0.2105930 -0.0334733 0.0605938 -0.3843674 0.0307516 -0.2212044 0.1319841 0.0342209 0.4502866 
0.2155021 -0.1753326 -0.1450933 0.0982845 -0.2587395 0.0686698 -0.2128910 0.1938958 -0.0581459 0.2738502 
0.1974402 -0.1203981 -0.0782743 0.0643609 -0.2041472 0.0503616 -0.2599449 0.1766002 0.0277900 0.1462115 
0.1224846 -0.0110905 -0.0520094 0.0810056 -0.1269559 0.0897061 -0.2747865 0.0980209 -0.0002621 0.0738873 
0.0543816 0.0284731 -0.0655199 0.0680412 -0.0962560 0.0980373 -0.2197996 0.0844407 0.0151745 0.0330272 
0.0806543 0.0004925 -0.0204950 -0.0249611 0.0207413 0.0967102 -0.1804922 0.0101633 0.0777258 -0.0605392 
0.1213626 -0.0204631 -0.0330476 -0.0872804 0.1671570 0.1622888 -0.1708389 -0.0078765 0.0700665 -0.2013684 
0.0667066 -0.0728172 -0.1994468 -0.1710337 0.2157366 0.3667890 -0.1275148 -0.0478906 0.1962019 -0.2267313 
-0.0829870 -0.1141335 -0.1346062 -0.1249974 0.0829432 0.4988816 -0.0455136 -0.0618943 0.1379794 -0.1556724 
-0.1007870 -0.0595309 -0.0398755 -0.0344595 0.0137121 0.3616504 -0.0439930 -0.0393457 0.0144156 -0.0717865 
-0.0347674 -0.0060126 -0.0063610 -0.0034120 0.0096610 0.0854748 -0.0124091 -0.0082657 -0.0020932 -0.0218149 
-0.0025712 -0.0020651 -0.0007679 -0.0001777 -0.0006761 0.0074381 0.0009272 -0.0005057 -0.0006576 -0.0009439 
0.0020400 -0.0000035 -0.0000612 -0.0000110 -0.0000927 -0.0000067 -0.0000141 -0.0010447 -0.0000133 -0.0007928 
-0.0001796 -0.0001088 0.0008143 -0.0010437 -0.0028340 -0.0004061 -0.0000783 0.0114203 -0.0008707 -0.0067135 
-0.0014622 -0.0008950 0.0044332 -0.0025608 -0.0023317 -0.0073478 -0.0014374 0.0347583 -0.0040645 -0.0190920 
-0.0068552 -0.0019824 0.0129617 0.0516955 -0.0081889 -0.0558182 -0.0160656 0.0973695 -0.0094662 -0.0636502 
-0.0430289 -0.0127061 0.0853399 0.1959397 0.0069703 -0.1985402 -0.0216835 0.1185545 -0.0124604 -0.1183853 
-0.0545634 -0.0511439 0.1142988 0.1969499 0.0436206 -0.1736340 -0.0694421 0.1501313 0.0131478 -0.1693650 
-0.0540726 -0.1052107 0.1152817 0.1365598 0.0051646 -0.1185290 -0.1029129 0.1763135 0.0898400 -0.1424344 
-0.0793548 -0.1439775 0.1052592 0.0674822 -0.0141545 -0.0413158 -0.0879343 0.2371350 0.1313939 -0.1745336 
-0.0634684 -0.2166151 0.0759288 0.0128861 -0.0920345 0.1065299 -0.0806889 0.1855344 0.0865192 -0.0145917 
0.0091427 -0.2716329 0.0737749 0.0168821 -0.0532441 0.0823680 -0.1017630 0.1589571 0.1291968 -0.0436815 
0.0306420 -0.2472858 0.1770207 0.0551584 -0.1355275 0.0851306 -0.1573024 0.1424257 0.0754519 -0.0257135 
0.0160996 -0.1883698 0.1359914 0.0082741 -0.1687960 0.1361245 -0.1326077 0.2208330 0.0157791 -0.0433282 
0.0518603 -0.1010333 0.0555876 0.0520175 -0.2391160 0.0314147 -0.1595438 0.2452865 0.1182362 -0.0547096 
0.0423668 -0.0412677 0.0516332 0.0810301 -0.2357008 -0.0684488 -0.1885392 0.1316800 0.1023099 0.1249365 
0.1146998 -0.0154780 0.1091708 0.1658215 -0.4021484 -0.1163400 -0.2111441 0.1671460 -0.0950862 0.2833586 
0.1646187 0.0041235 0.0802724 0.1819859 -0.4227140 -0.1600957 -0.2567577 0.2425839 -0.0843200 0.2503030 
0.2625432 -0.0897175 -0.0004903 0.1125703 -0.3292625 -0.0985105 -0.3069192 0.2523479 0.0415095 0.1559290 
0.2420022 -0.0117696 -0.0231856 0.1129550 -0.1993252 -0.0448327 -0.3604510 0.2478319 -0.0229369 0.0597120 
0.1959356 -0.0547653 -0.0660704 0.1513967 -0.1075220 -0.0199620 -0.4655956 0.2584998 0.0608547 0.0472285 
0.1022397 -0.0671749 0.0380564 0.1237420 -0.0797509 0.0469211 -0.4209409 0.1647977 0.0994998 -0.0073900 
0.0652178 -0.1033646 0.0001685 0.1523812 -0.0753247 0.1205993 -0.3275818 0.1382928 0.0417013 -0.0120898 
0.0588883 -0.1369102 -0.0114319 0.0988952 -0.0212383 0.1375432 -0.2649664 0.0309412 0.0887670 0.0195118 
0.1545544 -0.1640525 -0.0513486 0.0319576 0.0372153 0.1771424 -0.2517110 0.0484573 0.1626689 -0.1448838 
0.1754205 -0.2003554 -0.1222684 -0.1987479 0.0704465 0.4730405 -0.2107442 -0.0146130 0.2285495 -0.2007281 
-0.0178938 -0.1664692 -0.1560820 -0.1562183 0.0123674 0.6688519 -0.1370888 -0.0817990 0.1861437 -0.1518120 
-0.1018301 -0.0712869 -0.0569564 -0.0421209 -0.0102720 0.4601300 -0.0742962 -0.0520919 0.0267782 -0.0780539 
-0.0314393 -0.0075725 -0.0073542 -0.0040510 -0.0143707 0.1123177 -0.0311108 -0.0131818 0.0172255 -0.0204629 
-0.0027196 -0.0010209 -0.0006317 -0.0001070 -0.0025272 0.0079883 -0.0047390 -0.0024872 0.0074852 -0.0012410 
-0.0000124 -0.0000112 -0.0000112 -0.0000636 -0.0002410 -0.0000404 -0.0000146 0.0009251 -0.0000308 -0.0004998 
-0.0002745 -0.0002069 -0.0004466 -0.0011724 -0.0037545 -0.0006319 -0.0001612 0.0176574 -0.0012053 -0.0098040 
-0.0008233 -0.0008523 -0.0002352 0.0041197 -0.0072618 -0.0044584 -0.0023981 0.0486689 -0.0077265 -0.0290329 
-0.0068816 -0.0029461 0.0166285 0.0587918 -0.0365662 -0.0601366 -0.0211291 0.1416347 -0.0137571 -0.0756385 
-0.0418259 -0.0200997 0.0672010 0.1716625 -0.0386166 -0.1570334 -0.0310837 0.1893155 0.0061880 -0.1457077 
-0.0532962 -0.0698281 0.1294374 0.1257793 -0.0161317 -0.1558574 -0.0911593 0.1657857 0.0735475 -0.1082772 
-0.0653649 -0.0999515 0.0568798 0.0862673 -0.0666380 -0.0616193 -0.1032571 0.1085157 0.1366350 0.0085329 
-0.0701211 -0.1198328 0.0083650 0.0381815 -0.0587400 0.0313548 -0.0444152 0.0796095 0.1426815 -0.0070832 
-0.0551789 -0.1777202 -0.0223190 -0.0235900 -0.0631230 0.1529204 -0.0349598 0.0524520 0.1492073 0.0223113 
0.0034775 -0.2189050 0.0755502 -0.0738767 -0.0386538 0.1194403 -0.1106664 0.0449124 0.1800527 0.0186688 
0.0372346 -0.1827720 0.1401291 -0.1546446 -0.0870474 0.1492086 -0.1321524 0.0262957 0.1395432 0.0642052 
-0.0261377 -0.1018781 0.0813066 -0.2949742 -0.0950084 0.2701077 -0.1218141 0.1187162 0.1346381 0.0350439 
0.0285292 -0.0596549 0.0466763 -0.2301331 -0.0807997 0.1481657 -0.1461265 0.1756773 0.0876613 0.0300044 
0.1150225 0.0448692 0.0729987 -0.0642955 -0.1699042 -0.0008288 -0.1960629 0.1277736 0.0174281 0.0529992 
0.0743522 0.1930752 0.1273030 0.1739274 -0.5016198 -0.1515587 -0.1684297 0.2599077 -0.1673450 0.1603877 
0.0309151 0.2984162 0.1406063 0.2894682 -0.3758995 -0.2819669 -0.2855369 0.3259652 -0.3054350 0.1634673 
0.1374068 0.1117434 0.1040191 0.2283384 -0.0920853 -0.2943600 -0.4005177 0.3569780 -0.1504454 -0.0010772 
0.2161486 0.0071406 0.0573218 0.1465605 -0.0414656 -0.1938806 -0.5042627 0.3264958 -0.0188145 0.0047563 
0.2271937 -0.0801817 0.0609118 0.1147083 -0.0152205 -0.1060044 -0.5010928 0.2448310 0.0162053 0.0386493 
0.1734431 -0.1687473 0.0205976 0.1496496 -0.0207375 -0.0618453 -0.4193119 0.2285234 0.1200222 -0.0215937 
0.0760438 -0.2146737 -0.0092208 0.2345188 -0.0415221 0.0273786 -0.3195262 0.1524689 0.0882535 0.0062791 
0.0359429 -0.2343871 -0.0459337 0.1738074 -0.0342715 0.1773575 -0.2689179 0.1468679 0.1193211 -0.0697866 
0.1375936 -0.2476844 -0.0373945 0.0698752 -0.0393934 0.2543756 -0.2727187 0.0794243 0.1914210 -0.1354989 
0.2315449 -0.2241248 -0.1178560 -0.1301473 -0.0726689 0.5127586 -0.1975396 -0.0431263 0.2209334 -0.1797740 
0.0553773 -0.1477015 -0.1437859 -0.1314651 -0.1404513 0.7929029 -0.1536182 -0.0754592 0.0802938 -0.1360930 
-0.0993050 -0.0614164 -0.0497590 -0.0309162 -0.0879408 0.5551409 -0.1057924 -0.0396062 -0.0118921 -0.0685128 
-0.0316120 -0.0073326 -0.0058277 -0.0044104 -0.0282950 0.1253709 -0.0403798 -0.0066306 0.0196839 -0.0205667 
-0.0014193 -0.0008343 -0.0005714 -0.0001923 -0.0025794 0.0093256 -0.0025454 0.0064571 -0.0061511 -0.0014895 
-0.0000196 -0.0000138 -0.0000168 -0.0000923 -0.0002879 -0.0000543 -0.0000190 0.0012976 -0.0000405 -0.0007533 
-0.0004275 0.0004323 -0.0004913 -0.0014589 -0.0036026 -0.0008949 -0.0002103 0.0183383 -0.0008176 -0.0108674 
0.0029910 -0.0006590 -0.0005904 0.0013222 -0.0198037 -0.0046152 -0.0057728 0.0708204 -0.0067868 -0.0369058 
-0.0103353 -0.0085511 0.0176237 0.0662817 -0.0518687 -0.0450130 -0.0227028 0.1589891 -0.0243203 -0.0801033 
-0.0407431 -0.0199220 0.0068468 0.0729604 -0.0542188 -0.0837392 -0.0446124 0.2167025 0.0608942 -0.1141682 
-0.0423895 -0.0637961 0.0485100 -0.0037481 -0.0701187 -0.0754422 -0.0785210 0.1833272 0.1000288 0.0021496 
-0.0570613 -0.1047817 0.0189494 -0.0548334 -0.1057095 0.0199444 -0.0661867 0.0626360 0.1624016 0.1246413 
-0.0460623 -0.1197280 -0.1153637 -0.1404254 -0.0502138 0.1367749 0.0131643 0.0441726 0.1918833 0.0857980 
-0.0329931 -0.1377011 -0.1082032 -0.2508174 -0.0034804 0.2182945 0.0220461 -0.0317093 0.1789808 0.1455829 
0.0089589 -0.1749740 -0.1233543 -0.3485101 0.1003633 0.2575793 -0.0567192 0.0209497 0.2228565 0.0928498 
-0.0528833 -0.1242615 -0.1221277 -0.4114018 0.0554918 0.2522601 -0.0319456 0.0343257 0.2540541 0.1464884 
0.0069335 -0.0736687 -0.1314577 -0.4391531 0.0538919 0.2735660 -0.0744394 0.0165365 0.1737278 0.1940632 
0.0325652 -0.0193857 -0.1824582 -0.3523260 0.1190678 0.2731877 -0.1093597 0.0051985 0.1447775 0.0887328 
0.0480612 0.1531983 -0.2373169 -0.0180906 -0.2033528 0.1909156 -0.0658068 0.1635869 0.0499273 -0.0811223 
-0.0267104 0.4331818 -0.1045690 0.1892419 -0.5604801 0.0485384 -0.1760150 0.2678938 -0.0622074 -0.0088738 
-0.1216658 0.5105211 -0.0710924 0.2292762 -0.2002575 -0.1041025 -0.3560903 0.4107015 -0.2471299 -0.0501603 
-0.0708350 0.2046924 0.0022588 0.2133659 0.0236894 -0.2070713 -0.4126271 0.4882514 -0.2313682 -0.0103564 
0.1226865 0.0097135 0.0487056 0.1749766 0.0708273 -0.2796416 -0.4149812 0.3463829 -0.1304854 0.0518159 
0.1910440 -0.1398955 0.0410798 0.1671317 -0.0277374 -0.2543135 -0.3809252 0.2898929 0.0442685 0.0694546 
0.1320666 -0.1893793 -0.0055165 0.1923929 -0.0022509 -0.2148254 -0.3285347 0.2671343 0.1205526 0.0283604 
0.1115616 -0.2510077 -0.0152504 0.2244829 -0.1014354 -0.1178125 -0.2421758 0.2587703 0.0740697 0.0587973 
0.0925119 -0.2340113 -0.0395282 0.1097398 -0.0864571 -0.0133459 -0.2070880 0.2312176 0.1192048 0.0277565 
0.2011829 -0.2072072 -0.0492097 0.0072480 -0.1076224 0.0661064 -0.1772267 0.1155726 0.1876735 -0.0365173 
0.2887454 -0.1705069 -0.0937368 -0.0836508 -0.2029644 0.3225770 -0.0920150 -0.0598687 0.1852463 -0.0938262 
0.1170282 -0.1131995 -0.0951096 -0.0831614 -0.1619108 0.6196250 -0.1103210 -0.0763551 0.0250417 -0.1216375 
-0.0883025 -0.0369144 -0.0292490 -0.0167840 -0.0987232 0.5184896 -0.1150306 -0.0308409 -0.0450420 -0.0576029 
-0.0339248 -0.0093085 -0.0002510 -0.0026634 -0.0279697 0.1311086 -0.0368799 -0.0058256 0.0025240 -0.0168097 
-0.0004344 0.0000496 -0.0003736 -0.0000694 -0.0007875 0.0043775 -0.0053125 0.0008729 0.0040965 -0.0024191 
-0.0000218 -0.0000066 -0.0000131 -0.0000531 -0.0000609 -0.0000431 -0.0000102 0.0006653 -0.0000255 -0.0004310 
0.0008867 0.0000811 -0.0003015 -0.0013736 -0.0068436 -0.0025579 -0.0003573 0.0261829 -0.0008084 -0.0149083 
-0.0024924 -0.0003200 -0.0016434 0.0005288 -0.0356526 -0.0066289 -0.0012451 0.1036137 -0.0048751 -0.0512849 
-0.0116911 -0.0057319 -0.0090738 0.0461062 -0.0486385 -0.0407311 -0.0214226 0.1810302 -0.0128925 -0.0769549 
-0.0690052 -0.0105882 -0.0452816 0.0122713 -0.0720137 -0.0378279 -0.0385039 0.2313661 0.0534621 -0.0238790 
-0.0685787 -0.0375172 -0.1033204 -0.1243691 -0.0579108 -0.0002714 -0.0269695 0.1290741 0.1377365 0.1521264 
-0.0082177 -0.0844140 -0.2246631 -0.2222607 -0.0314889 0.1306258 -0.0020066 0.0394377 0.1856363 0.2173514 
0.0166518 -0.1053069 -0.3317034 -0.3414586 0.0366347 0.1468190 0.0800054 0.0652255 0.2589618 0.1741707 
-0.0018699 -0.1290700 -0.3590140 -0.3921901 0.1404134 0.1734147 0.0472672 0.0166932 0.2427636 0.2615919 
-0.0533017 -0.1709198 -0.3919616 -0.3461379 0.2370715 0.1374823 0.0707514 0.0836879 0.2555860 0.1777419 
-0.0412632 -0.1651073 -0.4756359 -0.2956712 0.2588415 0.1588065 0.0403827 0.1037862 0.1846836 0.2311773 
0.0001807 -0.1723879 -0.4781672 -0.1948544 0.2434704 0.2071161 0.0011974 0.0611484 0.1152143 0.2170823 
-0.0305092 -0.0775521 -0.5361413 -0.0924254 0.2418452 0.2819402 0.0570242 -0.0144898 0.1812811 -0.0109730 
-0.0569554 0.2011863 -0.5771876 0.0948256 -0.3082284 0.3360766 0.0538484 0.0522660 0.2845125 -0.0803439 
-0.2667608 0.5865006 -0.4228933 0.2107159 -0.4927873 0.1033107 -0.1808725 0.1881925 0.2700404 0.0045537 
-0.4128869 0.5674734 -0.2759171 0.1825697 -0.0151766 -0.0812752 -0.3898302 0.3638498 -0.0334293 0.0946225 
-0.3782120 0.1802273 -0.1406007 0.0834964 0.2561526 -0.1465656 -0.2834304 0.4211274 -0.1615818 0.1693869 
-0.1169649 -0.0393254 -0.1654227 0.1699260 0.1212201 -0.2096460 -0.2607447 0.3508771 -0.1302020 0.2802825 
0.0071578 -0.0833863 -0.0776718 0.1556826 -0.0416893 -0.2357192 -0.2219064 0.3368748 -0.0516339 0.2122916 
0.0956889 -0.1670606 0.0465716 0.1711361 -0.0454510 -0.3502656 -0.1777892 0.1915569 0.0235208 0.2120922 
0.1168903 -0.1804478 -0.0321055 0.1477212 -0.1216255 -0.4417713 -0.1156174 0.2035299 0.0791448 0.3442813 
0.1640535 -0.1462318 -0.0326114 -0.0523653 -0.1055808 -0.3908393 -0.0071753 0.1782577 0.1419553 0.2505374 
0.2414160 -0.1107927 -0.0760661 -0.0809177 -0.1294017 -0.3556827 0.0447188 0.0918443 0.2531275 0.1217544 
0.2950556 -0.0800657 -0.0956389 -0.0935153 -0.1859783 -0.1211763 0.1189970 -0.0534786 0.2412804 -0.0254800 
0.1690943 -0.0545038 -0.0457614 -0.0605741 -0.1352743 0.1269269 -0.0013105 -0.0674106 0.1516969 -0.0828833 
-0.0454206 -0.0209807 0.0168817 -0.0057653 -0.0606832 0.2371509 -0.0849392 -0.0232433 0.0274229 -0.0404231 
-0.0195153 -0.0063732 0.0030619 -0.0012326 -0.0085719 0.0651242 -0.0404540 -0.0071629 0.0271403 -0.0120165 
-0.0002821 0.0006735 -0.0001045 -0.0000345 -0.0004279 0.0025382 -0.0029582 -0.0007105 0.0023391 -0.0010331 
-0.0000059 -0.0000022 -0.0000060 -0.0000172 -0.0000113 -0.0000102 -0.0000032 0.0006221 -0.0000115 -0.0005546 
-0.0001543 -0.0000730 -0.0001165 -0.0015576 -0.0084237 -0.0028394 -0.0003001 0.0255363 -0.0004544 -0.0116173 
-0.0019296 -0.0005367 -0.0006091 -0.0049259 -0.0305378 -0.0056362 -0.0009490 0.0939937 -0.0029801 -0.0458892 
-0.0138270 -0.0008887 -0.0309268 -0.0004023 -0.0580224 -0.0174447 -0.0174869 0.1852504 0.0043353 -0.0505869 
-0.0695285 -0.0013425 -0.0978589 -0.0426144 -0.0854495 -0.0015482 -0.0455390 0.2133607 0.0335444 0.0969759 
-0.0274674 -0.0269321 -0.2787993 -0.1628770 -0.0301233 0.0446284 0.0027321 0.1088704 0.1224477 0.2475203 
0.0790741 -0.0432968 -0.4871106 -0.2779843 0.0779713 0.1622018 0.0925869 0.0184529 0.1110545 0.2670502 
0.0636743 -0.0574710 -0.5665201 -0.3297182 0.2116146 0.1377667 0.1310577 0.0964372 0.1355047 0.1776540 
0.0014333 -0.1013338 -0.4576832 -0.3023865 0.2848673 0.0877534 0.0976264 0.1242106 0.0800859 0.1854266 
-0.0157740 -0.1485763 -0.4505212 -0.1544028 0.2635961 0.0192339 0.1150847 0.0254642 0.1215337 0.2243616 
0.0252364 -0.2577871 -0.4712025 -0.0273309 0.3711792 0.1724555 0.0604943 -0.0478204 -0.0279105 0.2026861 
0.0348002 -0.3220493 -0.4605842 -0.0449734 0.4800805 0.2667535 0.1472604 -0.1581730 -0.0127667 0.0696520 
0.0421677 -0.1173001 -0.4752633 0.0624398 0.4042724 0.3115835 0.1586866 -0.3837875 0.1409869 -0.1437860 
-0.1305322 0.2408307 -0.4432372 0.1510354 -0.1002266 0.2853288 0.0652500 -0.4442372 0.3674266 0.0083615 
-0.4319667 0.7043154 -0.3676951 0.2806696 -0.2770093 0.0176525 -0.1996269 -0.1733964 0.2532046 0.1938523 
-0.5584919 0.4974675 -0.3269247 0.1417191 0.1232418 -0.1303924 -0.2334452 0.1811484 0.0674236 0.2382537 
-0.5029190 0.1094389 -0.2502592 0.0961375 0.3136977 -0.2997820 -0.0856947 0.3508972 0.0007558 0.2677278 
-0.2257014 0.0058186 -0.2215171 0.1024918 0.1197460 -0.2782580 -0.0949409 0.2971133 -0.0347959 0.3300435 
-0.0460373 -0.0854200 -0.1143901 0.1215162 0.0179632 -0.2335296 -0.1301968 0.2203298 -0.0477941 0.2975586 
0.0262129 -0.1692431 0.0453688 0.0001764 0.0370736 -0.2903216 -0.1581233 0.0649850 0.0887406 0.3551307 
0.0289680 -0.1290576 -0.0170487 -0.1007569 0.0201479 -0.3777655 -0.0527643 0.1010701 0.1651227 0.3620843 
0.1230566 -0.0816782 -0.0371110 -0.2251391 0.0348312 -0.5116700 0.0897520 0.0551661 0.2478499 0.3049424 
0.2804696 -0.0601375 -0.1164539 -0.1707652 -0.0341327 -0.5498549 0.2172950 0.0381645 0.2327867 0.1626282 
0.3318922 -0.0369786 -0.1578738 -0.1092788 -0.1043243 -0.4432710 0.2996862 -0.0394800 0.2238474 0.0357809 
0.2279717 -0.0264100 -0.0046564 -0.0432601 -0.0545155 -0.2557475 0.1347511 -0.0468013 0.1457818 -0.0771138 
-0.0005261 -0.0122500 0.0712336 -0.0002243 -0.0192658 0.0069608 -0.0458577 0.0026191 0.0348721 -0.0375617 
-0.0087815 -0.0047005 0.0361515 -0.0003400 -0.0090165 0.0237035 -0.0391867 0.0040400 0.0098618 -0.0117315 
-0.0000872 0.0004567 0.0031038 -0.0000560 -0.0017693 -0.0005083 -0.0019785 0.0024946 -0.0011719 -0.0004840 
-0.0000005 0.0000325 -0.0000043 -0.0000081 -0.0000008 -0.0000018 -0.0000021 -0.0000037 -0.0000057 -0.0000056 
0.0002481 -0.0000226 -0.0001199 -0.0011846 -0.0055391 -0.0007581 -0.0002699 0.0133924 -0.0001265 -0.0056197 
-0.0010885 -0.0002555 -0.0003240 -0.0034672 -0.0200305 -0.0024036 -0.0004805 0.0601364 -0.0010889 -0.0309978 
-0.0126613 0.0010743 -0.0291974 -0.0047423 -0.0426665 -0.0028909 -0.0169157 0.1211200 0.0013405 -0.0144606 
-0.0448009 0.0001677 -0.1522943 -0.0629140 -0.0187566 0.0222584 -0.0500068 0.1433556 -0.0161208 0.1791117 
0.0204833 -0.0209051 -0.3784081 -0.1587049 0.0904467 0.0657370 0.0474575 0.0752931 0.0037393 0.2548613 
0.1451005 -0.0368065 -0.5312412 -0.2501576 0.2378972 0.0689082 0.1609611 0.0319677 -0.0160424 0.1894130 
0.1517184 -0.0638573 -0.4958732 -0.2858641 0.3000579 0.1310923 0.1033805 0.0203843 -0.0313125 0.1702737 
0.0773334 -0.0792996 -0.3523886 -0.2008804 0.2989532 0.0734579 0.1053963 -0.0213069 -0.0611544 0.1598892 
0.0706447 -0.1841854 -0.2744700 -0.0988162 0.2836856 0.0944877 0.1119887 -0.0778200 -0.0282689 0.1027539 
0.1209998 -0.3861288 -0.1906183 -0.1267620 0.4051891 0.2166228 0.1455762 -0.1585460 -0.1100923 0.0837593 
0.0946293 -0.4380042 -0.1002561 -0.1183084 0.5454375 0.2791442 0.1597395 -0.4245071 0.0531528 -0.0510275 
0.0168878 -0.1699355 -0.1037403 0.0585471 0.3250247 0.3007865 0.1442937 -0.6861226 0.2331235 -0.1188650 
-0.2935646 0.3012897 -0.0410248 0.2216887 -0.0821941 0.1959502 -0.0142651 -0.6928916 0.3229980 0.0820136 
-0.5109545 0.6290295 -0.0911939 0.1849215 -0.0996550 -0.0050383 -0.1167109 -0.3034999 0.1016020 0.2114995 
-0.5963277 0.4144071 -0.2233446 -0.0010904 0.1718907 -0.2375092 0.0180898 0.0229374 0.2001065 0.2308405 
-0.5082366 0.1026034 -0.2125628 0.0714792 0.2730754 -0.3704336 0.0292508 0.1700227 0.0986044 0.3461970 
-0.2487260 -0.0170652 -0.1301622 0.0950840 0.2710987 -0.2271716 -0.0913732 0.1277921 -0.0925022 0.3130255 
-0.0775736 -0.2040045 -0.0933070 0.0989453 0.1873020 -0.1313556 -0.1281730 0.1001183 -0.0142441 0.2622922 
-0.0702917 -0.1943868 -0.0548002 -0.0988781 0.1486414 -0.0909058 -0.0594711 0.0583763 0.0321332 0.3295828 
-0.0930006 -0.1274472 -0.0568130 -0.2241351 0.1885187 -0.1341637 -0.0259383 0.1025027 0.0888055 0.2816712 
0.0766704 -0.0841382 -0.0541621 -0.2270891 0.1173383 -0.2675116 0.1378724 0.0584831 0.0168859 0.2256510 
0.2527582 -0.0638567 -0.1103584 -0.2041255 0.0473199 -0.3296077 0.2842136 0.0287870 0.0474854 0.0473841 
0.3298434 -0.0514191 -0.0982638 -0.1128442 -0.0373389 -0.3614324 0.3811553 -0.0039694 0.0487207 -0.0944516 
0.2173897 -0.0380615 0.0617231 -0.0423381 -0.0577173 -0.2333767 0.1997130 -0.0029770 0.0189713 -0.1233265 
0.0183515 -0.0169729 0.1272353 -0.0045714 -0.0095606 -0.0386471 -0.0398917 0.0093838 0.0051272 -0.0504542 
-0.0028595 -0.0062662 0.0769699 -0.0005884 -0.0073245 -0.0010059 -0.0426665 0.0003921 -0.0037493 -0.0129018 
-0.0005408 -0.0002677 0.0199606 -0.0007229 -0.0049165 -0.0037717 -0.0068591 -0.0010111 -0.0012698 -0.0006010 
-0.0000370 -0.0000028 -0.0000080 -0.0005867 -0.0000226 0.0019631 -0.0000538 -0.0000267 -0.0001263 -0.0010992 
-0.0000784 -0.0000118 -0.0023489 0.0023131 -0.0029000 -0.0004133 -0.0000463 0.0063187 -0.0003501 -0.0024830 
-0.0009222 0.0001140 -0.0017871 0.0001103 -0.0081615 -0.0011207 -0.0001694 0.0299011 -0.0005812 -0.0173833 
-0.0237982 0.0025421 -0.0238257 0.0016369 -0.0052657 -0.0013155 -0.0126100 0.0598245 -0.0072752 0.0100868 
-0.0373879 0.0018490 -0.1105561 -0.0327187 0.0994685 0.0130131 -0.0782163 0.0590492 -0.0516194 0.1371187 
0.1155499 -0.0237419 -0.2968595 -0.1374683 0.2117415 -0.0176100 0.0392713 0.0524523 -0.0816230 0.1382876 
0.1785863 -0.0499439 -0.2818057 -0.2366674 0.2848322 -0.0187305 0.1378041 -0.0193296 -0.1479633 0.1532180 
0.2248481 -0.0832301 -0.1607728 -0.2687173 0.3342091 0.0074339 0.1154043 -0.0601691 -0.2268544 0.1178484 
0.1483281 -0.0960827 -0.0893778 -0.1894164 0.2867543 0.0625436 0.1409928 -0.1112836 -0.2268384 0.0743801 
0.1540681 -0.2177058 -0.0478429 -0.1057196 0.2392597 0.1789118 0.1664476 -0.1957248 -0.1882810 0.0165868 
0.1629139 -0.4201293 0.0041891 -0.1512790 0.2984104 0.2503966 0.2101700 -0.2973982 -0.0527166 -0.0045568 
0.1354472 -0.4240921 0.0518548 -0.1306411 0.3712142 0.1192623 0.2803531 -0.5169733 0.1655601 -0.0519851 
-0.0286565 -0.0833073 0.0630176 0.0785769 0.2098807 0.1383420 0.1323308 -0.6769578 0.2364748 -0.0697014 
-0.3336973 0.3546886 0.1737301 0.1147744 -0.0779165 0.0543098 -0.0508037 -0.5549517 0.3045180 0.0153482 
-0.5596702 0.5554436 0.0589151 0.0947144 -0.0621981 -0.0678034 -0.0091756 -0.2336926 0.2033080 0.0201588 
-0.5853517 0.3579434 -0.0889507 0.0302567 0.1316450 -0.1828227 0.0868042 -0.0489421 0.1414124 0.1580055 
-0.5130243 0.0462292 -0.0927186 -0.0066432 0.3471422 -0.2390792 0.0660366 0.0609309 0.0058303 0.3252961 
-0.2051006 -0.2099307 -0.1292299 0.0355958 0.3958946 -0.2189498 -0.1304927 0.1795541 -0.0022898 0.2849491 
-0.0772322 -0.3038077 -0.0673860 0.0479365 0.2530646 -0.1321650 -0.1431689 0.3115403 -0.0462065 0.1574249 
-0.0858514 -0.2371379 -0.0936492 -0.0479629 0.2826442 -0.1332871 -0.0540413 0.3267856 -0.0746428 0.1171427 
-0.0261524 -0.1494309 -0.0550288 -0.1019736 0.1676183 -0.0522444 0.0268975 0.2262051 -0.1784436 0.1425528 
0.1120570 -0.0997042 -0.1034541 -0.0581917 0.0792402 -0.1045918 0.1446640 0.1498076 -0.1709513 0.0511242 
0.1909477 -0.0700502 -0.1070831 -0.1258225 0.0471749 -0.1129230 0.2782752 0.1460847 -0.1594330 -0.0871707 
0.2931208 -0.0513466 -0.0341755 -0.0845134 -0.0305774 -0.1710905 0.2993406 0.0933746 -0.1221920 -0.1919407 
0.2073221 -0.0280275 0.0950841 -0.0384531 -0.0639927 -0.1234235 0.1477783 0.0142206 -0.0673384 -0.1431699 
0.0145391 -0.0136600 0.1527794 -0.0111420 -0.0278234 -0.0488958 -0.0237825 0.0043989 -0.0085516 -0.0378621 
-0.0019602 -0.0018561 0.0860865 -0.0037025 -0.0159563 -0.0062113 -0.0454404 -0.0013608 -0.0050499 -0.0045490 
-0.0000703 -0.0000251 0.0024777 -0.0005263 -0.0005299 -0.0002671 -0.0008138 -0.0000154 -0.0002093 -0.0000204 
-0.0000132 -0.0000010 -0.0000027 -0.0001930 -0.0000100 0.0006315 -0.0000180 0.0000151 -0.0000429 -0.0003657 
-0.0000716 -0.0000084 -0.0049598 0.0060708 -0.0000150 -0.0002583 -0.0000139 -0.0000366 -0.0006716 -0.0000356 
-0.0009627 0.0010597 -0.0033076 0.0073971 0.0022854 -0.0013769 -0.0002935 0.0086529 -0.0011259 -0.0123284 
-0.0284994 0.0009653 0.0164877 0.0129377 0.0120615 -0.0066853 -0.0276059 0.0299626 -0.0089990 -0.0006252 
-0.0023894 -0.0043701 0.0158123 0.0116694 0.0831381 -0.0164770 -0.1162279 0.0123044 -0.0547506 0.0712909 
0.1753385 -0.0432625 -0.0043590 -0.0638907 0.1481695 -0.1061498 -0.0032400 -0.0314921 -0.1451237 0.0740096 
0.1578082 -0.0864517 0.0386730 -0.1522247 0.2176562 -0.1149500 0.1285348 -0.0300764 -0.2062608 0.0472916 
0.2337671 -0.1048702 0.0482245 -0.2299520 0.2956133 -0.1391609 0.1607090 -0.0996831 -0.2187821 0.0541344 
0.1866069 -0.1254758 0.0590554 -0.2497307 0.3229517 -0.0251391 0.1669860 -0.2101937 -0.1828071 0.0577463 
0.2065953 -0.2374451 0.0476876 -0.2053295 0.2737105 0.1141607 0.1789803 -0.2622873 -0.0752663 -0.0408064 
0.2280347 -0.3383555 0.0235264 -0.1612709 0.1912019 0.1361467 0.2827461 -0.3163956 -0.0583818 0.0127482 
0.0632483 -0.2202819 0.0208319 -0.0520779 0.2195497 0.0859490 0.3163208 -0.4488696 0.0123405 0.0029894 
-0.1606855 0.0229135 0.0671851 0.0724448 0.1136987 0.0881238 0.1328971 -0.5066442 0.2225184 -0.0524517 
-0.4784532 0.3910407 0.1855291 0.1377704 -0.0652241 -0.0502919 0.0355959 -0.3587079 0.3326125 -0.1298715 
-0.6236782 0.5719178 0.0798324 0.1188280 0.0336553 -0.2172242 0.1306272 -0.1949296 0.2539272 -0.1529561 
-0.5642551 0.2014978 0.0121442 0.0392204 0.2581447 -0.2447886 0.1171351 -0.0100183 0.0855853 0.1053344 
-0.4069786 -0.0515293 -0.0042214 -0.0567133 0.4195406 -0.2062000 0.0054004 0.0195106 -0.0267415 0.3079326 
-0.1836340 -0.3478502 -0.0686954 -0.0277381 0.3357047 -0.1681179 -0.0802067 0.3599271 -0.0859183 0.2665289 
-0.0488838 -0.3290722 -0.0966875 -0.0073144 0.1779877 0.0093893 -0.0801635 0.3995837 -0.1140913 0.0892520 
-0.0385969 -0.2586227 -0.0594386 0.0950070 0.1648148 -0.0611691 -0.0109009 0.3337910 -0.1857029 0.0208183 
0.0588606 -0.1755414 -0.1263623 0.1350516 0.0289650 -0.0610251 0.0812947 0.3208778 -0.2650988 0.0029779 
0.1021990 -0.1167304 -0.0942712 0.1021050 -0.0041301 -0.0309168 0.1377897 0.2680414 -0.2545379 -0.1095488 
0.1830668 -0.0842475 -0.1156180 0.0747948 0.0137349 -0.0587853 0.1521359 0.2063137 -0.1907586 -0.1806368 
0.2460407 -0.0581208 -0.0161939 0.0274844 -0.0556891 -0.0436227 0.1789117 0.0790580 -0.1483718 -0.2094963 
0.1484350 -0.0341089 0.1952292 -0.0015604 -0.1227261 -0.0391412 0.0818217 0.0017188 -0.0910208 -0.1386475 
0.0000892 -0.0139943 0.2358927 -0.0176059 -0.0593947 -0.0333716 -0.0347477 -0.0150388 -0.0219273 -0.0399016 
-0.0034386 -0.0038740 0.1071315 -0.0028108 -0.0032944 -0.0112158 -0.0560501 -0.0026338 -0.0119802 -0.0118337 
-0.0005974 -0.0004610 0.0116190 -0.0002977 -0.0009467 -0.0029644 -0.0039659 -0.0002132 -0.0013462 -0.0008263 
-0.0000064 -0.0000006 -0.0000006 -0.0000052 -0.0000151 -0.0000647 -0.0000020 0.0001360 -0.0000086 -0.0000329 
-0.0000470 0.0000249 -0.0025251 0.0039836 -0.0000187 -0.0001510 -0.0000145 -0.0004825 -0.0003594 -0.0004105 
-0.0020123 0.0008706 -0.0042031 0.0243501 -0.0029262 -0.0039722 -0.0009904 0.0003839 -0.0026504 -0.0088501 
-0.0292856 -0.0016523 0.0683509 0.0572157 -0.0304567 0.0004086 -0.0406378 -0.0019335 -0.0095875 -0.0124218 
0.0062532 -0.0090066 0.1365754 0.0938202 -0.0447431 -0.0272563 -0.1316895 0.0161794 -0.0699732 0.0298405 
0.2002484 -0.0624318 0.1577492 0.0144194 0.0329043 -0.1041637 -0.0321313 -0.0529303 -0.1594970 0.0058327 
0.2106616 -0.1392900 0.1854216 -0.1054647 0.1230381 -0.1383907 0.1168063 -0.0417809 -0.1640944 -0.0469069 
0.1969674 -0.1690845 0.0890448 -0.1756340 0.2718466 -0.2753502 0.1986535 -0.0472231 -0.0923247 0.0031042 
0.2108816 -0.1884903 0.0055686 -0.2643433 0.3261196 -0.2634372 0.1947277 -0.1396952 0.0346120 0.0840564 
0.2268184 -0.1865363 0.0868356 -0.2281032 0.2113028 -0.2116678 0.2491615 -0.2038315 0.0661907 -0.0101703 
0.2262908 -0.1479401 0.0977296 -0.2243223 0.0384787 -0.1162539 0.3562638 -0.3157292 0.0252251 0.0602575 
0.0391765 -0.1128020 0.1434141 -0.1125050 0.0062258 -0.1013311 0.4098673 -0.4099967 0.0711261 0.0668251 
-0.2796347 -0.0180267 0.2612331 0.0038608 0.0525698 -0.0552471 0.0868605 -0.2797604 0.2749580 -0.0468133 
-0.5566425 0.3698169 0.2566301 0.0980518 0.0624169 -0.1360119 0.0414293 -0.1638983 0.2174395 -0.1892317 
-0.5741063 0.5177856 0.1075791 -0.0318759 0.2499541 -0.2338481 0.1349681 -0.1193351 0.0770746 -0.1281960 
-0.4412145 0.0389145 0.0311215 -0.1383527 0.4414915 -0.1752006 0.0584577 0.0763847 0.0410824 0.0673154 
-0.2649318 -0.2054963 0.1034448 -0.1452028 0.3990808 -0.1874220 -0.0766603 0.1042847 0.0513414 0.2215615 
-0.0671541 -0.4214570 0.0952100 -0.0186437 0.2837538 -0.0862108 -0.1169500 0.2538427 -0.0755972 0.1532063 
0.0023786 -0.3411580 0.0109873 0.1405970 0.1737119 -0.0438998 0.0280798 0.2138609 -0.2192863 0.0347285 
0.0283801 -0.2427275 -0.0009757 0.1926324 0.0898529 -0.0146888 0.0741559 0.2351301 -0.2629612 -0.0987981 
0.0926376 -0.1727089 -0.0381559 0.1462269 0.0854489 0.0198135 0.0361296 0.2024703 -0.2405720 -0.1312900 
0.1162855 -0.1149942 0.0904716 0.1689152 0.0282167 0.0004012 0.0312726 0.1539625 -0.2471531 -0.2273780 
0.1552717 -0.0872254 0.0841185 0.1750199 -0.0623841 0.0361139 0.0543623 0.0581657 -0.2118339 -0.2016085 
0.1609424 -0.0671070 0.1283364 0.1164808 -0.0960167 0.0299420 0.0716206 -0.0126180 -0.1031574 -0.2284229 
0.0573888 -0.0386082 0.2825010 0.0355213 -0.0997617 0.0025362 0.0191201 -0.0263334 -0.0855009 -0.1468630 
-0.0227662 -0.0235550 0.3428317 -0.0265758 -0.0656578 -0.0294281 -0.0622347 -0.0213479 -0.0505052 -0.0407609 
-0.0093419 -0.0082769 0.1431435 -0.0058448 -0.0258256 -0.0154750 -0.0498192 -0.0021928 -0.0165624 -0.0098050 
-0.0007984 -0.0002125 0.0169057 -0.0003372 -0.0008158 -0.0052129 -0.0080518 -0.0001373 -0.0010621 -0.0002775 
0.0000000 -0.0000000 0.0000000 -0.0000000 -0.0000000 -0.0000000 -0.0000000 0.0000000 0.0000000 0.0000000 
-0.0000313 0.0001368 -0.0010095 0.0014104 -0.0000138 -0.0001116 -0.0000220 -0.0000140 -0.0002275 -0.0001175 
-0.0036790 -0.0003066 0.0018953 0.0305630 -0.0027365 -0.0068771 -0.0019232 -0.0013681 -0.0029819 -0.0125860 
-0.0341228 -0.0030717 0.0916277 0.1195702 -0.0667249 0.0038019 -0.0454132 -0.0126550 -0.0196897 -0.0333224 
0.0056387 -0.0178858 0.2215257 0.1646501 -0.0801242 0.0112833 -0.1657386 0.0046596 -0.0812686 -0.0627403 
0.1795105 -0.1085901 0.2495541 0.0640982 -0.0553363 0.0635294 -0.1021389 -0.0498908 -0.1488937 -0.0918424 
0.2138589 -0.2112187 0.2062374 -0.0570370 0.0123146 0.1389992 0.0316139 -0.1206867 -0.1205410 -0.0935404 
0.1730672 -0.2295083 0.1092472 -0.1005419 0.1541519 -0.1371985 0.1738154 -0.1668886 0.0301008 -0.0062451 
0.1479553 -0.1932912 0.0787087 -0.2071382 0.2200381 -0.2782359 0.2187923 -0.1845901 0.1579353 0.0398257 
0.2321171 -0.1272573 0.1312846 -0.3682820 0.1308580 -0.2863128 0.2443344 -0.2122262 0.2168563 0.0386279 
0.2701242 -0.0251193 0.1874240 -0.4304215 -0.0106066 -0.2852548 0.4037001 -0.3135912 0.1223293 0.0814159 
0.0369517 -0.0854024 0.2494054 -0.3700372 -0.0422920 -0.2473837 0.4101896 -0.2301411 0.2230760 0.0556336 
-0.2481207 0.0815143 0.2979790 -0.2595293 0.0723823 -0.3193585 0.1714284 -0.0999271 0.3187489 -0.0151172 
-0.5010420 0.3558576 0.2347023 -0.2146548 0.2505666 -0.3072730 0.0833904 0.0200260 0.1608829 -0.0824559 
-0.4997636 0.3673759 0.0735336 -0.2739665 0.4256458 -0.2372104 0.0889010 0.0820356 0.0080269 -0.0345783 
-0.3222665 -0.0225173 0.0851688 -0.1697372 0.3895011 -0.1111338 -0.0165403 0.0775461 -0.0693160 0.1592952 
-0.1148638 -0.2873305 0.0697617 0.0092905 0.3138680 -0.0138132 -0.0821366 0.0056918 0.0370309 0.0625011 
0.0249523 -0.3674480 0.0298442 0.1326183 0.1578220 0.0461463 0.0169745 0.0358725 -0.1052809 0.0284987 
0.0106682 -0.2798726 0.0481088 0.1126477 0.0893438 0.0871304 0.1180426 0.0730659 -0.2050661 -0.0540688 
0.0367693 -0.1900519 0.0253641 0.2173436 -0.0350965 0.0320492 0.1195819 0.0390973 -0.1476277 -0.0974292 
0.0652885 -0.1385611 0.0478278 0.0973492 -0.0169138 0.0779551 0.0503324 0.0399245 -0.1010984 -0.1221043 
0.0719436 -0.0981737 0.1285098 0.2001738 -0.0262402 0.0525244 0.0293806 -0.0200467 -0.1320094 -0.2060622 
0.1401000 -0.0706035 0.1627164 0.2350315 -0.1225330 0.0084360 0.0431498 -0.0433621 -0.1208170 -0.2321182 
0.0767291 -0.0626975 0.1988298 0.1344154 -0.1023552 0.0621301 0.0267701 -0.0533209 -0.0573997 -0.2231011 
0.0118974 -0.0421003 0.3581417 -0.0331579 -0.0979413 0.0495369 -0.0418588 -0.0201459 -0.0427743 -0.1415974 
-0.0201677 -0.0320452 0.3552232 -0.0457659 -0.0668536 -0.0311662 -0.0566324 -0.0025082 -0.0688452 -0.0312388 
-0.0056554 -0.0059441 0.0914743 -0.0053575 -0.0180644 -0.0081234 -0.0324885 0.0042509 -0.0141951 -0.0058969 
0.0035126 -0.0005435 0.0071186 -0.0002295 -0.0039196 -0.0008557 -0.0037921 -0.0003675 -0.0004167 -0.0005067 
-0.0000138 -0.0000107 -0.0000091 -0.0001620 -0.0007689 -0.0000842 -0.0000096 0.0009243 -0.0000641 0.0001980 
-0.0000105 0.0000230 -0.0000770 0.0002042 -0.0000059 -0.0000648 -0.0000091 0.0000126 -0.0000395 -0.0000331 
-0.0035733 -0.0005113 -0.0081852 0.0320680 -0.0056037 -0.0046077 -0.0015304 0.0032433 -0.0030973 -0.0082024 
-0.0537671 -0.0043703 0.0666159 0.2020377 -0.0602898 0.0001108 -0.0443013 -0.0106752 -0.0424852 -0.0528754 
-0.0234220 -0.0340011 0.2468196 0.2274301 -0.0937698 0.0782050 -0.1576896 -0.0312147 -0.1148661 -0.0974913 
0.1228056 -0.1483672 0.3046230 0.1756487 -0.0924913 0.1640442 -0.1831601 -0.1022899 -0.0917345 -0.1490786 
0.1645055 -0.2765830 0.2183880 0.0573063 -0.0799977 0.3444525 -0.0634944 -0.2210965 -0.0287260 -0.1147547 
0.1576958 -0.2599461 0.2477618 -0.0799016 -0.0289282 0.1526088 0.1118690 -0.2466639 0.0539132 -0.1084088 
0.1698433 -0.1335332 0.1361344 -0.1347827 0.0207337 -0.0422483 0.1782843 -0.2626569 0.1482027 -0.0799773 
0.2222063 -0.0403967 0.1302940 -0.2941914 -0.0175435 -0.1417843 0.2120276 -0.2860234 0.2385338 -0.0231224 
0.2732026 -0.0605724 0.2107341 -0.3765926 -0.1671633 -0.1840437 0.3041029 -0.2943942 0.2283086 0.0664180 
0.0623530 -0.0458141 0.1956805 -0.3583716 -0.1073919 -0.1687331 0.3522776 -0.1869912 0.2308548 0.0261361 
-0.2232514 0.0905445 0.2892947 -0.3768058 0.0836444 -0.1676568 0.3572892 -0.0873338 0.1796226 -0.1453476 
-0.4014504 0.2226427 0.2369829 -0.3214931 0.2039333 -0.0777365 0.1668926 0.0624405 0.0288963 -0.1211082 
-0.3591529 0.1876758 0.1234945 -0.2549887 0.2476283 -0.0134421 0.0535535 0.0723427 -0.1123659 0.0552548 
-0.1795214 -0.0954679 0.0299716 0.0143220 0.2203822 -0.0125194 0.0532257 -0.0285480 -0.0554820 0.0536370 
-0.0558206 -0.2397146 0.1035828 0.2043224 0.1404819 0.0138072 0.1312718 -0.1254837 -0.0906828 -0.0817645 
-0.0020900 -0.1917464 0.1383996 0.1969133 -0.0948267 0.0780439 0.1720471 -0.0928861 -0.1226151 -0.0812397 
-0.0032816 -0.1371186 0.0912388 0.1873030 -0.0978846 0.0175555 0.1894699 -0.0753664 -0.0606228 -0.1112930 
0.0046352 -0.1051009 0.0553514 0.1909040 -0.1107169 0.0563204 0.0736534 -0.0774954 -0.0423939 -0.0451573 
0.0061489 -0.0615205 0.0400413 0.1295694 -0.0730128 0.0957011 0.0394074 -0.1035809 -0.0182702 -0.0544837 
0.0607679 -0.0620747 0.1259690 0.2673093 -0.1043868 0.0536023 0.0570041 -0.1453198 -0.0849644 -0.1679068 
0.0996041 -0.0713989 0.2042740 0.2553067 -0.1979544 0.0532750 0.0220921 -0.1396700 -0.0205507 -0.2049781 
0.0280981 -0.0614865 0.3378227 0.0666437 -0.1323014 0.0927959 -0.0050145 -0.1222249 -0.0056707 -0.1986623 
-0.0174149 -0.0308975 0.4151391 -0.0787205 -0.0943812 0.0842339 -0.0604593 -0.0652416 -0.0421916 -0.1100665 
-0.0165723 -0.0074875 0.2557198 -0.0353431 -0.0549797 -0.0182606 -0.0312876 -0.0111298 -0.0547133 -0.0259459 
-0.0028499 0.0002286 0.0347717 -0.0048352 -0.0045394 -0.0047291 -0.0129850 0.0036012 -0.0068751 -0.0017878 
-0.0014991 0.0009726 0.0095395 -0.0003912 -0.0001094 -0.0018419 -0.0054516 -0.0000830 -0.0008701 -0.0002658 
-0.0000002 0.0000190 -0.0000097 -0.0000018 -0.0000002 -0.0000003 -0.0000006 -0.0000005 -0.0000053 -0.0000005 
0.0013963 0.0000694 -0.0004678 0.0001279 -0.0010760 -0.0002035 -0.0002820 0.0032845 -0.0002766 -0.0025722 
-0.0044089 -0.0009023 -0.0069117 0.0216366 -0.0081032 0.0091001 -0.0019602 0.0044933 -0.0046005 -0.0083433 
-0.0492321 -0.0071386 0.0220711 0.2216219 -0.0297420 0.0066314 -0.0427253 -0.0176823 -0.0600660 -0.0437383 
-0.0325139 -0.0460870 0.1963879 0.2661959 -0.0832317 0.1009269 -0.1332131 -0.0538665 -0.1172983 -0.0973001 
0.0894198 -0.1707631 0.2138321 0.2779538 -0.0985301 0.1642920 -0.1875644 -0.1452583 -0.0081474 -0.1352344 
0.1573331 -0.2122795 0.1999138 0.1508119 -0.1512374 0.3018717 -0.1133976 -0.2309047 0.0501648 -0.1522762 
0.1655899 -0.1596182 0.2710129 0.0576962 -0.2046314 0.2186433 0.0195938 -0.2805302 0.0657596 -0.1535159 
0.1607530 -0.0877160 0.2180285 0.0113619 -0.2560019 0.2255135 0.0919450 -0.2750915 0.0918041 -0.1805965 
0.1941690 -0.0037944 0.2146547 -0.0710211 -0.2946178 0.1029221 0.1889453 -0.2676978 0.1677882 -0.2313482 
0.2852500 -0.0344001 0.2309639 -0.1617309 -0.3186995 0.0258207 0.3048095 -0.2552455 0.1401256 -0.2168936 
0.2133644 -0.0154031 0.2432826 -0.2324353 -0.2496579 0.0481837 0.4317862 -0.1751634 -0.0157507 -0.2482067 
0.0531197 0.0048376 0.2360276 -0.2444768 -0.2259669 0.0593664 0.4058932 -0.0535243 0.0165092 -0.2517857 
-0.1302771 0.1414467 0.2310652 -0.1765904 -0.0947757 0.0759559 0.2072591 0.0178106 -0.1060445 -0.1658498 
-0.1429946 0.0444042 0.1201567 -0.0773133 0.0378232 0.0333955 0.1767348 0.0649093 -0.1356769 -0.1214390 
-0.0888078 -0.0287956 0.0933075 0.0544019 0.0522066 0.0254458 0.1815439 -0.0873651 -0.0507111 -0.1512260 
-0.0444655 0.0000731 0.1032315 0.1573024 -0.0247496 -0.0246919 0.1994673 -0.1941136 -0.0492452 -0.1228085 
0.0027448 -0.0284279 0.1185505 0.2278755 -0.1150289 -0.0005354 0.1682257 -0.1943923 -0.0275514 -0.1514605 
-0.0187189 0.0136037 0.0761950 0.2098586 -0.1275452 0.0495700 0.1188770 -0.2228888 0.0254263 -0.1243777 
-0.0421140 0.0231658 0.0281709 0.1775531 -0.1542454 0.0512530 0.0921873 -0.1886640 0.0313516 -0.0186583 
0.0007588 -0.0019919 0.0747499 0.1484372 -0.1272179 0.0865012 0.0831254 -0.2490795 0.0249823 -0.0402655 
0.0475353 -0.0301826 0.1571788 0.2449707 -0.1158021 0.0643084 0.0592610 -0.2732002 0.0063682 -0.1604374 
0.0553659 -0.0509476 0.2524527 0.1392986 -0.2018611 0.0927079 0.0119811 -0.2181661 0.0770699 -0.1579013 
-0.0131435 -0.0328309 0.2962579 0.0100882 -0.1355761 0.1244152 -0.0465859 -0.1290226 0.0554761 -0.1290783 
-0.0247109 -0.0039339 0.2701865 -0.0623213 -0.0767773 0.0832304 -0.0606430 -0.0369738 -0.0355211 -0.0525355 
-0.0147412 0.0056454 0.1815292 -0.0251881 -0.0297273 -0.0065915 -0.0454469 -0.0087369 -0.0419625 -0.0147802 
-0.0027309 0.0006324 0.0455198 -0.0043568 -0.0012898 -0.0073838 -0.0179125 -0.0013740 -0.0075738 -0.0035305 
-0.0004383 0.0005487 0.0045647 -0.0002000 -0.0000079 -0.0006431 -0.0034172 -0.0000250 -0.0003407 -0.0000413 
0.0000000 -0.0000000 0.0000000 -0.0000000 0.0000000 0.0000000 0.0000000 0.0000000 -0.0000000 0.0000000 
0.0035287 -0.0000677 -0.0009954 0.0002650 -0.0000951 -0.0002364 -0.0006736 -0.0000754 -0.0005249 -0.0011252 
-0.0028298 -0.0034106 0.0029112 0.0192350 -0.0030091 0.0053920 -0.0020215 -0.0041104 -0.0055368 -0.0066200 
-0.0402722 -0.0106390 0.0366337 0.2012370 -0.0283803 0.0084381 -0.0309900 -0.0306057 -0.0691231 -0.0362984 
-0.0191666 -0.0335186 0.1791409 0.2666369 -0.0767580 0.0560351 -0.1123170 -0.0821249 -0.1098329 -0.0680949 
0.0899418 -0.1051284 0.1924121 0.2500647 -0.1371923 0.1484238 -0.1886492 -0.1504911 -0.0118016 -0.0875800 
0.1239096 -0.0537955 0.1995145 0.2293510 -0.2031898 0.1775371 -0.1794684 -0.2406798 0.0974213 -0.1505999 
0.1160619 -0.0213890 0.2785727 0.1604104 -0.2934006 0.1133543 -0.0459134 -0.2772223 0.1933012 -0.2237751 
0.1266488 0.0332220 0.2224937 0.1507826 -0.3664838 0.2404849 0.0220809 -0.2442652 0.0737917 -0.2587554 
0.1760722 0.0479767 0.2083703 0.1269351 -0.3685871 0.2035391 0.1605126 -0.2437568 0.0173316 -0.3283936 
0.3087575 0.0658353 0.1791416 -0.0429702 -0.3528613 0.1005812 0.2805543 -0.2090739 0.0518343 -0.3817989 
0.3202587 0.0552984 0.2240494 -0.1392439 -0.2287819 0.1516467 0.3032939 -0.1697465 -0.1020037 -0.4147711 
0.2276080 0.0184018 0.1356766 -0.2137652 -0.2082055 0.0671100 0.3921738 -0.0296677 -0.0056850 -0.3836469 
0.0853974 0.0007914 0.0745767 -0.1025502 -0.2357427 0.0458220 0.3363167 0.0075621 -0.0246674 -0.1875060 
-0.0151891 0.0046700 0.0430603 0.0184386 -0.0998679 -0.0366916 0.3784318 0.0172347 -0.1057221 -0.2043648 
-0.0021786 -0.0167413 0.0531605 0.0269739 -0.0359696 -0.0187527 0.2903919 -0.1052658 -0.0071851 -0.1844333 
-0.0374611 0.0968811 0.0576900 0.1001007 -0.0267724 0.0545331 0.2010751 -0.2130367 -0.1153310 -0.1176789 
-0.0386065 0.1357026 0.0217104 0.1547475 -0.0387217 0.0852396 0.1256344 -0.2510699 -0.0494247 -0.1452116 
-0.0919383 0.1446114 0.1136693 0.1853994 -0.0950599 0.0644494 0.1671423 -0.3246118 -0.0060131 -0.1576487 
-0.0924560 0.0756526 0.1651516 0.1542220 -0.1288725 0.0533926 0.0982174 -0.2871549 0.0184960 -0.0566488 
-0.0475560 0.0201877 0.1539160 0.2179593 -0.0901432 0.0221846 0.0684909 -0.3271730 0.0631818 -0.0810480 
0.0108307 -0.0114749 0.2084799 0.1441360 -0.0745174 0.0692937 -0.0139440 -0.2897283 0.0964874 -0.1395631 
-0.0009699 -0.0368732 0.2419354 0.0210390 -0.1190503 0.1949312 -0.0738702 -0.2232011 0.0983832 -0.1023242 
-0.0458279 -0.0317133 0.2668362 -0.0329131 -0.0966764 0.1318896 -0.0568787 -0.1122606 0.0416733 -0.0641293 
-0.0337924 -0.0080665 0.2251135 -0.0541194 -0.0512350 0.0448603 -0.0481355 -0.0282416 -0.0450173 -0.0013661 
-0.0103897 0.0010694 0.0919184 -0.0163235 -0.0211858 0.0098771 -0.0219716 -0.0070761 -0.0293871 0.0034688 
-0.0007997 0.0014886 0.0195775 -0.0025708 -0.0005371 -0.0022313 -0.0047745 -0.0009365 -0.0066445 -0.0025717 
-0.0000047 0.0000644 -0.0000322 -0.0000109 -0.0000074 0.0000725 -0.0000034 -0.0000043 -0.0000668 -0.0000072 
-0.0000003 0.0000308 -0.0000092 -0.0000054 -0.0000006 -0.0000008 -0.0000009 -0.0000030 -0.0000096 -0.0000011 
-0.0000521 -0.0000134 0.0000016 0.0005074 -0.0000151 -0.0001278 -0.0000366 -0.0000697 -0.0000763 -0.0001179 
-0.0043238 -0.0058345 0.0098595 0.0268763 -0.0008586 -0.0049752 -0.0010034 -0.0096726 -0.0054944 -0.0045733 
-0.0287872 0.0018314 0.0405897 0.1321653 -0.0214245 0.0029363 -0.0159198 -0.0341559 -0.0492080 -0.0280273 
-0.0386633 0.0199095 0.1017247 0.2073020 -0.0507259 0.0608047 -0.0785380 -0.0754356 -0.0942770 -0.0521011 
0.0444243 0.0941446 0.1353597 0.1575909 -0.0917864 0.0512218 -0.1543126 -0.1228314 -0.0409732 -0.0728379 
0.0935166 0.1285898 0.1490280 0.1613760 -0.1999678 0.0947256 -0.2199037 -0.1871843 0.1067085 -0.1268885 
0.1038799 0.1232285 0.1435570 0.1131083 -0.2670811 0.1254770 -0.1286240 -0.2070526 0.1802543 -0.1867474 
0.0647357 0.1104183 0.1128546 0.0939374 -0.2419138 0.1660002 0.0035142 -0.1706620 0.0611847 -0.2000694 
0.1045568 0.0622898 0.1922956 -0.0059881 -0.2429149 0.1359727 0.0901601 -0.1853041 0.0481563 -0.1992244 
0.2096915 0.0808327 0.1413156 -0.0526614 -0.2168885 0.0848237 0.1900994 -0.1753555 -0.0268931 -0.2349644 
0.2746256 -0.0693396 0.1262615 -0.1107361 -0.1362672 0.1144920 0.2706569 -0.1195363 -0.0431183 -0.3070384 
0.1918926 -0.1378633 0.0633915 -0.1004918 -0.1503392 0.0897112 0.3993706 -0.0688671 -0.0334135 -0.2533910 
0.0715377 -0.1375739 0.0491078 -0.0649732 -0.1766165 0.0523441 0.4312927 -0.0796962 0.0542052 -0.1996276 
0.0261757 -0.0276813 -0.0031739 -0.0371413 -0.1083845 0.0577337 0.3875104 -0.0935134 -0.0036242 -0.1979012 
0.0092717 0.0348123 -0.0456166 0.0147213 -0.0319284 0.0632531 0.2666499 -0.1114535 -0.0285004 -0.1712094 
-0.0300699 0.0769138 0.0413511 0.0806684 -0.0550621 0.0490718 0.1915610 -0.1316936 -0.0906177 -0.1321228 
-0.1071616 0.1356165 0.1137987 0.0819662 -0.0158673 0.0520816 0.1992198 -0.2273614 -0.0274101 -0.2048823 
-0.1110057 0.1407188 0.1879711 0.1659204 -0.0458518 -0.0000965 0.1640018 -0.2855155 -0.0185093 -0.1976332 
-0.1163258 0.0633992 0.2381092 0.1911222 -0.0040630 0.0262221 0.0530992 -0.3055512 -0.0035689 -0.1424430 
-0.0571299 0.0374338 0.1286538 0.1004066 0.0135010 0.1136892 -0.0152137 -0.2944831 0.0617156 -0.0885734 
-0.0307737 0.0040307 0.1843016 -0.0041455 -0.0065079 0.1849383 -0.0789737 -0.2450583 0.0555329 -0.0633445 
-0.0395205 -0.0609457 0.2417564 -0.0517210 -0.0427926 0.1828153 -0.0582864 -0.1902771 0.0655812 -0.0466096 
-0.0378973 -0.0430585 0.2625954 -0.0803440 -0.0397380 0.1032092 -0.0449561 -0.0991184 -0.0089823 -0.0117101 
-0.0233681 0.0002554 0.1553829 -0.0562450 -0.0311658 0.0353179 -0.0266875 -0.0237851 -0.0512501 0.0215454 
-0.0044103 0.0062958 0.0548477 -0.0123632 -0.0168767 0.0132192 -0.0130406 -0.0061858 -0.0199691 -0.0015169 
0.0034984 -0.0007264 0.0074029 -0.0021210 -0.0004651 0.0003397 -0.0012577 -0.0006187 -0.0025092 -0.0035427 
0.0000151 -0.0000002 -0.0000019 -0.0000018 -0.0000005 -0.0000032 -0.0000019 -0.0000004 -0.0000047 -0.0000005 
-0.0000003 0.0000299 -0.0000089 -0.0000052 -0.0000005 -0.0000008 -0.0000008 -0.0000029 -0.0000093 -0.0000011 
-0.0000024 0.0000073 -0.0000056 0.0000265 -0.0000010 -0.0000070 -0.0000010 -0.0000046 -0.0000071 -0.0000051 
-0.0016711 -0.0055747 0.0062458 0.0247803 -0.0004840 -0.0038930 -0.0003881 -0.0095257 -0.0043907 -0.0050988 
-0.0195463 -0.0014789 0.0266764 0.0883910 -0.0165922 -0.0019818 -0.0054559 -0.0276436 -0.0278584 -0.0145103 
-0.0735249 0.0455170 0.0696436 0.1483239 -0.0313543 0.0503466 -0.0358733 -0.0442061 -0.0897058 -0.0391669 
-0.0105453 0.2063168 0.0712960 0.1397022 -0.0633109 -0.0150885 -0.0891900 -0.0295694 -0.1204107 -0.0892002 
0.0637511 0.2151147 0.1245652 0.1206782 -0.1169789 -0.0500778 -0.1746309 -0.0455871 -0.0095127 -0.1273218 
0.0845464 0.1583208 0.1504816 0.0499378 -0.1628309 0.0097548 -0.1944397 -0.0078755 0.0820736 -0.1699688 
0.1232184 0.0947045 0.1872311 -0.0197297 -0.1709944 0.0559942 -0.1610424 -0.0391929 0.0302315 -0.1004203 
0.1349228 0.0458376 0.1908331 0.0229795 -0.1636510 0.0761160 -0.1010059 -0.0941253 -0.0267803 -0.0851267 
0.1535334 -0.0547922 0.1302431 0.0251163 -0.1053739 0.0114290 -0.0120133 -0.0968417 0.0160686 -0.0673692 
0.2064851 -0.2100147 0.1107616 0.0318612 -0.0827709 0.0803011 0.0003359 -0.1468218 0.0968025 -0.0869400 
0.1963247 -0.3048662 0.0439150 -0.0578416 -0.1186254 0.1496101 0.1007504 -0.1080927 0.1618324 -0.0630068 
0.2427296 -0.2610949 -0.0345062 -0.0520795 -0.0944087 0.1845366 0.1019005 -0.1540904 0.1800980 -0.1130850 
0.1532558 -0.0846312 -0.0830667 -0.0444050 -0.0922324 0.1136591 0.0483611 -0.0782921 0.1496551 -0.0823038 
0.0960783 0.0186305 -0.1077471 0.0145706 -0.0366192 0.0621887 0.0970732 -0.0368145 0.0660974 -0.1734581 
0.0228602 0.0883432 -0.0316098 0.0290173 -0.0378182 0.1051398 0.0502388 -0.0750853 -0.0003110 -0.1507749 
-0.0250778 0.1877696 0.0357867 0.0766132 0.0309380 0.0534319 -0.0062360 -0.1725593 0.0054691 -0.1861354 
-0.0837207 0.1543921 0.1667163 0.0973532 0.0617231 0.0750250 -0.0533403 -0.2302755 0.0217050 -0.2095783 
-0.0900295 0.0577425 0.1841373 0.1218520 0.1442679 0.0972426 -0.0666066 -0.2397734 -0.0040008 -0.2048320 
-0.0982130 0.0165206 0.1919445 0.0367425 0.1007628 0.1111009 -0.0643206 -0.2543427 0.0130602 -0.0532552 
-0.0766011 -0.0340735 0.1966214 -0.0617495 0.0928639 0.0970740 -0.0568370 -0.2089051 0.0519676 -0.0003609 
-0.0352589 -0.0616489 0.2021157 -0.0457070 0.0055343 0.0932654 -0.0620346 -0.1450064 0.0080772 0.0406633 
-0.0193014 -0.0295806 0.1446204 -0.0488311 -0.0244539 0.0710610 -0.0442771 -0.0841978 -0.0143298 0.0492903 
-0.0140942 -0.0040003 0.0791213 -0.0318812 -0.0156331 0.0290520 -0.0195315 -0.0204362 -0.0244686 0.0218719 
-0.0020201 0.0035210 0.0240539 -0.0083973 -0.0085082 0.0131370 -0.0058814 -0.0081381 -0.0079298 0.0001630 
0.0004232 0.0008422 -0.0032156 -0.0001383 0.0003942 0.0037155 -0.0001712 -0.0002050 -0.0007979 -0.0008469 
0.0000280 -0.0000004 -0.0000036 -0.0000034 -0.0000009 -0.0000058 -0.0000035 -0.0000008 -0.0000086 -0.0000010 
-0.0000000 0.0000000 -0.0000000 0.0000000 -0.0000000 0.0000000 0.0000000 0.0000000 0.0000000 -0.0000000 
-0.0000000 -0.0000000 0.0000000 -0.0000000 0.0000000 -0.0000000 -0.0000000 0.0000000 -0.0000000 0.0000000 
-0.0003295 -0.0001633 -0.0005726 0.0138278 -0.0001920 -0.0006755 -0.0000949 -0.0071742 -0.0013088 -0.0033170 
-0.0079134 -0.0092768 -0.0079603 0.0699597 -0.0051195 0.0011969 -0.0016032 -0.0176311 -0.0163138 -0.0053385 
-0.0517641 0.0171490 -0.0086678 0.1536513 -0.0156826 0.0278487 -0.0089777 0.0154637 -0.0891030 -0.0399176 
-0.0504137 0.1395477 -0.0313364 0.1880788 -0.0368102 0.0272653 -0.0274100 0.0629553 -0.2104182 -0.0614586 
-0.0132196 0.1834568 -0.0293209 0.2104678 -0.0548090 -0.0338651 -0.0671321 0.1275929 -0.2299328 -0.0932380 
0.0360115 0.1082856 -0.0054648 0.1710022 -0.0762664 -0.0402254 -0.1328731 0.1702525 -0.1397059 -0.0910163 
0.0726446 0.0222301 0.0124554 0.0326239 -0.0686869 0.0623831 -0.1891807 0.0122046 0.0512041 -0.0078783 
0.1504772 -0.0173094 0.0180610 0.0597676 -0.0401034 0.1025065 -0.2261722 -0.0177117 0.0392337 -0.0687493 
0.2255142 -0.0977410 -0.0204087 0.0730796 -0.0269431 0.1498076 -0.2697560 -0.0318140 0.0289402 -0.0306787 
0.2715422 -0.1683294 0.0225783 0.0701912 -0.0224387 0.1314959 -0.2631538 -0.0941452 0.1139987 -0.0617391 
0.2762529 -0.1338373 -0.0072821 -0.0373664 -0.0777553 0.1318193 -0.1965988 -0.1101280 0.2311803 -0.0762845 
0.2557331 -0.1582227 -0.0851298 0.0302257 -0.0717288 0.0505279 -0.1440228 -0.0976568 0.3193895 -0.0991152 
0.1962189 -0.1233571 -0.0856077 -0.0342393 -0.0365271 0.0807035 -0.1348763 -0.0093701 0.2399899 -0.0929348 
0.1040264 0.0155136 -0.0971555 -0.0292861 -0.0100644 0.0635106 -0.1270545 0.0259754 0.2308804 -0.1763459 
-0.0022512 0.0968069 -0.0636937 -0.0572520 0.0351240 0.0992567 -0.1492653 -0.0325679 0.2121496 -0.1383070 
-0.0426383 0.1533208 -0.0114523 0.0408437 0.0833409 0.0173284 -0.1406016 -0.0779124 0.1140076 -0.1362367 
-0.1366713 0.0557492 0.1129079 0.1101675 0.1502014 -0.0401778 -0.0858248 -0.1466994 0.1128140 -0.1324666 
-0.1600474 0.0144288 0.1655026 0.0110914 0.1579485 0.0195330 -0.0619166 -0.1977261 0.1052941 -0.0541083 
-0.1378265 -0.0193049 0.1315134 -0.0520053 0.1493008 0.0565715 -0.0535083 -0.2083800 0.0885550 0.0450843 
-0.0776348 -0.0472631 0.1394995 -0.0691061 0.0959511 0.0177941 -0.0504519 -0.1760216 0.0421054 0.1251273 
-0.0351837 -0.0409291 0.1225612 -0.0582034 -0.0028650 0.0258459 -0.0309722 -0.1154507 -0.0039655 0.1391624 
-0.0163240 -0.0284539 0.0756815 -0.0328354 -0.0198438 0.0340415 -0.0185068 -0.0810899 0.0055297 0.0818011 
-0.0081924 -0.0065301 0.0418263 -0.0112198 -0.0137521 0.0222051 -0.0097010 -0.0239443 -0.0149643 0.0242725 
-0.0012073 -0.0000407 0.0176192 -0.0053605 -0.0006608 0.0087629 -0.0026314 -0.0089233 -0.0048750 -0.0026831 
-0.0001464 0.0029591 -0.0020380 0.0006409 0.0004382 0.0021514 -0.0001346 -0.0002581 -0.0026897 -0.0009228 
-0.0000000 -0.0000000 0.0000000 0.0000000 0.0000000 -0.0000000 -0.0000000 0.0000000 0.0000000 -0.0000000 
-0.0000000 0.0000000 -0.0000000 -0.0000000 0.0000000 0.0000000 -0.0000000 -0.0000000 0.0000000 0.0000000 
0.0000000 0.0000000 0.0000000 -0.0000000 0.0000000 -0.0000000 -0.0000000 -0.0000000 0.0000000 0.0000000 
-0.0006276 -0.0000293 -0.0008743 0.0051850 -0.0000394 -0.0002833 -0.0000282 -0.0024859 -0.0001500 -0.0006670 
-0.0012977 -0.0071081 -0.0208385 0.0446971 -0.0008849 0.0020767 -0.0002185 0.0044550 -0.0135887 -0.0072924 
-0.0115841 -0.0121394 -0.0408785 0.1093514 -0.0086695 -0.0058667 -0.0016732 0.0535744 -0.0711880 -0.0109265 
-0.0223484 0.0180633 -0.0898519 0.1486263 -0.0170875 -0.0109736 -0.0078048 0.1438081 -0.1645129 0.0020814 
-0.0416852 0.0270177 -0.1430459 0.2379755 -0.0321753 -0.0231870 -0.0188107 0.2052716 -0.2216738 0.0103131 
-0.0686038 -0.0414445 -0.1650270 0.2802403 -0.0529960 0.0031041 -0.0406142 0.2273556 -0.2030227 0.0610081 
-0.0615412 -0.1173946 -0.1572956 0.2397640 -0.0556315 0.0317794 -0.0790462 0.1829764 -0.0576640 0.0740533 
-0.0539386 -0.1388059 -0.1567655 0.2112709 -0.0244072 0.1475612 -0.1186390 0.1295033 0.0024863 0.0017344 
-0.0309707 -0.1930352 -0.1787513 0.2603628 -0.0343209 0.1367158 -0.1537428 0.1284288 0.0359812 0.0293323 
-0.0117377 -0.2301545 -0.1309103 0.2479642 -0.0129642 0.1468038 -0.1907299 0.1095621 0.1143378 -0.0421713 
0.0613711 -0.2203395 -0.0638903 0.2008044 -0.1025759 0.1850675 -0.1917300 0.0960465 0.1215438 -0.0862976 
0.0562209 -0.2469344 -0.0409419 0.2342979 -0.1102408 0.2139055 -0.2058248 0.1232057 0.1124379 -0.1361260 
0.0145569 -0.2179781 0.0062659 0.1760620 -0.0705881 0.1916274 -0.1970677 0.1225335 0.1315381 -0.1569498 
-0.0447377 -0.1672575 -0.0321734 0.0857851 -0.0720181 0.1496644 -0.1696932 0.1255778 0.1912854 -0.0664328 
-0.1006815 -0.1484044 -0.0381878 0.0913072 -0.0260646 0.0659950 -0.1290952 0.0644012 0.2289083 -0.0081782 
-0.1193948 -0.0401889 0.0078379 0.0429860 -0.0540321 0.0721094 -0.0985827 0.0422039 0.0821930 0.0648683 
-0.1356528 -0.0040573 0.0332061 -0.0573565 0.0113015 0.0567222 -0.0740332 -0.0528552 0.1466744 0.0760508 
-0.1203110 -0.0017995 -0.0145165 -0.0772782 0.0566463 0.0194853 -0.0583085 -0.0957352 0.1666956 0.1251216 
-0.0963846 -0.0138005 -0.0081167 -0.0565551 0.0407689 0.0120480 -0.0372658 -0.1169175 0.0535668 0.2226565 
-0.0646693 -0.0121561 0.0208544 -0.0307797 0.0190829 0.0030298 -0.0286320 -0.0994379 -0.0164907 0.2091984 
-0.0279910 -0.0133717 0.0106358 -0.0192757 0.0018816 0.0283617 -0.0174090 -0.0805668 -0.0320261 0.1497613 
-0.0096057 -0.0072894 0.0148312 -0.0106101 -0.0052976 0.0221122 -0.0076827 -0.0679933 -0.0127109 0.0842463 
-0.0018283 -0.0021039 0.0403403 -0.0078415 -0.0096634 0.0153938 -0.0016764 -0.0244004 -0.0104530 0.0022328 
-0.0001405 0.0010928 0.0233460 -0.0018424 0.0013728 -0.0026687 -0.0002244 -0.0097872 -0.0039832 -0.0071653 
-0.0000026 0.0002357 0.0032494 -0.0000098 -0.0000530 -0.0000615 -0.0000261 -0.0000073 -0.0007161 -0.0026088 
0.0000000 0.0000000 -0.0000000 -0.0000000 -0.0000000 0.0000000 -0.0000000 -0.0000000 -0.0000000 -0.0000000 
0.0000000 0.0000000 0.0000000 0.0000000 -0.0000000 -0.0000000 -0.0000000 -0.0000000 0.0000000 -0.0000000 
-0.0000000 -0.0000000 0.0000000 0.0000000 0.0000000 -0.0000000 0.0000000 -0.0000000 0.0000000 0.0000000 
-0.0000181 -0.0000023 -0.0000323 0.0005484 -0.0000310 -0.0000091 -0.0000032 -0.0007791 -0.0000603 0.0003870 
-0.0001317 -0.0005843 -0.0053787 -0.0007708 -0.0000897 0.0042705 -0.0000491 0.0080872 -0.0022495 -0.0031040 
-0.0017122 -0.0094142 -0.0182572 0.0148568 -0.0022441 0.0033920 -0.0006398 0.0456721 -0.0333860 0.0017325 
-0.0083703 -0.0207199 -0.0355672 0.0395452 -0.0181816 -0.0126404 -0.0020223 0.0760112 -0.0697648 0.0517101 
-0.0249842 -0.0332051 -0.0532895 0.0801637 -0.0485833 -0.0174243 -0.0055552 0.1085510 -0.0849888 0.0793158 
-0.0464554 -0.0603192 -0.0916474 0.1349085 -0.0908335 -0.0170041 -0.0103437 0.1696167 -0.1085223 0.1206006 
-0.0757141 -0.0704706 -0.1374734 0.2165138 -0.1357004 -0.0098486 -0.0224567 0.2345989 -0.1495377 0.1500887 
-0.1134867 -0.1028865 -0.1458342 0.2614039 -0.1397492 0.0474318 -0.0319026 0.2548390 -0.1517982 0.1219827 
-0.1507886 -0.1711426 -0.1347470 0.3058575 -0.1459857 0.0632104 -0.0363714 0.2258425 -0.1000547 0.1441796 
-0.1521553 -0.1668083 -0.1287512 0.3095735 -0.2097024 0.1011919 -0.0408644 0.2834784 -0.0920853 0.0961233 
-0.1697079 -0.1440042 -0.1059187 0.3253922 -0.2643271 0.1197002 -0.0437816 0.2593464 -0.1000210 0.1233218 
-0.1552978 -0.1644771 -0.0880330 0.2713129 -0.2240241 0.1336017 -0.0561461 0.2318675 -0.0731978 0.1243937 
-0.1581800 -0.1618243 -0.0596284 0.1644306 -0.2048411 0.0752675 -0.0588151 0.2456352 0.0094422 0.1485133 
-0.1445129 -0.1525754 -0.0441759 0.0753903 -0.2012416 0.1015513 -0.0540623 0.2392966 0.0674109 0.1129189 
-0.1201194 -0.1135587 -0.0504838 0.0476290 -0.2476228 0.0919656 -0.0453702 0.2010521 0.0628440 0.1736641 
-0.1113278 -0.0609000 -0.0519078 -0.0009795 -0.2603795 0.0740037 -0.0362605 0.1711741 0.0549611 0.2216160 
-0.0872391 -0.0237974 -0.0638522 -0.0076989 -0.2048074 0.0242057 -0.0277937 0.1012463 0.0315425 0.2581943 
-0.0564834 -0.0160777 -0.0720534 0.0095696 -0.1612290 0.0087382 -0.0184671 0.0142735 0.0200811 0.2716481 
-0.0486150 -0.0073746 -0.0499674 -0.0147759 -0.0916077 -0.0031054 -0.0107511 -0.0540884 -0.0043517 0.2846371 
-0.0344919 -0.0028589 -0.0392102 -0.0209731 -0.0589023 0.0198085 -0.0061025 -0.0392281 -0.0192815 0.2012400 
-0.0143341 -0.0021168 -0.0283388 -0.0057412 -0.0244110 0.0357467 -0.0034840 -0.0256960 -0.0150469 0.0834221 
-0.0040877 -0.0014578 -0.0153264 -0.0024949 -0.0071140 0.0291098 -0.0018627 -0.0216235 -0.0078397 0.0326969 
-0.0012495 -0.0002201 -0.0029567 -0.0001967 -0.0073903 0.0167435 -0.0004497 -0.0017956 -0.0030458 0.0005610 
-0.0000041 -0.0000062 0.0028822 -0.0000770 -0.0002559 -0.0000135 -0.0000215 -0.0001634 -0.0005966 -0.0017440 
-0.0000024 -0.0000061 0.0034523 -0.0000056 -0.0000558 -0.0000066 -0.0000219 -0.0000066 -0.0005803 -0.0027669 
0.0000000 -0.0000000 -0.0000000 -0.0000000 0.0000000 0.0000000 -0.0000000 0.0000000 -0.0000000 0.0000000 
0.0000000 -0.0000000 0.0000000 0.0000000 -0.0000000 0.0000000 -0.0000000 0.0000000 0.0000000 0.0000000 
0.0000000 0.0000000 -0.0000000 0.0000000 -0.0000000 -0.0000000 -0.0000000 -0.0000000 -0.0000000 -0.0000000 
0.0000000 -0.0000000 -0.0000000 0.0000000 -0.0000000 0.0000000 -0.0000000 0.0000000 -0.0000000 -0.0000000 
-0.0000036 -0.0000941 -0.0000269 -0.0000780 -0.0000232 -0.0000226 -0.0000119 -0.0000799 -0.0002514 0.0005916 
-0.0002168 -0.0012723 -0.0007501 -0.0006100 -0.0010483 -0.0017218 -0.0001793 -0.0041541 -0.0064863 0.0164390 
-0.0035679 -0.0024036 -0.0020303 0.0026659 -0.0029966 -0.0041735 -0.0004058 -0.0069530 -0.0131246 0.0329895 
-0.0067773 -0.0047311 -0.0047945 0.0047472 -0.0196396 -0.0076228 -0.0010363 -0.0068379 -0.0187067 0.0653989 
-0.0126379 -0.0074680 -0.0094733 0.0095729 -0.0412661 -0.0191518 -0.0018867 0.0244683 -0.0159840 0.0738267 
-0.0199578 -0.0101042 -0.0109932 0.0044849 -0.0720791 -0.0264320 -0.0037559 0.0612664 -0.0206135 0.0981842 
-0.0350375 -0.0135723 -0.0115218 0.0002570 -0.1124701 -0.0195433 -0.0054815 0.0936775 -0.0372555 0.1409475 
-0.0343602 -0.0253245 -0.0128098 0.0022707 -0.1261013 -0.0067134 -0.0066295 0.1061079 -0.0514525 0.1550126 
-0.0321095 -0.0292228 -0.0187826 -0.0006267 -0.1536787 0.0168052 -0.0084124 0.1130071 -0.0482941 0.1613147 
-0.0277460 -0.0332106 -0.0153472 -0.0074930 -0.1762811 0.0170616 -0.0095906 0.0933099 -0.0547239 0.2140209 
-0.0399175 -0.0451499 -0.0188641 -0.0072239 -0.1907545 -0.0051697 -0.0116434 0.1556804 -0.0603430 0.2233855 
-0.0481363 -0.0406560 -0.0169922 -0.0189463 -0.2253678 -0.0225882 -0.0115640 0.1726367 -0.0608862 0.2725004 
-0.0402679 -0.0269280 -0.0188101 -0.0174538 -0.1934420 0.0021972 -0.0100384 0.1990107 -0.0590275 0.1647598 
-0.0321893 -0.0170456 -0.0234655 -0.0065419 -0.1791260 -0.0041260 -0.0089422 0.1804847 -0.0446646 0.1356164 
-0.0318730 -0.0088068 -0.0228824 -0.0034446 -0.1632362 -0.0148170 -0.0079743 0.1673923 -0.0301382 0.1157803 
-0.0230477 -0.0070258 -0.0176859 -0.0021307 -0.1462442 -0.0318635 -0.0065018 0.1325704 -0.0216098 0.1235390 
-0.0091479 -0.0037143 -0.0104320 -0.0012101 -0.1027324 -0.0182023 -0.0042407 0.0623898 -0.0196238 0.1069138 
-0.0117622 -0.0017522 -0.0096434 -0.0030499 -0.0500367 -0.0021297 -0.0028171 -0.0085354 -0.0150448 0.1047713 
-0.0127089 -0.0010791 -0.0077056 -0.0044464 -0.0297751 0.0032056 -0.0018590 0.0019704 -0.0095653 0.0619633 
-0.0066712 -0.0003906 -0.0029616 -0.0006623 -0.0124733 0.0023502 -0.0005694 0.0081035 -0.0048586 0.0181333 
-0.0009431 -0.0001090 -0.0001329 -0.0001869 -0.0009790 -0.0001224 -0.0001037 -0.0032414 0.0000153 0.0058031 
-0.0000057 -0.0000004 -0.0000024 -0.0000048 -0.0003136 -0.0000077 -0.0000053 -0.0000232 -0.0000080 0.0003711 
-0.0000023 -0.0000015 -0.0000037 -0.0000011 -0.0000023 -0.0000019 -0.0000010 0.0000282 -0.0000037 -0.0000106 
-0.0000000 -0.0000000 0.0000000 -0.0000000 0.0000000 -0.0000000 -0.0000000 0.0000000 -0.0000000 0.0000000 
0.0000000 0.0000000 0.0000000 -0.0000000 -0.0000000 0.0000000 0.0000000 -0.0000000 -0.0000000 -0.0000000 
-0.0000000 0.0000000 -0.0000000 -0.0000000 -0.0000000 0.0000000 -0.0000000 -0.0000000 0.0000000 -0.0000000 
-0.0000000 0.0000000 0.0000000 -0.0000000 -0.0000000 -0.0000000 0.0000000 0.0000000 -0.0000000 0.0000000 
-0.0000000 0.0000000 0.0000000 0.0000000 0.0000000 0.0000000 0.0000000 0.0000000 0.0000000 0.0000000 
-0.0000000 0.0000000 0.0000000 -0.0000000 0.0000000 0.0000000 0.0000000 -0.0000000 0.0000000 0.0000000 
-0.0000059 -0.0000090 -0.0000067 -0.0000029 -0.0000070 -0.0000037 -0.0000027 0.0001120 -0.0000348 -0.0000394 
-0.0000707 -0.0000314 -0.0000283 -0.0000176 -0.0000493 -0.0000341 -0.0000170 0.0006658 -0.0001054 -0.0003120 
-0.0001604 -0.0000592 -0.0000724 -0.0000566 -0.0014453 -0.0000941 -0.0000488 0.0013288 -0.0001712 0.0007791 
-0.0002980 -0.0001027 -0.0001414 -0.0001315 -0.0083505 -0.0003627 -0.0001211 0.0036537 -0.0003065 0.0061606 
-0.0005559 -0.0001256 -0.0001707 -0.0001831 -0.0089552 -0.0006572 -0.0001619 0.0070984 -0.0004313 0.0041426 
-0.0009852 -0.0001807 -0.0002529 -0.0004700 -0.0054240 -0.0007481 -0.0002024 0.0070368 -0.0006778 0.0019044 
-0.0011023 -0.0015500 -0.0007563 -0.0014134 -0.0114542 0.0009393 -0.0003759 0.0168245 -0.0035121 0.0024004 
-0.0015465 -0.0006371 -0.0006455 -0.0012312 -0.0088358 0.0032301 -0.0004338 0.0133150 -0.0019047 -0.0013104 
-0.0025242 -0.0011359 -0.0006782 -0.0018103 -0.0126764 0.0014655 -0.0006165 0.0204938 -0.0032048 0.0006869 
-0.0041405 -0.0012553 -0.0008002 -0.0027903 -0.0127964 -0.0037823 -0.0007833 0.0488257 -0.0033997 -0.0190777 
-0.0063879 -0.0010499 -0.0009531 -0.0040731 -0.0272052 -0.0070229 -0.0011939 0.0533888 -0.0041641 -0.0013388 
-0.0061080 -0.0005705 -0.0008340 -0.0033496 -0.0150073 -0.0043334 -0.0009747 0.0451263 -0.0034525 -0.0104962 
-0.0045893 -0.0005028 -0.0007531 -0.0036581 -0.0129624 -0.0036145 -0.0008451 0.0477849 -0.0024324 -0.0184272 
-0.0030644 -0.0009005 -0.0007109 -0.0031423 -0.0128439 -0.0040477 -0.0007744 0.0526891 -0.0024188 -0.0247862 
-0.0028566 -0.0019463 -0.0007247 -0.0027323 -0.0149167 -0.0057046 -0.0006574 0.0490124 -0.0024767 -0.0169970 
-0.0016335 -0.0001303 -0.0003115 -0.0015988 -0.0093860 -0.0033986 -0.0003091 0.0261917 -0.0012997 -0.0081243 
-0.0019452 -0.0000628 -0.0008413 -0.0007019 -0.0028440 -0.0022786 -0.0001708 0.0066127 -0.0010556 0.0032875 
-0.0025552 -0.0000315 -0.0004955 -0.0003174 -0.0045416 -0.0019370 -0.0002698 0.0090101 -0.0006245 0.0017624 
-0.0061030 -0.0000361 -0.0014508 -0.0001731 -0.0034764 -0.0015483 -0.0002276 0.0115503 -0.0006296 0.0020947 
-0.0013346 -0.0000059 -0.0000296 -0.0000225 -0.0002422 -0.0001918 -0.0000191 0.0024127 -0.0001081 -0.0004590 
-0.0000000 -0.0000000 -0.0000000 0.0000000 -0.0000000 -0.0000000 -0.0000000 0.0000000 0.0000000 0.0000000 
0.0000000 0.0000000 -0.0000000 -0.0000000 -0.0000000 0.0000000 -0.0000000 0.0000000 0.0000000 0.0000000 
0.0000000 -0.0000000 -0.0000000 -0.0000000 -0.0000000 -0.0000000 -0.0000000 -0.0000000 -0.0000000 -0.0000000 
0.0000000 0.0000000 -0.0000000 -0.0000000 -0.0000000 0.0000000 0.0000000 0.0000000 -0.0000000 -0.0000000 
-0.4035700 0.3627417 0.1178890 -0.2884063 0.0255575 1.3620063 -0.0988149 0.6735430 -1.4897621 -0.2611841 
