<svg width="26" height="26" viewBox="0 0 26 26" fill="none" xmlns="http://www.w3.org/2000/svg">
<path d="M23.6108 18.9109C23.805 18.9109 23.9624 18.7535 23.9624 18.5594V6.64469C23.9624 5.20956 23.0504 3.95172 21.7131 3.49539V2.52297C21.7131 1.6832 21.0299 1 20.1901 1C19.3504 1 18.6672 1.6832 18.6672 2.52297V3.31703H16.92V2.52297C16.92 1.6832 16.2368 1 15.397 1C14.5572 1 13.874 1.6832 13.874 2.52297V3.31703H12.1267V2.52297C12.1267 1.6832 11.4435 1 10.6037 1C9.76397 1 9.08077 1.6832 9.08077 2.52297V3.31703H7.33355V2.52297C7.33355 2.11619 7.17511 1.73373 6.88744 1.44606C6.59977 1.15839 6.21732 1 5.81054 1C4.97077 1 4.28757 1.6832 4.28757 2.52297V3.49525C2.94985 3.95088 2.03757 5.20867 2.03757 6.64464V21.6723C2.03757 23.5072 3.53058 25 5.36569 25H20.6343C22.4694 25 23.9624 23.5072 23.9624 21.6723V19.9656C23.9624 19.7715 23.805 19.6141 23.6108 19.6141C23.4166 19.6141 23.2593 19.7715 23.2593 19.9656V21.6723C23.2593 23.1195 22.0817 24.2969 20.6343 24.2969H5.36569C3.91829 24.2969 2.74069 23.1195 2.74069 21.6723V8.90477H23.2593V18.5594C23.2593 18.7535 23.4167 18.9109 23.6108 18.9109ZM19.3703 2.52297C19.3703 2.07091 19.738 1.70312 20.1901 1.70312C20.6422 1.70312 21.0099 2.07091 21.0099 2.52297V5.02722C21.0099 5.47928 20.6422 5.84706 20.1901 5.84706C19.738 5.84706 19.3703 5.47928 19.3703 5.02722V2.52297ZM14.5771 2.52297C14.5771 2.07091 14.9449 1.70312 15.3969 1.70312C15.849 1.70312 16.2168 2.07091 16.2168 2.52297V5.02722C16.2168 5.47928 15.849 5.84706 15.3969 5.84706C14.9449 5.84706 14.5771 5.47928 14.5771 5.02722V2.52297ZM9.78385 2.52297C9.78385 2.07091 10.1516 1.70312 10.6037 1.70312C11.0558 1.70312 11.4235 2.07091 11.4235 2.52297V5.02722C11.4235 5.47928 11.0558 5.84706 10.6037 5.84706C10.1516 5.84706 9.78385 5.47928 9.78385 5.02722V2.52297ZM2.74069 8.20164V6.64469C2.74069 5.59544 3.35813 4.66698 4.28757 4.25027V5.02703C4.28757 5.8668 4.97077 6.55 5.81054 6.55C6.3076 6.55 6.77424 6.30667 7.05877 5.89909C7.16991 5.73991 7.131 5.52072 6.97177 5.40958C6.81263 5.29844 6.59344 5.33734 6.48225 5.49658C6.32911 5.71591 6.07796 5.84688 5.81049 5.84688C5.35843 5.84688 4.99065 5.47909 4.99065 5.02703V2.52297C4.99065 2.07091 5.35843 1.70312 5.81049 1.70312C6.02944 1.70312 6.23532 1.78839 6.39019 1.94327C6.54507 2.09814 6.63033 2.30402 6.63033 2.52297V4.32391C6.63033 4.51806 6.78774 4.67547 6.98189 4.67547C7.17605 4.67547 7.33346 4.51806 7.33346 4.32391V4.02016H9.08068V5.02727C9.08068 5.86703 9.76388 6.55023 10.6036 6.55023C11.4434 6.55023 12.1266 5.86703 12.1266 5.02727V4.02016H13.8739V5.02727C13.8739 5.86703 14.5571 6.55023 15.3968 6.55023C16.2366 6.55023 16.9198 5.86703 16.9198 5.02727V4.02016H18.667V5.02727C18.667 5.86703 19.3502 6.55023 20.19 6.55023C21.0298 6.55023 21.713 5.86703 21.713 5.02727V4.25059C22.642 4.66788 23.2591 5.59619 23.2591 6.64469V8.20164H2.74069Z" fill="#183964"/>
<path d="M9.30005 10.2598C8.3971 10.2598 7.66248 10.9944 7.66248 11.8973C7.66248 12.8003 8.39705 13.5349 9.30005 13.5349C10.2031 13.5349 10.9376 12.8003 10.9376 11.8973C10.9376 10.9943 10.203 10.2598 9.30005 10.2598ZM9.30005 12.8318C8.7848 12.8318 8.3656 12.4126 8.3656 11.8973C8.3656 11.382 8.78476 10.9629 9.30005 10.9629C9.81535 10.9629 10.2345 11.3821 10.2345 11.8973C10.2345 12.4126 9.8153 12.8318 9.30005 12.8318Z" fill="#183964"/>
<path d="M13.0002 10.2598C12.0973 10.2598 11.3627 10.9944 11.3627 11.8973C11.3627 12.8003 12.0972 13.5349 13.0002 13.5349C13.9032 13.5349 14.6378 12.8003 14.6378 11.8973C14.6378 10.9943 13.9032 10.2598 13.0002 10.2598ZM13.0002 12.8318C12.485 12.8318 12.0658 12.4126 12.0658 11.8973C12.0658 11.382 12.4849 10.9629 13.0002 10.9629C13.5155 10.9629 13.9347 11.3821 13.9347 11.8973C13.9347 12.4126 13.5155 12.8318 13.0002 12.8318Z" fill="#183964"/>
<path d="M16.7004 10.2598C15.7974 10.2598 15.0628 10.9944 15.0628 11.8973C15.0628 12.8003 15.7974 13.5349 16.7004 13.5349C17.6033 13.5349 18.3379 12.8003 18.3379 11.8973C18.3379 10.9943 17.6033 10.2598 16.7004 10.2598ZM16.7004 12.8318C16.1851 12.8318 15.7659 12.4126 15.7659 11.8973C15.7659 11.382 16.1851 10.9629 16.7004 10.9629C17.2156 10.9629 17.6348 11.3821 17.6348 11.8973C17.6348 12.4126 17.2156 12.8318 16.7004 12.8318Z" fill="#183964"/>
<path d="M20.4006 10.2598C19.4976 10.2598 18.763 10.9944 18.763 11.8973C18.763 12.8003 19.4976 13.5349 20.4006 13.5349C21.3035 13.5349 22.0381 12.8003 22.0381 11.8973C22.0381 10.9943 21.3035 10.2598 20.4006 10.2598ZM20.4006 12.8318C19.8853 12.8318 19.4661 12.4126 19.4661 11.8973C19.4661 11.382 19.8853 10.9629 20.4006 10.9629C20.9159 10.9629 21.335 11.3821 21.335 11.8973C21.335 12.4126 20.9158 12.8318 20.4006 12.8318Z" fill="#183964"/>
<path d="M5.5999 14.8222C4.69695 14.8222 3.96233 15.5568 3.96233 16.4598C3.96233 17.3628 4.6969 18.0974 5.5999 18.0974C6.5029 18.0974 7.23748 17.3628 7.23748 16.4598C7.23748 15.5568 6.50286 14.8222 5.5999 14.8222ZM5.5999 17.3942C5.08465 17.3942 4.66545 16.975 4.66545 16.4597C4.66545 15.9444 5.08461 15.5253 5.5999 15.5253C6.1152 15.5253 6.53436 15.9444 6.53436 16.4597C6.53436 16.975 6.11515 17.3942 5.5999 17.3942Z" fill="#183964"/>
<path d="M9.30005 14.8222C8.3971 14.8222 7.66248 15.5568 7.66248 16.4598C7.66248 17.3628 8.39705 18.0974 9.30005 18.0974C10.2031 18.0974 10.9376 17.3628 10.9376 16.4598C10.9376 15.5568 10.203 14.8222 9.30005 14.8222ZM9.30005 17.3942C8.7848 17.3942 8.3656 16.975 8.3656 16.4597C8.3656 15.9444 8.78476 15.5253 9.30005 15.5253C9.81535 15.5253 10.2345 15.9444 10.2345 16.4597C10.2345 16.975 9.8153 17.3942 9.30005 17.3942Z" fill="#183964"/>
<path d="M13.0002 14.8222C12.0973 14.8222 11.3627 15.5568 11.3627 16.4598C11.3627 17.3628 12.0972 18.0974 13.0002 18.0974C13.9032 18.0974 14.6378 17.3628 14.6378 16.4598C14.6378 15.5568 13.9032 14.8222 13.0002 14.8222ZM13.0002 17.3942C12.485 17.3942 12.0658 16.975 12.0658 16.4597C12.0658 15.9444 12.4849 15.5253 13.0002 15.5253C13.5155 15.5253 13.9347 15.9444 13.9347 16.4597C13.9347 16.975 13.5155 17.3942 13.0002 17.3942Z" fill="#183964"/>
<path d="M16.7004 14.8222C15.7974 14.8222 15.0628 15.5568 15.0628 16.4598C15.0628 17.3628 15.7974 18.0974 16.7004 18.0974C17.6033 18.0974 18.3379 17.3628 18.3379 16.4598C18.3379 15.5568 17.6033 14.8222 16.7004 14.8222ZM16.7004 17.3942C16.1851 17.3942 15.7659 16.975 15.7659 16.4597C15.7659 15.9444 16.1851 15.5253 16.7004 15.5253C17.2156 15.5253 17.6348 15.9444 17.6348 16.4597C17.6348 16.975 17.2156 17.3942 16.7004 17.3942Z" fill="#183964"/>
<path d="M20.4006 14.8222C19.4976 14.8222 18.763 15.5568 18.763 16.4598C18.763 17.3628 19.4976 18.0974 20.4006 18.0974C21.3035 18.0974 22.0381 17.3628 22.0381 16.4598C22.0381 15.5568 21.3035 14.8222 20.4006 14.8222ZM20.4006 17.3942C19.8853 17.3942 19.4661 16.975 19.4661 16.4597C19.4661 15.9444 19.8853 15.5253 20.4006 15.5253C20.9159 15.5253 21.335 15.9444 21.335 16.4597C21.335 16.975 20.9158 17.3942 20.4006 17.3942Z" fill="#183964"/>
<path d="M5.5999 19.3846C4.69695 19.3846 3.96233 20.1192 3.96233 21.0222C3.96233 21.9252 4.6969 22.6598 5.5999 22.6598C6.5029 22.6598 7.23748 21.9252 7.23748 21.0222C7.23748 20.1193 6.50286 19.3846 5.5999 19.3846ZM5.5999 21.9566C5.08465 21.9566 4.66545 21.5374 4.66545 21.0222C4.66545 20.5069 5.08461 20.0877 5.5999 20.0877C6.1152 20.0877 6.53436 20.5069 6.53436 21.0222C6.53436 21.5375 6.11515 21.9566 5.5999 21.9566Z" fill="#183964"/>
<path d="M9.30005 19.3846C8.3971 19.3846 7.66248 20.1192 7.66248 21.0222C7.66248 21.9252 8.39705 22.6598 9.30005 22.6598C10.2031 22.6598 10.9376 21.9252 10.9376 21.0222C10.9376 20.1193 10.203 19.3846 9.30005 19.3846ZM9.30005 21.9566C8.7848 21.9566 8.3656 21.5374 8.3656 21.0222C8.3656 20.5069 8.78476 20.0877 9.30005 20.0877C9.81535 20.0877 10.2345 20.5069 10.2345 21.0222C10.2345 21.5375 9.8153 21.9566 9.30005 21.9566Z" fill="#183964"/>
<path d="M13.0002 19.3846C12.0973 19.3846 11.3627 20.1192 11.3627 21.0222C11.3627 21.9252 12.0972 22.6598 13.0002 22.6598C13.9032 22.6598 14.6378 21.9252 14.6378 21.0222C14.6378 20.1193 13.9032 19.3846 13.0002 19.3846ZM13.0002 21.9566C12.485 21.9566 12.0658 21.5374 12.0658 21.0222C12.0658 20.5069 12.4849 20.0877 13.0002 20.0877C13.5155 20.0877 13.9347 20.5069 13.9347 21.0222C13.9347 21.5375 13.5155 21.9566 13.0002 21.9566Z" fill="#183964"/>
<path d="M16.7004 19.3846C15.7974 19.3846 15.0628 20.1192 15.0628 21.0222C15.0628 21.9252 15.7974 22.6598 16.7004 22.6598C17.6033 22.6598 18.3379 21.9252 18.3379 21.0222C18.3379 20.1193 17.6033 19.3846 16.7004 19.3846ZM16.7004 21.9566C16.1851 21.9566 15.7659 21.5374 15.7659 21.0222C15.7659 20.5069 16.1851 20.0877 16.7004 20.0877C17.2156 20.0877 17.6348 20.5069 17.6348 21.0222C17.6348 21.5375 17.2156 21.9566 16.7004 21.9566Z" fill="#183964"/>
</svg>
