<svg width="374" height="868" viewBox="0 0 374 868" fill="none" xmlns="http://www.w3.org/2000/svg">
<path d="M0 214.417V868H374V0C276.918 37.3162 129.5 10.3334 60.8955 52.0311C13.5545 80.8049 0 71.658 0 214.417Z" fill="url(#paint0_linear)"/>
<defs>
<linearGradient id="paint0_linear" x1="374" y1="-1.29342e-05" x2="-80.8633" y2="44.6746" gradientUnits="userSpaceOnUse">
<stop stop-color="#1EB5D8"/>
<stop offset="1" stop-color="#27B0CF"/>
</linearGradient>
</defs>
</svg>
