<svg width="1920" height="598" viewBox="0 0 1920 598" fill="none" xmlns="http://www.w3.org/2000/svg">
<path d="M0 342.172V598H1920V0.666626C1421.61 28.0759 544.375 88.039 312.619 114.55C89.6172 140.06 0 237.313 0 342.172Z" fill="url(#paint0_linear)"/>
<defs>
<linearGradient id="paint0_linear" x1="1920" y1="0.666617" x2="385.884" y2="1124.68" gradientUnits="userSpaceOnUse">
<stop stop-color="#1EB5D8"/>
<stop offset="1" stop-color="#27B0CF"/>
</linearGradient>
</defs>
</svg>
