<svg width="576" height="694" viewBox="0 0 576 694" fill="none" xmlns="http://www.w3.org/2000/svg">
<path opacity="0.1" d="M460.663 441.634C596.548 430.001 584.255 367.606 561.123 337.863C478.067 226.16 329.388 0 194.561 0C81.1696 0 23.5605 0 -37.0078 110.491C-111.683 246.715 -59.6111 590.748 50.8943 658.431C161.4 726.113 229.122 680.463 249.169 649.177C286.441 591.012 324.778 453.267 460.663 441.634Z" fill="url(#paint0_linear)"/>
<defs>
<linearGradient id="paint0_linear" x1="575.561" y1="-1.0334e-05" x2="-185.145" y2="161.912" gradientUnits="userSpaceOnUse">
<stop stop-color="#65E1FE"/>
<stop offset="1" stop-color="#1EB5D8"/>
</linearGradient>
</defs>
</svg>
