<svg width="26" height="26" viewBox="0 0 26 26" fill="none" xmlns="http://www.w3.org/2000/svg">
<circle cx="13" cy="13" r="12.5" fill="#EEF3FB" stroke="#C1C1C9"/>
<path d="M6 12L11 17L20 8" stroke="#71C3A8" stroke-width="2" stroke-linecap="round"/>
</svg>
