<svg width="14" height="16" viewBox="0 0 14 16" fill="none" xmlns="http://www.w3.org/2000/svg">
<path d="M13.2923 9.23843L2.15764 15.8011C1.21269 16.3574 0 15.6838 0 14.5621V1.43686C0 0.317019 1.21094 -0.358442 2.15764 0.199702L13.2923 6.76234C13.5073 6.88698 13.686 7.06716 13.8103 7.28459C13.9345 7.50202 14 7.74897 14 8.00039C14 8.25181 13.9345 8.49875 13.8103 8.71618C13.686 8.93361 13.5073 9.11379 13.2923 9.23843Z" fill="#595959"/>
</svg>
