<svg xmlns="http://www.w3.org/2000/svg" width="308.048" height="308.049" viewBox="0 0 308.048 308.049">
  <g class="technical-support" transform="translate(0 0)">
    <circle class="Ellipse_4" data-name="Ellipse 4" cx="137" cy="137" r="137" transform="translate(17.023 17.023)" fill="#fff"/>
    <path class="Path_168" data-name="Path 168" d="M285.688,114.684l-15.023-2.548c-1.337-3.723-2.848-7.375-4.519-10.926l8.846-12.376a26.8,26.8,0,0,0-2.91-34.7L254.031,36.083a26.836,26.836,0,0,0-34.638-2.907L206.97,42.024A123.807,123.807,0,0,0,195.3,37.215L192.819,22.5A26.877,26.877,0,0,0,166.229,0h-25.5a26.869,26.869,0,0,0-26.583,22.47l-2.611,15.3q-5.531,2.02-10.884,4.585l-12.2-8.785a26.925,26.925,0,0,0-34.755,2.9L35.6,54.5a26.883,26.883,0,0,0-2.91,34.7l8.99,12.63c-1.657,3.565-3.147,7.234-4.463,10.978l-14.722,2.484A26.88,26.88,0,0,0,0,141.878v25.5a26.873,26.873,0,0,0,22.47,26.586l15.3,2.609c1.347,3.69,2.879,7.328,4.585,10.886L33.6,219.638a26.8,26.8,0,0,0,2.91,34.7l18.052,18.054A26.838,26.838,0,0,0,89.2,275.3l12.63-8.99c3.319,1.542,6.759,2.954,10.292,4.226l2.5,15.02a26.88,26.88,0,0,0,26.59,22.494h25.563a26.875,26.875,0,0,0,26.588-22.478l2.548-15.025c3.723-1.337,7.375-2.848,10.926-4.519l12.336,8.818a26.917,26.917,0,0,0,34.736-2.879l18.052-18.054a26.88,26.88,0,0,0,2.91-34.7l-8.856-12.435c1.716-3.633,3.232-7.283,4.536-10.912l15-2.5a26.88,26.88,0,0,0,22.494-26.59V141.323a26.612,26.612,0,0,0-22.358-26.64ZM290,166.776a8.882,8.882,0,0,1-7.422,8.787l-19.9,3.316a9.728,9.728,0,0,0-7.735,6.762,105.53,105.53,0,0,1-7.21,17.392,9.724,9.724,0,0,0,.71,10.184l11.725,16.466a8.886,8.886,0,0,1-.968,11.467L241.147,259.2a8.868,8.868,0,0,1-11.453.978l-16.4-11.718a9.722,9.722,0,0,0-10.228-.714,106.279,106.279,0,0,1-17.415,7.211,9.728,9.728,0,0,0-6.712,7.69l-3.38,19.918a8.882,8.882,0,0,1-8.79,7.434H141.211a8.88,8.88,0,0,1-8.788-7.422l-3.316-19.9a9.731,9.731,0,0,0-6.7-7.718,105.637,105.637,0,0,1-16.86-6.931,9.739,9.739,0,0,0-10.169.712L78.69,260.621a8.529,8.529,0,0,1-5.086,1.631,8.712,8.712,0,0,1-6.28-2.628L49.24,241.542a8.814,8.814,0,0,1-.961-11.4l11.655-16.212a9.715,9.715,0,0,0,.693-10.313,103.206,103.206,0,0,1-7.3-17.326,9.747,9.747,0,0,0-7.673-6.679l-20.17-3.438a8.886,8.886,0,0,1-7.431-8.79v-25.5a8.886,8.886,0,0,1,7.438-8.79l19.653-3.316a9.722,9.722,0,0,0,7.725-6.787,104.048,104.048,0,0,1,7.091-17.436,9.736,9.736,0,0,0-.712-10.169L47.395,78.73a8.879,8.879,0,0,1,.957-11.457L66.464,49.221l.066-.068a8.642,8.642,0,0,1,6.223-2.569A8.742,8.742,0,0,1,77.9,48.215L94.183,59.935a9.708,9.708,0,0,0,10.31.691,103.176,103.176,0,0,1,17.319-7.3,9.747,9.747,0,0,0,6.684-7.676l3.441-20.17a8.882,8.882,0,0,1,8.79-7.431h25.5a8.886,8.886,0,0,1,8.79,7.438l3.316,19.66a9.723,9.723,0,0,0,6.8,7.723A105.041,105.041,0,0,1,203.2,60.307a9.735,9.735,0,0,0,10.2-.7L229.9,47.85a8.519,8.519,0,0,1,5.086-1.631,8.719,8.719,0,0,1,6.28,2.628L259.352,66.93a8.816,8.816,0,0,1,.947,11.42l-11.73,16.412a9.733,9.733,0,0,0-.7,10.214,106.228,106.228,0,0,1,7.213,17.417,9.729,9.729,0,0,0,7.69,6.71l19.9,3.377.016,0A8.656,8.656,0,0,1,290,141.145Zm0,0"/>
    <path class="Path_169" data-name="Path 169" d="M216.346,156.453a59.893,59.893,0,1,0,59.893,59.893A59.961,59.961,0,0,0,216.346,156.453Zm0,101.737a41.843,41.843,0,1,1,41.843-41.843A41.891,41.891,0,0,1,216.346,258.19Zm0,0" transform="translate(-62.322 -62.322)"/>
  </g>
</svg>
