<svg width="16" height="11" viewBox="0 0 16 11" fill="none" xmlns="http://www.w3.org/2000/svg">
<path fill-rule="evenodd" clip-rule="evenodd" d="M0.181763 2.47273C0.181763 1.93747 0.381103 1.42414 0.73593 1.04566C1.09076 0.667173 1.57201 0.454544 2.07381 0.454544H9.16898C9.62789 0.454487 10.0712 0.632339 10.4163 0.95498C10.7614 1.27762 10.9848 1.72306 11.0449 2.20834L13.9871 0.81378C14.1311 0.745335 14.2888 0.716366 14.446 0.729507C14.6032 0.742647 14.7548 0.79748 14.8871 0.889021C15.0193 0.980562 15.128 1.10591 15.2033 1.25367C15.2786 1.40143 15.3181 1.56691 15.3181 1.73508V9.26492C15.318 9.43295 15.2785 9.5983 15.2033 9.74594C15.128 9.89357 15.0194 10.0188 14.8873 10.1103C14.7552 10.2019 14.6037 10.2567 14.4467 10.27C14.2896 10.2832 14.132 10.2544 13.988 10.1862L11.0449 8.79165C10.9848 9.27694 10.7614 9.72238 10.4163 10.045C10.0712 10.3677 9.62789 10.5455 9.16898 10.5455H2.07381C1.57201 10.5455 1.09076 10.3328 0.73593 9.95434C0.381103 9.57586 0.181763 9.06253 0.181763 8.52727V2.47273Z" fill="white"/>
</svg>
