<svg width="23" height="13" viewBox="0 0 23 13" fill="none" xmlns="http://www.w3.org/2000/svg">
<path fill-rule="evenodd" clip-rule="evenodd" d="M2.55713 2.98169C2.55713 2.35963 2.78879 1.76306 3.20116 1.3232C3.61353 0.88334 4.17282 0.63623 4.75599 0.63623H13.0017C13.5351 0.636164 14.0502 0.842857 14.4513 1.21782C14.8524 1.59278 15.112 2.11045 15.1819 2.67443L18.6011 1.05372C18.7685 0.974177 18.9518 0.940511 19.1345 0.955782C19.3172 0.971053 19.4934 1.03478 19.6471 1.14116C19.8008 1.24755 19.9271 1.39322 20.0146 1.56494C20.1021 1.73666 20.148 1.92898 20.148 2.12442V10.8753C20.1479 11.0706 20.102 11.2628 20.0146 11.4343C19.9271 11.6059 19.8009 11.7515 19.6474 11.8578C19.4938 11.9642 19.3178 12.028 19.1353 12.0434C18.9528 12.0588 18.7696 12.0253 18.6022 11.946L15.1819 10.3253C15.112 10.8893 14.8524 11.407 14.4513 11.7819C14.0502 12.1569 13.5351 12.3636 13.0017 12.3635H4.75599C4.17282 12.3635 3.61353 12.1164 3.20116 11.6765C2.78879 11.2367 2.55713 10.6401 2.55713 10.018V2.98169Z" fill="#595959"/>
<rect x="0.517573" y="11.3171" width="23.7671" height="1.5" transform="rotate(-26.339 0.517573 11.3171)" fill="#595959" stroke="white" stroke-width="0.5" stroke-linejoin="round"/>
</svg>
