<svg xmlns="http://www.w3.org/2000/svg" width="20.234" height="20.234" viewBox="0 0 20.234 20.234">
<g class="money">
  <circle class="Ellipse_9" data-name="Ellipse 9" cx="10" cy="10" r="10" transform="translate(0 0.234)" fill="#fff"/>
  <path class="Path_237" data-name="Path 237" d="M10.117,20.234A10.117,10.117,0,0,1,2.963,2.963,10.117,10.117,0,0,1,17.271,17.271a10.051,10.051,0,0,1-7.154,2.963Zm0-18.97a8.852,8.852,0,1,0,8.852,8.852A8.863,8.863,0,0,0,10.117,1.265Z"/>
  <path class="Path_238" data-name="Path 238" d="M186.845,101.691a1.581,1.581,0,1,1,1.581-1.581.632.632,0,1,0,1.265,0,2.85,2.85,0,0,0-2.213-2.774v-.7a.632.632,0,1,0-1.265,0v.7a2.845,2.845,0,0,0,.632,5.619,1.581,1.581,0,1,1-1.581,1.581.632.632,0,0,0-1.265,0,2.85,2.85,0,0,0,2.213,2.774v.7a.632.632,0,1,0,1.265,0v-.7a2.845,2.845,0,0,0-.632-5.619Z" transform="translate(-176.728 -92.206)"/>
</g>
</svg>
