<svg width="14" height="14" viewBox="0 0 14 16" fill="none" xmlns="http://www.w3.org/2000/svg">
<g class="profilePage">
<path d="M11.6667 0H2.3833C1.62724 0 0.963379 0.621981 0.963379 1.3582V15.0911C0.963379 15.3376 1.03197 15.543 1.14251 15.7016C1.27471 15.8913 1.48757 16.0001 1.71582 16C1.93163 16 2.16139 15.9039 2.37357 15.7227L6.52695 12.1963C6.65523 12.0867 6.83949 12.0239 7.03107 12.0239C7.22258 12.0239 7.40646 12.0867 7.53512 12.1966L11.6746 15.7222C11.8876 15.9039 12.1015 16.0001 12.3169 16.0001C12.6812 16.0001 13.0363 15.7191 13.0363 15.0912V1.3582C13.0363 0.621981 12.4228 0 11.6667 0Z" fill="#595959"/>
</g>
</svg>
