<svg xmlns="http://www.w3.org/2000/svg" width="16.814" height="20.154" viewBox="0 0 16.814 20.154">
  <g class="account" transform="translate(0 0)">
    <path class="Path_239" data-name="Path 239" d="M4.2,10.556c-1.881.552-2.738,1.685-3.254,3.834s-1.351,3.5,1.191,4.764,8.889.291,8.976.291,3.159.407,4.416-.813.966-2.157.61-4.067A4.761,4.761,0,0,0,14.1,10.992a2.545,2.545,0,0,0-2.672.145,4.165,4.165,0,0,1-2.963,1.046C6.864,11.98,6.08,10,4.2,10.556Z" fill="#fff"/>
    <circle class="Ellipse_9" data-name="Ellipse 9" cx="4" cy="4" r="4" transform="translate(4 1)" fill="#fff"/>
    <path class="Path_237" data-name="Path 237" d="M91.886,9.708a4.7,4.7,0,0,0,3.432-1.422A4.7,4.7,0,0,0,96.74,4.854a4.7,4.7,0,0,0-1.422-3.432,4.853,4.853,0,0,0-6.864,0,4.7,4.7,0,0,0-1.422,3.432,4.7,4.7,0,0,0,1.422,3.432A4.7,4.7,0,0,0,91.886,9.708Zm-2.6-7.451a3.672,3.672,0,0,1,5.194,0,3.509,3.509,0,0,1,1.076,2.6,3.509,3.509,0,0,1-1.076,2.6,3.671,3.671,0,0,1-5.194,0,3.509,3.509,0,0,1-1.076-2.6,3.509,3.509,0,0,1,1.076-2.6Zm0,0" transform="translate(-83.606)" fill="#595959"/>
    <path class="Path_238" data-name="Path 238" d="M16.773,253.078a11.99,11.99,0,0,0-.163-1.273,10.034,10.034,0,0,0-.313-1.28,6.325,6.325,0,0,0-.526-1.194,4.5,4.5,0,0,0-.794-1.034,3.5,3.5,0,0,0-1.14-.716,3.94,3.94,0,0,0-1.456-.263,1.477,1.477,0,0,0-.789.335c-.236.154-.513.333-.822.53a4.709,4.709,0,0,1-1.063.469,4.129,4.129,0,0,1-2.6,0,4.7,4.7,0,0,1-1.063-.468c-.306-.2-.583-.374-.823-.53a1.476,1.476,0,0,0-.789-.335,3.935,3.935,0,0,0-1.455.264,3.5,3.5,0,0,0-1.14.716,4.5,4.5,0,0,0-.793,1.034,6.337,6.337,0,0,0-.526,1.194,10.057,10.057,0,0,0-.313,1.28,11.908,11.908,0,0,0-.163,1.274c-.027.385-.04.785-.04,1.19A3.347,3.347,0,0,0,.994,256.8a3.578,3.578,0,0,0,2.561.934h9.7a3.578,3.578,0,0,0,2.561-.934,3.345,3.345,0,0,0,.994-2.532c0-.406-.014-.807-.041-1.19Zm-1.768,2.867a2.409,2.409,0,0,1-1.747.609h-9.7a2.409,2.409,0,0,1-1.747-.609,2.185,2.185,0,0,1-.627-1.676c0-.378.012-.751.037-1.108a10.741,10.741,0,0,1,.148-1.147,8.87,8.87,0,0,1,.275-1.129,5.158,5.158,0,0,1,.428-.971,3.337,3.337,0,0,1,.583-.764,2.322,2.322,0,0,1,.759-.472,2.718,2.718,0,0,1,.93-.179c.041.022.115.064.234.142.243.158.523.339.832.536a5.852,5.852,0,0,0,1.335.6,5.309,5.309,0,0,0,3.328,0,5.858,5.858,0,0,0,1.336-.6c.317-.2.589-.378.831-.536.119-.078.193-.12.234-.142a2.719,2.719,0,0,1,.93.179,2.325,2.325,0,0,1,.758.472,3.328,3.328,0,0,1,.583.765,5.141,5.141,0,0,1,.429.971,8.849,8.849,0,0,1,.276,1.129,10.831,10.831,0,0,1,.148,1.147h0c.025.357.038.729.038,1.108a2.185,2.185,0,0,1-.627,1.676Zm0,0" transform="translate(0 -237.581)" fill="#595959"/>
  </g>
</svg>
