digraph P {
node [shape=box];
0 -> 0 [ label="0.020000000000000018" ];
0 -> 1 [ label="0.97999999999999998" ];
1 -> 0 [ label="0.010000000000000009" ];
1 -> 2 [ label="0.98999999999999999" ];
2 -> 3 [ label="0.040000000000000036" ];
2 -> 4 [ label="0.95999999999999996" ];
3 -> 5 [ label="0.020000000000000018" ];
3 -> 6 [ label="0.97999999999999998" ];
4 -> 7 [ label="0.020000000000000018" ];
4 -> 8 [ label="0.97999999999999998" ];
5 -> 5 [ label="1" ];
6 -> 6 [ label="1" ];
7 -> 7 [ label="1" ];
8 -> 8 [ label="1" ];
0 [label="0\n(0,-1,-1,-1,-1)"];
1 [label="1\n(1,1,-1,-1,-1)"];
2 [label="2\n(2,1,1,-1,-1)"];
3 [label="3\n(3,1,1,0,-1)"];
4 [label="4\n(3,1,1,1,-1)"];
5 [label="5\n(4,1,1,0,0)"];
6 [label="6\n(4,1,1,0,1)"];
7 [label="7\n(4,1,1,1,0)"];
8 [label="8\n(4,1,1,1,1)"];
}
