digraph P {
node [shape=box];
0 -> 1 [ label="0.020000000000000018" ];
0 -> 2 [ label="0.97999999999999998" ];
1 -> 0 [ label="0.010000000000000009" ];
1 -> 3 [ label="0.98999999999999999" ];
2 -> 0 [ label="0.010000000000000009" ];
2 -> 4 [ label="0.98999999999999999" ];
3 -> 5 [ label="0.040000000000000036" ];
3 -> 6 [ label="0.95999999999999996" ];
4 -> 7 [ label="0.040000000000000036" ];
4 -> 8 [ label="0.95999999999999996" ];
5 -> 0 [ label="0.020000000000000018" ];
5 -> 9 [ label="0.97999999999999998" ];
6 -> 10 [ label="0.020000000000000018" ];
6 -> 11 [ label="0.97999999999999998" ];
7 -> 0 [ label="0.020000000000000018" ];
7 -> 12 [ label="0.97999999999999998" ];
8 -> 13 [ label="0.020000000000000018" ];
8 -> 14 [ label="0.97999999999999998" ];
9 -> 9 [ label="1" ];
10 -> 10 [ label="1" ];
11 -> 11 [ label="1" ];
12 -> 12 [ label="1" ];
13 -> 13 [ label="1" ];
14 -> 14 [ label="1" ];
0 [label="0\n(0,-1,-1,-1,-1)"];
1 [label="1\n(1,0,-1,-1,-1)"];
2 [label="2\n(1,1,-1,-1,-1)"];
3 [label="3\n(2,0,1,-1,-1)"];
4 [label="4\n(2,1,1,-1,-1)"];
5 [label="5\n(3,0,1,0,-1)"];
6 [label="6\n(3,0,1,1,-1)"];
7 [label="7\n(3,1,1,0,-1)"];
8 [label="8\n(3,1,1,1,-1)"];
9 [label="9\n(4,0,1,0,1)"];
10 [label="10\n(4,0,1,1,0)"];
11 [label="11\n(4,0,1,1,1)"];
12 [label="12\n(4,1,1,0,1)"];
13 [label="13\n(4,1,1,1,0)"];
14 [label="14\n(4,1,1,1,1)"];
}
