digraph P {
node [shape=box];
0 -> 1 [ label="0.020000000000000018" ];
0 -> 2 [ label="0.97999999999999998" ];
1 -> 3 [ label="0.010000000000000009" ];
1 -> 4 [ label="0.98999999999999999" ];
2 -> 5 [ label="0.010000000000000009" ];
2 -> 6 [ label="0.98999999999999999" ];
3 -> 7 [ label="0.040000000000000036" ];
3 -> 8 [ label="0.95999999999999996" ];
4 -> 9 [ label="0.040000000000000036" ];
4 -> 10 [ label="0.95999999999999996" ];
5 -> 0 [ label="0.040000000000000036" ];
5 -> 11 [ label="0.95999999999999996" ];
6 -> 12 [ label="0.040000000000000036" ];
6 -> 13 [ label="0.95999999999999996" ];
7 -> 0 [ label="0.020000000000000018" ];
7 -> 14 [ label="0.97999999999999998" ];
8 -> 0 [ label="0.020000000000000018" ];
8 -> 15 [ label="0.97999999999999998" ];
9 -> 16 [ label="0.020000000000000018" ];
9 -> 17 [ label="0.97999999999999998" ];
10 -> 0 [ label="0.020000000000000018" ];
10 -> 18 [ label="0.97999999999999998" ];
11 -> 0 [ label="0.020000000000000018" ];
11 -> 19 [ label="0.97999999999999998" ];
12 -> 20 [ label="0.020000000000000018" ];
12 -> 21 [ label="0.97999999999999998" ];
13 -> 0 [ label="0.020000000000000018" ];
13 -> 22 [ label="0.97999999999999998" ];
14 -> 14 [ label="1" ];
15 -> 15 [ label="1" ];
16 -> 16 [ label="1" ];
17 -> 17 [ label="1" ];
18 -> 18 [ label="1" ];
19 -> 19 [ label="1" ];
20 -> 20 [ label="1" ];
21 -> 21 [ label="1" ];
22 -> 22 [ label="1" ];
0 [label="0\n(0,-1,-1,-1,-1)"];
1 [label="1\n(1,0,-1,-1,-1)"];
2 [label="2\n(1,1,-1,-1,-1)"];
3 [label="3\n(2,0,0,-1,-1)"];
4 [label="4\n(2,0,1,-1,-1)"];
5 [label="5\n(2,1,0,-1,-1)"];
6 [label="6\n(2,1,1,-1,-1)"];
7 [label="7\n(3,0,0,0,-1)"];
8 [label="8\n(3,0,0,1,-1)"];
9 [label="9\n(3,0,1,0,-1)"];
10 [label="10\n(3,0,1,1,-1)"];
11 [label="11\n(3,1,0,1,-1)"];
12 [label="12\n(3,1,1,0,-1)"];
13 [label="13\n(3,1,1,1,-1)"];
14 [label="14\n(4,0,0,0,1)"];
15 [label="15\n(4,0,0,1,1)"];
16 [label="16\n(4,0,1,0,0)"];
17 [label="17\n(4,0,1,0,1)"];
18 [label="18\n(4,0,1,1,1)"];
19 [label="19\n(4,1,0,1,1)"];
20 [label="20\n(4,1,1,0,0)"];
21 [label="21\n(4,1,1,0,1)"];
22 [label="22\n(4,1,1,1,1)"];
}
