module gamebunkettgbot

go 1.22.0

require (
	github.com/go-telegram-bot-api/telegram-bot-api/v5 v5.5.1 // indirect
	github.com/gorilla/mux v1.8.1 // indirect
	github.com/jackc/pgpassfile v1.0.0 // indirect
	github.com/jackc/pgservicefile v0.0.0-20231201235250-de7065d80cb9 // indirect
	github.com/jackc/pgx/v5 v5.5.3 // indirect
	github.com/jackc/puddle/v2 v2.2.1 // indirect
	github.com/jinzhu/inflection v1.0.0 // indirect
	github.com/jinzhu/now v1.1.5 // indirect
	golang.org/x/crypto v0.19.0 // indirect
	golang.org/x/sync v0.6.0 // indirect
	golang.org/x/text v0.14.0 // indirect
	gorm.io/driver/postgres v1.5.6 // indirect
	gorm.io/gorm v1.25.7 // indirect
)
