<svg width="500" height="500" viewBox="0 0 500 500" fill="none" xmlns="http://www.w3.org/2000/svg">
<path d="M254.258 165.767C261.232 154.122 272.272 137.453 286.2 121.46H286.217C298.023 107.887 321.14 90.4667 321.14 90.4667C324.612 87.84 324.238 84.1833 320.288 82.3433L292.35 69.2867C288.4 67.435 283.032 68.7867 280.412 72.2683C280.412 72.2683 259.752 101.913 235.425 165.022C160.218 131.003 88.73 178.648 88.73 261.507C88.73 348.052 155.315 479.505 245.355 439.825C340.192 480.87 402.027 348.052 402.027 261.507C402.028 177.937 337.765 128.943 254.258 165.767Z" fill="black"/>
<path d="M237.415 137.742C241.76 137.377 245.6 133.527 245.953 129.188C245.953 129.188 248.742 95.345 225.16 71.735C201.503 48.1217 167.722 50.9367 167.722 50.9367C163.375 51.3 159.537 55.1467 159.177 59.485C159.177 59.485 156.337 93.3433 179.955 116.962C203.557 140.557 237.415 137.742 237.415 137.742Z" fill="black"/>
</svg>
