<svg xmlns="http://www.w3.org/2000/svg" width="300" height="300">
  <path d="M82.27 140.9a30.8 30.8 0 1 0-61.6 0 30.8 30.8 0 0 0 61.6 0z"/>
  <path d="M94.9 122.12a462.62 462.62 0 0 0 2.81-106.97 13.92 13.92 0 0 1 27.73-2.5 491.1 491.1 0 0 1-2.36 109.1 136.15 136.15 0 0 1 79.55 35.84 330.35 330.35 0 0 1 81.3 120.15 16.32 16.32 0 0 1-30.4 11.89 297.65 297.65 0 0 0-61.38-96.44A331.02 331.02 0 0 1 87.92 297.5a16.31 16.31 0 0 1-14.12 1.55 17.06 17.06 0 0 0 10.3-9.42 483.95 483.95 0 0 0 15.43-40.47A298.02 298.02 0 0 0 149.2 198a71.2 71.2 0 0 0-36.52-11.82A489.04 489.04 0 0 1 81.2 288.38a13.92 13.92 0 1 1-25.53-11.05 461.8 461.8 0 0 0 30.77-102.48l8.51-52.93"/>
</svg>