<svg width="500" height="500" viewBox="0 0 500 500" fill="none" xmlns="http://www.w3.org/2000/svg">
<path d="M271.629 21.6448L271.629 426.106L368.079 329.595C376.523 321.141 390.22 321.141 398.663 329.595C407.112 338.05 407.112 351.758 398.663 360.2L265.295 493.659C256.851 502.114 243.152 502.114 234.71 493.659L101.336 360.2C97.1097 355.974 95 350.435 95 344.898C95 339.36 97.1097 333.822 101.336 329.595C109.78 321.141 123.477 321.141 131.919 329.595L228.373 426.106L228.373 21.6448C228.373 9.69242 238.058 9.58678e-06 250.002 9.58678e-06C261.946 9.58678e-06 271.629 9.69117 271.629 21.6448Z" fill="black"/>
</svg>
