<svg width="500" height="500" viewBox="0 0 500 500" fill="none" xmlns="http://www.w3.org/2000/svg">
<path d="M494.367 73.7417C486.858 66.2276 474.682 66.2276 467.171 73.7417L155.442 385.653L32.8292 262.968C25.3204 255.453 13.1436 255.453 5.63283 262.968C-1.87695 270.482 -1.87695 282.665 5.63283 290.18L141.845 426.472C149.352 433.983 161.533 433.985 169.041 426.472L494.367 100.954C501.877 93.4387 501.877 81.2559 494.367 73.7417Z" fill="black"/>
</svg>
