<svg width="500" height="500" viewBox="0 0 500 500" fill="none" xmlns="http://www.w3.org/2000/svg">
 <path d="M498.98 322.74c-4.05-18.25-20.25-23.99-20.75-23.99-90.08-32.33-153.85-91.25-184.72-119.4-7.58-6.79-22.77-19.3-24.29-20.34l-34.4-28.68c-2.03-1.57-5.07-2.09-7.1 0-14.16 10.43-17.7 25.55-18.72 33.37-17.7 7.3-45.54 14.6-47.57 15.12a20.47 20.47 0 0 1-13.66 0c-21.76-5.73-37.96-36.5-41.5-43.8 1.52-24.5-12.14-31.8-20.24-33.9-6.58-1.56-11.64-1.04-12.15-1.04-1.51 0-3.03 1.05-4.04 2.61-32.9 46.4-52.13 85.52-57.19 115.76-3.03 16.69-.5 27.12 1.52 31.8L.51 280.5C0 281.55 0 282.6 0 283.63c0 2.6 3.04 25.03 55.67 39.11l266.7 71.96c2.01.52 95.64 16.16 148.77-8.87 1.01-.52 2.03-1.04 2.53-2.08 0 0 17.71-25.03 17.71-25.55 8.1-12.52 10.13-24.51 7.6-35.46zm-77.43-34.94c13.66 7.3 28.34 13.56 44.03 19.82-9.11 1.04-22.27 1.04-38.97 0-27.33-1.57-31.38-1.05-55.16 9.38-15.18 6.78-76.42-10.95-127.02-40.15l66.3-25.55c6.06 5.22 22.26 17.73 40.98 28.68 25.3 14.6 54.66 19.82 69.84 7.82zm-216.6-22.94c23.79 18.77 59.21 38.06 95.14 51.1a213.8 213.8 0 0 0 28.34 8.87c6.58 1.56 13.67 3.65 20.25 4.69l-37.45 19.81c-26.82-7.3-59.72-19.81-97.67-35.98-30.87-13.55-57.7-22.94-81.48-30.76a423.91 423.91 0 0 0-11.64-35.98c12.65-4.7 46.56-11.47 84.52 18.25zm1.02-14.6l62.75-21.9c.5 0 9.1-3.13 18.72 4.17 3.55 3.13 8.1 6.26 11.64 9.39l-68.32 26.07a175.31 175.31 0 0 1-18.72-13.56c-2.03-1.04-4.05-2.6-6.07-4.17zm64.27-75.09c-7.6 2.09-8.1 2.09-8.6 2.6-3.04 1.05-4.56 4.7-3.55 8.35.5 2.09 2.53 3.13 4.05 3.65a4.2 4.2 0 0 0 3.54 0c1.01-.52 8.1-2.08 15.69-4.17 1.52 1.04 9.1 8.34 11.64 10.95-3.04 1.04-6.07 2.09-6.58 2.6-3.04 1.05-4.55 4.7-3.54 8.35.5 2.09 2.53 3.13 4.05 3.65a4.2 4.2 0 0 0 3.54 0c1.01-.52 7.59-2.6 13.16-4.7 3.54 3.14 7.59 6.79 11.64 9.92l-5.06 3.12c-3.04 1.57-4.05 5.74-2.54 8.35 1.02 1.56 2.03 2.6 3.55 3.13 1.52.52 3.03 0 4.55-.53l9.11-5.21a99.09 99.09 0 0 0 11.64 8.86l-4.05 3.65c-2.53 2.09-2.53 6.26-.5 8.87 1 1.04 2.02 1.56 3.03 2.08a5.6 5.6 0 0 0 5.57-1.56l5.57-5.21c4.55 3.13 8.6 6.25 13.15 9.9l-2.02 2.09c-2.02 2.6-2.02 6.78.5 8.86a11 11 0 0 0 2.54 1.57c2.02.52 4.55 0 6.07-2.09l4.05-4.7c4.05 2.62 8.6 5.75 12.65 8.35l-1.01 1.05c-2.03 2.6-2.03 6.77.5 8.86a3.8 3.8 0 0 0 2.53 1.04c2.03.52 4.56 0 6.07-2.08l2.03-2.61c4.55 3.13 9.62 5.73 14.68 8.34-40.49 10.43-87.05-37.02-112.86-57.36-14.17-11.47-28.34-6.77-30.36-6.25l-72.87 25.03c-34.92-18.25-64.27-11.48-76.42-7.3-3.54-8.87-7.08-16.69-10.63-24.51a105.2 105.2 0 0 0 22.78 9.38c33.4 8.87 65.28-.52 92.1-10.95 11.13-4.17 17.71-10.95 20.24-20.33 2.53-8.87 0-17.73-2.53-23.47 6.58-2.6 10.63-3.13 13.67-2.6 6.57 2.6 18.72 12.51 19.23 13.03zm-38.97-31.8l9.1 7.3a161.45 161.45 0 0 0-17.7 6.77c1-4.17 3.54-9.38 8.6-14.08zm-66.8 47.44c5.57-1.04 61.23-20.85 61.74-21.38 2.02 3.66 4.05 9.91 2.53 15.13-1.52 4.69-5.57 8.86-13.16 11.99-24.29 9.9-54.15 18.77-84.51 10.43-8.1-2.09-16.2-5.74-24.8-10.43 8.1-1.56 17.72-4.7 25.3-11.47 4.05 2.6 8.6 4.7 13.16 5.73 6.58 2.09 13.16 1.05 19.74 0zM77.43 112.6c1.52 0 3.03 0 5.06.52 8.6 2.08 12.14 9.9 11.13 22.42 0 1.04 0 2.09.5 3.13.51 1.04 10.63 22.94 27.33 38.07-9.61 6.77-22.77 7.82-28.84 8.34-14.17-25.03-25.81-37.55-26.82-38.59-1.52-1.56-3.54-2.08-6.07-1.56l-4.05 1.04a758.02 758.02 0 0 1 21.76-33.37zm-30.37 48.5l12.15-3.14c8.1 10.43 37.95 49.54 58.7 119.93-10.63-3.12-28.34-8.34-39.47-10.94-8.6-2.1-45.55-12.52-53.14-20.86-1-2.09-10.62-24.51 21.76-85zm417.5 214.3c-49.08 21.9-134.1 8.35-139.67 7.3L58.2 310.76c-36.43-9.91-44.53-22.43-46.04-26.6l10.62-23.46c10.12 6.78 50.1 18.25 52.63 18.77 7.6 2.09 83 23.47 133.1 45.37 39.98 17.2 74.39 30.24 102.22 37.54 24.3 6.78 54.15 9.38 57.7 9.9 30.86 3.66 78.94-2.6 103.73-7.3l-7.59 10.43zm17.72-25.54c-13.16 2.6-76.42 14.6-111.84 9.9-4.05-.52-26.82-2.6-41.5-6.25l51.62-27.12c18.22-7.82 21.76-7.82 45.54-6.26 15.7 1.05 42.51 1.57 55.67-3.13 2.02 2.61 4.05 5.22 5.06 9.39 2.03 6.78.5 14.6-4.55 23.47z" fill="#000"/>
</svg>
