<svg viewBox="0 0 400 400" xmlns="http://www.w3.org/2000/svg">
  <path d="M363.64 0H36.37A36.4 36.4 0 0 0 0 36.36v327.28A36.4 36.4 0 0 0 36.37 400h327.27A36.4 36.4 0 0 0 400 363.64V36.36A36.4 36.4 0 0 0 363.64 0zm18.18 363.64a18.2 18.2 0 0 1-18.18 18.18H36.37a18.2 18.2 0 0 1-18.19-18.18V36.37a18.2 18.2 0 0 1 18.19-18.19h327.27a18.2 18.2 0 0 1 18.18 18.19z"/>
  <path d="M200 54.55c-43.7 0-84.8 17.01-115.7 47.93a9.09 9.09 0 0 0 0 12.85l51.42 51.42a9.09 9.09 0 0 0 12.85 0c28.36-28.35 74.5-28.35 102.86 0a9.06 9.06 0 0 0 12.86 0l51.42-51.42a9.09 9.09 0 0 0 0-12.85A162.53 162.53 0 0 0 200 54.55zm57.54 93.24A90.67 90.67 0 0 0 200 127.31c-8.58 0-17.11 1.49-25.42 3.9l-11.76-25.88a9.09 9.09 0 1 0-16.55 7.53l11.4 25.05a89.61 89.61 0 0 0-15.2 9.88l-38.7-38.69c26.6-23.52 60.43-36.37 96.23-36.37s69.64 12.85 96.23 36.37z"/>
</svg>