<svg xmlns="http://www.w3.org/2000/svg" viewBox="0 0 512 512">
  <path d="M154.94 282.97c22.06 28.58 34.85 64.43 36.38 101.6a16.14 16.14 0 0 0-7.95 5.53c-3.1 4-4.16 9.12-2.9 14.04l4.51 17.42a17.07 17.07 0 0 0-12.37 16.39v19.9c0 9.4 7.64 17.05 17.04 17.05h9.14l6.45 24.92A16.26 16.26 0 0 0 220.98 512h70.4c7.42 0 13.9-5 15.75-12.18l6.44-24.92h9.15c9.4 0 17.04-7.64 17.04-17.04v-19.91c0-7.78-5.24-14.35-12.38-16.38l4.51-17.44a16.17 16.17 0 0 0-2.9-14.03 16.12 16.12 0 0 0-8.37-5.65c1.27-36.66 14.02-71.92 37.1-102.33a127.1 127.1 0 0 0 19.1-35.95 7.5 7.5 0 1 0-14.2-4.83 112.15 112.15 0 0 1-16.86 31.72c-24.94 32.86-38.73 71.02-40.13 110.74h-14.12V277.05a7.5 7.5 0 1 0-15 0v23.48c-3.99 1.8-10.66 3.7-15.2-.84a7.55 7.55 0 0 0-9.87-.65c-.97.73-8.86 6.4-15.58 2.37v-24.36a7.5 7.5 0 1 0-15 0V383.8H206.3c-1.69-40.2-15.57-79-39.49-110a111.47 111.47 0 0 1-23.4-68.72c0-10.8 1.52-21.48 4.53-31.74a7.5 7.5 0 1 0-14.39-4.22 127.72 127.72 0 0 0-5.14 35.96c0 28.48 9.17 55.41 26.53 77.9zM291.51 418.9v-20.1h24.64c.4 0 .74.16.99.48.17.23.36.6.23 1.1l-5.3 20.52h-20.84c.18-.64.28-1.3.28-2zm-55.65-101.53c7.25 1.47 14.4-.57 19.69-3.28 6.8 4.04 14.44 3.93 20.96 2.26v67.45h-40.65v-66.43zm0 101.53v-20.1h40.65v20.1c0 .7.1 1.36.28 2h-41.2c.17-.64.27-1.3.27-2zm86.86 17c1.12 0 2.04.92 2.04 2.05v19.9c0 1.13-.92 2.05-2.04 2.05H253.5a7.5 7.5 0 1 0 0 15h44.58l-5.47 21.16c-.14.55-.65.94-1.22.94h-70.41c-.58 0-1.08-.39-1.22-.94l-5.47-21.16h10.21a7.5 7.5 0 1 0 0-15h-34.85a2.04 2.04 0 0 1-2.04-2.04v-19.91c0-1.13.91-2.05 2.04-2.05h133.07zm-127.5-36.62a1.2 1.2 0 0 1 1-.48h24.64v20.1c0 .7.1 1.36.27 2H200.3l-5.3-20.51c-.13-.5.05-.88.23-1.1zm-46.6-248.55a7.5 7.5 0 0 0 10.26-2.66 112.96 112.96 0 0 1 98.8-55.58c60.51.88 110.26 50.84 110.9 111.35.04 3.47-.1 7.1-.4 10.78a7.5 7.5 0 0 0 14.94 1.25 126.82 126.82 0 0 0-36.82-100.74 126.8 126.8 0 0 0-90.25-37.65 128 128 0 0 0-110.1 62.98 7.5 7.5 0 0 0 2.67 10.27z"/>
  <path d="M281.95 136.76c39.1 11.2 46.69 50.94 47 52.68a7.5 7.5 0 0 0 14.78-2.58c-.36-2.07-9.35-50.69-57.65-64.52a7.49 7.49 0 1 0-4.13 14.42zM256 57.96a7.5 7.5 0 0 0 7.5-7.5V7.5a7.5 7.5 0 1 0-15 0v42.96a7.5 7.5 0 0 0 7.5 7.5zm82.03 17.88a7.5 7.5 0 0 0 10.6 0l30.39-30.38a7.5 7.5 0 1 0-10.61-10.6l-30.38 30.37a7.5 7.5 0 0 0 0 10.6zM132.98 45.46l30.38 30.38a7.5 7.5 0 1 0 10.6-10.6l-30.36-30.4a7.48 7.48 0 0 0-10.61 0 7.5 7.5 0 0 0 0 10.6z"/>
</svg>