{
  "schemaVersion": "1.0.0",
  "schemaSpecificationUri": "https://uuapp.plus4u.net/uu-bookkit-maing01/bef682626ed943f28cde360ccb325981/book/page?code=uuSubAppInstanceDescriptor",
  "uuSubApp": {
    "code": "UUN.BIOT22WDL01.MAING01",
    "version": "0.1.11-dev",
    "name": "uunBiot22wdl01Maing01",
    "description": "Weather stations",
    "license": "License Commercial",
    "asidRequired": true,
    "awidCount": 1,
    "resourcePoolUri": "ues:UCL-BT:UUN_STUDENTS03_AWE",
    "uuAppNodeSetMap": {
      "CMD": {
        "nodeSize": "G1_S",
        "nodeCount": {
          "min": 1,
          "max": 1
        },
        "appPackUri": "ues:UCL-BT:UUN.BIOT22WDL01.MAING01/APPBOX-0.1.11-dev:UUN.BIOT22WDL01.MAING01/CMD-PACK",
        "runtimeStack": "UU.APPG01/APPSERVER_NODEJS_STACK-1.6"
      }
    },
    "uuAppObjectStoreMap": {
      "OSID_1": {
        "technology": "MongoDB-4.0",
        "size": 0.25,
        "backup": false,
        "alias": "primary"
      }
    },
    "uuConfigMap": {
      "asid_license_owner_list": [
        "579-8443-6613-1"
      ]
    }
  },
  "uuSubAppInstance": {
    "asid": "02f17f0e8bf9130d64cc140d551ca0f7",
    "asidOwner": "579-8443-6613-1",
    "awidList": [
      {
        "awid": "f6c344877859b2d8896cce2233ff8dbf",
        "awidOwner": "579-1943-1484-1"
      }
    ],
    "uuAppObjectStoreMap": {
      "OSID_1": {
        "osid": "x8ceiqcab7wnx0aauyccmlfwca79hiqx3"
      }
    }
  }
}