lon,lat,alt,roll,pitch,yaw
0.1539106063,0.7190275774,0.6350181669,0.8652795112,0.4949952568,0.1621811232
0.3807703982,0.6589897911,0.9955448593,0.7369065368,0.4520967093,0.0849144166
0.9493862729,0.2379759237,0.9390573283,0.3345133797,0.8999608511,0.033188154
0.247054845,0.7056859909,0.1150260726,0.5122383843,0.0073267679,0.5459604299
0.0452646807,0.6830346657,0.5231324843,0.1181093362,0.0813012508,0.7008315749
0.9299999243,0.3731868332,0.0688963056,0.9154541301,0.6441086201,0.4612586889
0.086499171,0.6325818942,0.9478671405,0.8909116812,0.3453390043,0.4329802617
0.0152025485,0.1722446817,0.985349091,0.1771466671,0.4491792014,0.0161264034
0.0472530559,0.5676019079,0.3892158115,0.1143604524,0.0737531186,0.7470803704
0.171316123,0.3851551978,0.0939696486,0.6221286816,0.8900562917,0.8040099059
0.8739295239,0.4372309106,0.594853878,0.3803769581,0.9378528254,0.4736311995
0.5370451615,0.4780282043,0.185349168,0.066901852,0.8048659678,0.9299182352
0.9439902052,0.1697243612,0.3001918869,0.7272697232,0.6022181787,0.0689550859
0.1648333032,0.4636437238,0.5249713238,0.8823305922,0.4931706124,0.7969887124
0.3431550215,0.666724064,0.484166202,0.5071624454,0.1005597267,0.7558418811
0.5023734826,0.1714076975,0.4674002486,0.0665399914,0.4154500244,0.6170861109
0.7866063167,0.0346937031,0.0127133128,0.670296568,0.0101480117,0.2384182409
0.8606335922,0.568246032,0.9177985351,0.9685512591,0.9045153036,0.8202064026
0.6399679848,0.3644736266,0.3093427152,0.3682608294,0.5441285972,0.9765010841
