Categories:Navigation
License:Apache2
Web Site:https://github.com/n76/Local-GSM-Backend/blob/HEAD/README.md
Source Code:https://github.com/n76/Local-GSM-Backend
Issue Tracker:https://github.com/n76/Local-GSM-Backend/issues

Name:LocalGsmNlpBackend
Auto Name:GSM Location Service
Summary:UnifiedNlp location provider (local GSM database)
Description:
[[com.google.android.gms]] backend that uses local GSM data to resolve user
location.

A facility in the setting menu allows you to create a database using data from
[http://opencellid.org OpenCellId] and/or [https://location.services.mozilla.com
Mozilla Location Services] CSV files. Alternatively, the on-phone database can
be generated in advance via the [https://github.com/n76/lacells-creator
lacells-creator] scripts that gather tower information from those two sources,
too.

This backend performs no network data. All data acquired by the phone stays on
the phone and no queries are made to a centralized AP location provider.
.

Repo Type:git
Repo:https://github.com/n76/Local-GSM-Backend

Build:0.5.4,9
    commit=v0.5.4
    srclibs=1:UnifiedNlpApi@v1.0.1
    rm=libs/UnifiedNlpApi.jar
    target=android-19

Build:0.5.6,11
    commit=v0.5.6
    srclibs=1:UnifiedNlpApi@v1.0.1
    rm=libs/UnifiedNlpApi.jar
    target=android-19

Build:0.5.8,13
    commit=v0.5.8
    srclibs=1:UnifiedNlpApi@v1.0.1
    rm=libs/UnifiedNlpApi.jar
    target=android-19

Build:0.5.10,15
    commit=v0.5.10
    srclibs=1:UnifiedNlpApi@v1.0.1
    rm=libs/UnifiedNlpApi.jar
    target=android-19

Build:0.5.11,16
    commit=v0.5.11
    srclibs=1:UnifiedNlpApi@v1.0.1
    rm=libs/UnifiedNlpApi.jar
    target=android-19

Build:0.6.0,17
    commit=v0.6.0
    srclibs=1:UnifiedNlpApi@v1.0.1
    rm=libs/UnifiedNlpApi.jar
    target=android-19

Build:0.6.1,18
    commit=v0.6.1
    srclibs=1:UnifiedNlpApi@v1.0.1
    rm=libs/UnifiedNlpApi.jar
    target=android-19

Build:0.6.4,19
    commit=v0.6.4
    srclibs=1:UnifiedNlpApi@v1.0.1
    rm=libs/UnifiedNlpApi.jar
    target=android-19

Build:0.7.0,20
    commit=v0.7.0
    srclibs=1:UnifiedNlpApi@v1.0.1
    rm=libs/UnifiedNlpApi.jar
    target=android-19

Build:0.8.0,21
    disable=missing root project, see https://github.com/n76/Local-GSM-Backend/issues/22
    commit=v0.8.0
    subdir=app
    gradle=yes

Build:0.8.1,22
    commit=v0.8.1
    subdir=app
    gradle=yes

Build:0.9.0,23
    commit=v0.9.0
    subdir=app
    gradle=yes

Build:0.9.1,24
    commit=v0.9.1
    subdir=app
    gradle=yes

Build:0.9.2,25
    commit=v0.9.2
    subdir=app
    gradle=yes

Build:0.9.3,26
    commit=v0.9.3
    subdir=app
    gradle=yes

Build:0.9.4,27
    commit=v0.9.4
    subdir=app
    gradle=yes

Build:1.0.0,28
    commit=v1.0.0
    subdir=app
    gradle=yes

Build:1.0.1,29
    commit=v1.0.1
    subdir=app
    gradle=yes

Build:1.0.3,31
    commit=v1.0.3
    subdir=app
    gradle=yes

Build:1.0.4,32
    commit=v1.0.4
    subdir=app
    gradle=yes

Build:1.0.5,33
    commit=v1.0.5
    subdir=app
    gradle=yes

Build:1.0.6,34
    commit=v1.0.6
    subdir=app
    gradle=yes

Build:1.0.7,35
    commit=v1.0.7
    subdir=app
    gradle=yes

Build:1.1.0,36
    commit=v1.1.0
    subdir=app
    gradle=yes

Build:1.2.0,37
    commit=v1.2.0
    subdir=app
    gradle=yes

Build:1.2.1,38
    commit=v1.2.1
    subdir=app
    gradle=yes

Build:1.3.0,39
    commit=v1.3.0
    subdir=app
    gradle=yes

Build:1.3.1,40
    commit=v1.3.1
    subdir=app
    gradle=yes

Build:1.3.2,41
    commit=v1.3.2
    subdir=app
    gradle=yes

Build:1.3.3,42
    commit=v1.3.3
    subdir=app
    gradle=yes

Build:1.3.4,43
    commit=v1.3.4
    subdir=app
    gradle=yes

Build:1.3.5,44
    disable=fails to build with gradle 2.10
    commit=v1.3.5
    subdir=app
    gradle=yes

Build:1.3.6,45
    commit=v1.3.6
    subdir=app
    gradle=yes

Auto Update Mode:Version v%v
Update Check Mode:Tags
Current Version:1.3.6
Current Version Code:45
