-------------------------------------------------------------------------------
Test set: io.jenkins.pipeline.sample.TestSharedLibrary
-------------------------------------------------------------------------------
Tests run: 1, Failures: 0, Errors: 0, Skipped: 0, Time elapsed: 2.84 sec
