Group,Result
3 navn,1
3 navn,1
3 navn,1
3 navn,1
3 navn,1
3 navn,1
3 navn,1
3 navn,1
3 navn,1
3 navn,1
3 navn,1
3 navn,1
3 navn,1
3 navn,1
3 navn,1
3 navn,1
3 navn,1
3 navn,1
3 navn,1
3 navn,1
3 navn,1
3 navn,1
3 navn,2
3 navn,2
3 navn,2
3 navn,2
3 navn,2
3 navn,2
8 navn,1
8 navn,1
8 navn,1
8 navn,1
8 navn,1
8 navn,1
8 navn,1
8 navn,1
8 navn,1
8 navn,1
8 navn,1
8 navn,1
8 navn,1
8 navn,1
8 navn,1
8 navn,2
8 navn,2
8 navn,2
8 navn,2
8 navn,2
8 navn,2
8 navn,2
8 navn,2
8 navn,2
8 navn,2
8 navn,2
8 navn,2
8 navn,2
