{
	"info": {
		"_postman_id": "0dab8a16-82a1-4889-b862-4d72bc50c320",
		"name": "Link Shortener",
		"schema": "https://schema.getpostman.com/json/collection/v2.1.0/collection.json"
	},
	"item": [
		{
			"name": "links",
			"item": [
				{
					"name": "Link List",
					"request": {
						"auth": {
							"type": "noauth"
						},
						"method": "GET",
						"header": [],
						"url": {
							"raw": "{{BaseUrl}}/api/v1/links",
							"host": [
								"{{BaseUrl}}"
							],
							"path": [
								"api",
								"v1",
								"links"
							]
						}
					},
					"response": []
				},
				{
					"name": "Get Link",
					"request": {
						"auth": {
							"type": "bearer",
							"bearer": [
								{
									"key": "token",
									"value": "eyJ0eXAiOiJKV1QiLCJhbGciOiJSUzI1NiJ9.eyJpZCI6IjEiLCJ1c2VybmFtZSI6InRlc3QiLCJleHBpcmVfYXQiOjE2NTA5MjUwODh9.bd5lB4f5LpvpYvd-eRhoDDC9km4hEHy_9RncHI_OUsLKi597c3C2Zy7QnlcorvhRXzAWLHhyz4J2cIn-FQTt3jiuNcQB5a_rBbZPJ-cIzF89524ETM-BaY5i6fhUOAXyVeTBVquvNj7ex-SzgdpeWezOYdbupG4t2m8szilvdGfG4TTBbFXg0_vjnMhbcL4IRbKei0hI_fuEVRSTWdwqnwYCuzyw-osdUC9BPcyjvFXNetga_rpTQIrkAPMBz7_LlVaDYvWxHVNpZe61sXhJ1DxEQ8ZToKFIEOHKxqm5FMHErgDklbUzuN_1Hz_oIFHfNtUSEWG1Kw-PgJM1GqlexhYhBuTuUbr7to4S9UOwfoqZcXavPRffnVqC15zgB9L1m87FEP-Z_O22A7rsei8yY-7eWFE-nXPMxMzpXWqZ7eyWxEGsdZxA5jQJyLrc2MQywByFpzo6jN-jdaEs4AcfulgON-27I8cyJN2vrqcYOmrNrlBv2qZOv29-Nz7EVrMu",
									"type": "string"
								}
							]
						},
						"method": "GET",
						"header": [],
						"url": {
							"raw": "{{BaseUrl}}/api/v1/link/4",
							"host": [
								"{{BaseUrl}}"
							],
							"path": [
								"api",
								"v1",
								"link",
								"4"
							]
						}
					},
					"response": []
				},
				{
					"name": "Create New Link",
					"request": {
						"auth": {
							"type": "bearer",
							"bearer": [
								{
									"key": "token",
									"value": "eyJ0eXAiOiJKV1QiLCJhbGciOiJSUzI1NiJ9.eyJpZCI6IjEiLCJ1c2VybmFtZSI6InRlc3QiLCJleHBpcmVfYXQiOjE2NTA5MjM2MjB9.Af_C4feD-PLX1lDEJsqOLLUdthwAteRVj4fXGSPHQKb19a3Te3hph54OSeaiRVdk3OugDFJ_OFIRaadk3U77uod_4Rn3qxd5HiUPynT91h-lHdO8GQQezbs9j0ukB1z16AufnaEJftHye9bImApXJ8kLTI-kyzJRpLs6ih9eq6qVVxtjKZvcpXRQTGgmwUTAzpal0nlkXP1bysSeN27Mldt2wWosnQcWtRKK99fafzCXPQFQLZ_Z07Lp_f5WypQf91-s3byH-ykaip80X3IMQqEBqJ5h3waxSzK-BLQxgU95cO6W-stjMDLkNytcb0rtrw0E0ZbR675jgBOnk8tu9T4yAwpSGQJKtBLvRnEtHKHqNvL8LhwU9ifQH3ezF13PSwpMmMC1ZSLzUggLbUcHndWlwlVcNUISzEi3Mp6iubySyE4ZEJUyURi7xAUl7FdiAs_7zCZcs_EmFMEqYGIaHUK3_CesleSxa6Ht_8f-tWzHwfmZ5vARfbZivYvz1fc4",
									"type": "string"
								}
							]
						},
						"method": "POST",
						"header": [],
						"body": {
							"mode": "formdata",
							"formdata": [
								{
									"key": "link",
									"value": "http://test.com",
									"type": "text"
								}
							]
						},
						"url": {
							"raw": "{{BaseUrl}}/api/v1/link",
							"host": [
								"{{BaseUrl}}"
							],
							"path": [
								"api",
								"v1",
								"link"
							]
						}
					},
					"response": []
				},
				{
					"name": "Delete Link",
					"request": {
						"auth": {
							"type": "bearer",
							"bearer": [
								{
									"key": "token",
									"value": "eyJ0eXAiOiJKV1QiLCJhbGciOiJSUzI1NiJ9.eyJpZCI6IjEiLCJ1c2VybmFtZSI6InRlc3QiLCJleHBpcmVfYXQiOjE2NTA5MjM2MjB9.Af_C4feD-PLX1lDEJsqOLLUdthwAteRVj4fXGSPHQKb19a3Te3hph54OSeaiRVdk3OugDFJ_OFIRaadk3U77uod_4Rn3qxd5HiUPynT91h-lHdO8GQQezbs9j0ukB1z16AufnaEJftHye9bImApXJ8kLTI-kyzJRpLs6ih9eq6qVVxtjKZvcpXRQTGgmwUTAzpal0nlkXP1bysSeN27Mldt2wWosnQcWtRKK99fafzCXPQFQLZ_Z07Lp_f5WypQf91-s3byH-ykaip80X3IMQqEBqJ5h3waxSzK-BLQxgU95cO6W-stjMDLkNytcb0rtrw0E0ZbR675jgBOnk8tu9T4yAwpSGQJKtBLvRnEtHKHqNvL8LhwU9ifQH3ezF13PSwpMmMC1ZSLzUggLbUcHndWlwlVcNUISzEi3Mp6iubySyE4ZEJUyURi7xAUl7FdiAs_7zCZcs_EmFMEqYGIaHUK3_CesleSxa6Ht_8f-tWzHwfmZ5vARfbZivYvz1fc4",
									"type": "string"
								}
							]
						},
						"method": "DELETE",
						"header": [],
						"url": {
							"raw": "{{BaseUrl}}/api/v1/link/3",
							"host": [
								"{{BaseUrl}}"
							],
							"path": [
								"api",
								"v1",
								"link",
								"3"
							]
						}
					},
					"response": []
				},
				{
					"name": "Edit Link",
					"request": {
						"auth": {
							"type": "bearer",
							"bearer": [
								{
									"key": "token",
									"value": "eyJ0eXAiOiJKV1QiLCJhbGciOiJSUzI1NiJ9.eyJpZCI6IjEiLCJ1c2VybmFtZSI6InRlc3QiLCJleHBpcmVfYXQiOjE2NTA5MjM2MjB9.Af_C4feD-PLX1lDEJsqOLLUdthwAteRVj4fXGSPHQKb19a3Te3hph54OSeaiRVdk3OugDFJ_OFIRaadk3U77uod_4Rn3qxd5HiUPynT91h-lHdO8GQQezbs9j0ukB1z16AufnaEJftHye9bImApXJ8kLTI-kyzJRpLs6ih9eq6qVVxtjKZvcpXRQTGgmwUTAzpal0nlkXP1bysSeN27Mldt2wWosnQcWtRKK99fafzCXPQFQLZ_Z07Lp_f5WypQf91-s3byH-ykaip80X3IMQqEBqJ5h3waxSzK-BLQxgU95cO6W-stjMDLkNytcb0rtrw0E0ZbR675jgBOnk8tu9T4yAwpSGQJKtBLvRnEtHKHqNvL8LhwU9ifQH3ezF13PSwpMmMC1ZSLzUggLbUcHndWlwlVcNUISzEi3Mp6iubySyE4ZEJUyURi7xAUl7FdiAs_7zCZcs_EmFMEqYGIaHUK3_CesleSxa6Ht_8f-tWzHwfmZ5vARfbZivYvz1fc4",
									"type": "string"
								}
							]
						},
						"method": "POST",
						"header": [],
						"body": {
							"mode": "formdata",
							"formdata": [
								{
									"key": "link",
									"value": "http://google.com",
									"type": "text"
								}
							]
						},
						"url": {
							"raw": "{{BaseUrl}}/api/v1/link/5",
							"host": [
								"{{BaseUrl}}"
							],
							"path": [
								"api",
								"v1",
								"link",
								"5"
							]
						}
					},
					"response": []
				}
			]
		},
		{
			"name": "login",
			"request": {
				"method": "POST",
				"header": [],
				"body": {
					"mode": "formdata",
					"formdata": [
						{
							"key": "username",
							"value": "test",
							"type": "text"
						},
						{
							"key": "password",
							"value": "test",
							"type": "text"
						}
					]
				},
				"url": {
					"raw": "{{BaseUrl}}/api/v1/login",
					"host": [
						"{{BaseUrl}}"
					],
					"path": [
						"api",
						"v1",
						"login"
					]
				}
			},
			"response": []
		}
	]
}