{
	"CONFIG_VERSION": "1.0.0",

	"LIB_PATH": "./moxa-scaler-default.so",

	"NUM_OF_USER_CMDS": 7,
	
	"USER_CMDS": [
		{
			"CMD_NAME": "SWI",
			"OPT": "v",
			"LONG_OPT": "version",
			"PARAM": 0,
			"SEND_FUNC": "fwr_version_send",
			"RECV_FUNC": "fwr_version_recv",
			"HELP": "\t-v, --version\n\t\tGet scaler firmware version\n"
		},
		{
			"CMD_NAME": "TYP",
			"OPT": "m",
			"LONG_OPT": "model",
			"PARAM": 0,
			"SEND_FUNC": "model_name_send",
			"RECV_FUNC": "model_name_recv",
			"HELP": "\t-m, --model\n\t\tGet model name\n"
		},
		{
			"CMD_NAME": "BZZ",
			"OPT": "z",
			"LONG_OPT": "buzzer",
			"PARAM": 1,
			"SEND_FUNC": "buzzer_control_send",
			"RECV_FUNC": "buzzer_control_recv",
			"HELP": "\t-z, --buzzer [on|off]\n\t\tSet buzzer status\n"
		},
		{
			"CMD_NAME": "EMS",
			"OPT": "e",
			"LONG_OPT": "ecdis",
			"PARAM": 0,
			"SEND_FUNC": "ecdis_mode_send",
			"RECV_FUNC": "ecdis_mode_recv",
			"HELP": "\t-e, --ecids [0~2]\n\t\tSet ecdis mode: \n\t\t\t0: Day\n\t\t\t1: Dusk\n\t\t\t2: Night\n\t\tQuery current ecdis mode without arg\n"
		},
		{
			"CMD_NAME": "BLI",
			"OPT": "b",
			"LONG_OPT": "brightness",
			"PARAM": 0,
			"SEND_FUNC": "brightness_control_send",
			"RECV_FUNC": "brightness_control_recv",
			"HELP": "\t-b, --brightness [0~255]\n\t\tSet brightness, query without arg \n"
		},
		{
			"CMD_NAME": "TCB",
			"OPT": "t",
			"LONG_OPT": "touch-button",
			"PARAM": 0,
			"SEND_FUNC": "touch_button_ctl_send",
			"RECV_FUNC": "touch_button_ctl_recv",
			"HELP": "\t-t, --touch-button [0~4] [on|off]\n\t\tSet touch button status status:\n\t\t\t0: pwr button\n\t\t\t1: br+ button\n\t\t\t2: br- button\n\t\t\t3: function button\n\t\t\t4: ecids mode button\n\t\tQuery all button status without arg\n"
		},
		{
			"CMD_NAME": "CMD",
			"OPT": "c",
			"LONG_OPT": "custom-cmd",
			"PARAM": 1,
			"SEND_FUNC": "custom_cmd_send",
			"RECV_FUNC": "",
			"HELP": "\t-c, --custom-cmd [cmd]\n\t\tSend custom command:\n\t\t\tExample: moxa-scaler-util -c \"07 FF 53 57 49 00 06\"\n\t\t\tSend scaler firmware query command\n"
		}

	]

}
