-------------------------------------------------------------------------------
Test set: com.social.repository.UserRepositoryTest
-------------------------------------------------------------------------------
Tests run: 2, Failures: 0, Errors: 2, Skipped: 0, Time elapsed: 16.403 s <<< FAILURE! - in com.social.repository.UserRepositoryTest
testSave(com.social.repository.UserRepositoryTest)  Time elapsed: 0.346 s  <<< ERROR!
javax.persistence.PersistenceException: org.hibernate.exception.ConstraintViolationException: could not execute statement
	at com.social.repository.UserRepositoryTest.testSave(UserRepositoryTest.java:36)
Caused by: org.hibernate.exception.ConstraintViolationException: could not execute statement
	at com.social.repository.UserRepositoryTest.testSave(UserRepositoryTest.java:36)
Caused by: com.mysql.jdbc.exceptions.jdbc4.MySQLIntegrityConstraintViolationException: Duplicata du champ 'Olfa__' pour la clef 'UK_sb8bbouer5wak8vyiiy4pf2bx'
	at com.social.repository.UserRepositoryTest.testSave(UserRepositoryTest.java:36)

findOneByUsername(com.social.repository.UserRepositoryTest)  Time elapsed: 0.016 s  <<< ERROR!
javax.persistence.PersistenceException: org.hibernate.exception.ConstraintViolationException: could not execute statement
	at com.social.repository.UserRepositoryTest.findOneByUsername(UserRepositoryTest.java:51)
Caused by: org.hibernate.exception.ConstraintViolationException: could not execute statement
	at com.social.repository.UserRepositoryTest.findOneByUsername(UserRepositoryTest.java:51)
Caused by: com.mysql.jdbc.exceptions.jdbc4.MySQLIntegrityConstraintViolationException: Duplicata du champ 'Ilyes__' pour la clef 'UK_sb8bbouer5wak8vyiiy4pf2bx'
	at com.social.repository.UserRepositoryTest.findOneByUsername(UserRepositoryTest.java:51)

