-------------------------------------------------------------------------------
Test set: com.social.SpringBootSocialAuthApplicationTests
-------------------------------------------------------------------------------
Tests run: 1, Failures: 0, Errors: 0, Skipped: 0, Time elapsed: 5.672 s - in com.social.SpringBootSocialAuthApplicationTests
