7,-1,5.96046447754e-06
8,0,0.000200033187866
9,0,0.000223159790039
10,1,0.000294923782349
11,0,0.00057578086853
12,-2,0.000407934188843
13,1,0.000769853591919
14,1,0.000548124313354
15,0,0.000593900680542
16,0,0.02920794487
17,-1,0.00126886367798
18,1,0.0406920909882
19,0,0.00108599662781
20,-1,9.70363616943e-05
