3,1,0.000432014465332
4,2,0.00457310676575
5,3,0.0324079990387
6,4,0.190722942352
7,4,2.06317019463
8,5,4.46953392029
9,6,8.17256999016
10,6,12.1087839603
11,7,14.8291368484
12,7,15.3398180008
13,7,13.1872689724
14,7,9.438808918
15,7,5.55089306831
16,7,2.70238208771
17,7,1.04578495026
18,6,0.317980051041
19,5,0.0739848613739
20,4,0.0120439529419
21,3,0.00125193595886
