6,0,5.00679016113e-06
7,1,0.000201940536499
8,1,0.000241041183472
9,1,0.000475168228149
10,1,0.000643014907837
11,3,0.00130200386047
12,3,0.00153398513794
13,2,0.000591039657593
14,4,0.0223941802979
15,4,0.0253119468689
16,4,0.00293684005737
17,2,0.0011351108551
18,2,0.0414869785309
19,2,0.0468130111694
