7,0,7.86781311035e-06
8,1,0.000339031219482
9,1,0.000379085540771
10,1,0.000560998916626
11,0,0.000426054000854
12,1,0.000530958175659
13,2,0.00232601165771
14,2,0.000859975814819
15,-2,0.000931024551392
16,2,0.0307478904724
17,0,0.000877141952515
18,2,0.0416760444641
19,0,0.00168204307556
20,-1,9.70363616943e-05
