9,1,4.41074371338e-05
10,2,0.000479936599731
11,3,0.00377511978149
12,3,0.0218961238861
13,3,0.09033203125
14,3,0.275290966034
15,3,0.648091077805
16,3,1.19840598106
17,3,1.786714077
18,3,2.16158914566
19,3,2.07980680466
20,3,1.62182712555
21,3,1.01654481888
22,2,0.550158023834
23,1,0.208855867386
24,0,0.059818983078
25,-1,0.0119390487671
26,-2,0.00150203704834
