3,1,0.00015115737915
4,2,0.00140786170959
5,3,0.076061964035
6,3,0.249440908432
7,3,0.544828891754
8,4,0.950762033463
9,4,1.74852705002
10,5,1.54158592224
11,5,1.43526792526
12,5,1.07718801498
13,5,0.650817155838
14,5,0.309448003769
15,5,0.114013195038
16,4,0.0314779281616
17,3,0.00610494613647
18,2,0.000741958618164
