7,0,5.00679016113e-06
8,0,0.000315189361572
9,1,0.00036883354187
10,1,0.00075101852417
11,1,0.000339031219482
12,0,0.000514030456543
13,0,0.000501155853271
14,2,0.000524997711182
15,1,0.00106191635132
16,1,0.00113916397095
17,2,0.00211906433105
18,1,0.000914812088013
19,3,0.0528829097748
20,1,0.00125598907471
21,0,0.000110864639282
22,1,0.00149703025818
