9,0,2.50339508057e-05
10,1,0.000405073165894
11,2,0.000784873962402
12,2,0.00121903419495
13,2,0.00147008895874
14,2,0.00189518928528
15,2,0.00229001045227
16,2,0.00270295143127
17,2,0.00325512886047
18,2,0.00406408309937
19,3,0.00430583953857
20,4,0.0046660900116
21,5,0.00506210327148
22,5,0.00556898117065
23,5,0.00600409507751
24,4,0.00640892982483
25,3,0.00701022148132
26,3,0.0071439743042
27,2,0.00777196884155
28,1,0.00975704193115
