9,1,1.90734863281e-05
10,2,0.00029993057251
11,3,0.000581979751587
12,3,0.000888109207153
13,3,0.0015561580658
14,3,0.00165700912476
15,4,0.00194096565247
16,4,0.00237989425659
17,4,0.00270795822144
18,4,0.0030779838562
19,4,0.0035400390625
20,3,0.00390100479126
21,2,0.00422811508179
22,1,0.00471806526184
23,1,0.00489091873169
24,0,0.00522589683533
25,-1,0.00546193122864
26,-2,0.00563788414001
