16,-2,1.00135803223e-05
17,-1,0.000460863113403
18,-1,0.000635147094727
19,-2,0.000471115112305
20,-1,0.000952959060669
21,0,0.000881195068359
22,2,0.00147390365601
23,-2,0.0001220703125
24,0,0.000118017196655
