8,-1,2.00271606445e-05
9,0,0.000290870666504
10,1,0.000560998916626
11,2,0.000830173492432
12,3,0.00130009651184
13,3,0.00144505500793
14,3,0.00177311897278
15,3,0.00209403038025
16,3,0.00244307518005
17,4,0.00272703170776
18,4,0.00306010246277
19,4,0.00348114967346
20,4,0.00370502471924
21,4,0.00397396087646
22,4,0.00428199768066
23,3,0.00451707839966
24,1,0.00471615791321
