18,-5,9.29832458496e-05
19,-4,0.000699043273926
20,-3,0.00322794914246
21,-3,0.00811004638672
22,-3,0.0145680904388
23,-3,0.018394947052
24,-3,0.0161561965942
25,-3,0.0096127986908
26,-3,0.00438213348389
27,-3,0.00105595588684
