6,0,2.121925354e-05
7,1,0.000236988067627
8,2,0.000442981719971
9,3,0.000676870346069
10,4,0.000931978225708
11,4,0.0011351108551
12,5,0.00110387802124
13,5,0.00124406814575
14,5,0.00144791603088
15,6,0.00164604187012
16,5,0.00184988975525
17,5,0.00199389457703
18,5,0.00217604637146
19,4,0.00225400924683
