9,0,3.91006469727e-05
10,1,0.000457048416138
11,2,0.00452899932861
12,3,0.03107380867
13,4,0.141178131104
14,4,0.4885430336
15,5,1.3346350193
16,5,2.90621399879
17,5,5.1476919651
18,5,7.55751085281
19,5,8.8676571846
20,5,8.71982884407
21,5,7.04158711433
22,5,4.67653989792
23,4,2.49819612503
24,4,1.0718588829
25,4,0.356163024902
26,3,0.0895619392395
27,2,0.0155029296875
28,1,0.00171113014221
