6,0,6.19888305664e-06
7,0,0.000135898590088
8,0,0.000360012054443
9,2,0.000331878662109
10,0,0.000303030014038
11,3,0.000331878662109
12,1,0.000432968139648
13,1,0.000533819198608
14,0,0.000717878341675
15,-1,0.000771999359131
16,1,0.000937938690186
17,-3,0.000102043151855
18,-1,0.000101089477539
