5,0,1.50203704834e-05
6,1,0.000144958496094
7,2,0.000257968902588
8,3,0.00039005279541
9,3,0.000531196594238
10,3,0.000652074813843
11,4,0.000676155090332
12,4,0.000899076461792
13,4,0.000903129577637
14,3,0.00104379653931
15,2,0.00114703178406
