20,2,9.98973846436e-05
21,3,0.000931978225708
22,3,0.00354814529419
23,3,0.00927710533142
24,2,0.0162060260773
25,2,0.0214669704437
26,1,0.0184690952301
27,0,0.0109488964081
28,-1,0.00451803207397
29,-2,0.00108695030212
