%!PS-Adobe-3.0
%%Creator: graphviz version 2.38.0 (20140413.2041)
%%Title: %3
%%Pages: (atend)
%%BoundingBox: (atend)
%%EndComments
save
%%BeginProlog
/DotDict 200 dict def
DotDict begin

/setupLatin1 {
mark
/EncodingVector 256 array def
 EncodingVector 0

ISOLatin1Encoding 0 255 getinterval putinterval
EncodingVector 45 /hyphen put

% Set up ISO Latin 1 character encoding
/starnetISO {
        dup dup findfont dup length dict begin
        { 1 index /FID ne { def }{ pop pop } ifelse
        } forall
        /Encoding EncodingVector def
        currentdict end definefont
} def
/Times-Roman starnetISO def
/Times-Italic starnetISO def
/Times-Bold starnetISO def
/Times-BoldItalic starnetISO def
/Helvetica starnetISO def
/Helvetica-Oblique starnetISO def
/Helvetica-Bold starnetISO def
/Helvetica-BoldOblique starnetISO def
/Courier starnetISO def
/Courier-Oblique starnetISO def
/Courier-Bold starnetISO def
/Courier-BoldOblique starnetISO def
cleartomark
} bind def

%%BeginResource: procset graphviz 0 0
/coord-font-family /Times-Roman def
/default-font-family /Times-Roman def
/coordfont coord-font-family findfont 8 scalefont def

/InvScaleFactor 1.0 def
/set_scale {
       dup 1 exch div /InvScaleFactor exch def
       scale
} bind def

% styles
/solid { [] 0 setdash } bind def
/dashed { [9 InvScaleFactor mul dup ] 0 setdash } bind def
/dotted { [1 InvScaleFactor mul 6 InvScaleFactor mul] 0 setdash } bind def
/invis {/fill {newpath} def /stroke {newpath} def /show {pop newpath} def} bind def
/bold { 2 setlinewidth } bind def
/filled { } bind def
/unfilled { } bind def
/rounded { } bind def
/diagonals { } bind def
/tapered { } bind def

% hooks for setting color 
/nodecolor { sethsbcolor } bind def
/edgecolor { sethsbcolor } bind def
/graphcolor { sethsbcolor } bind def
/nopcolor {pop pop pop} bind def

/beginpage {	% i j npages
	/npages exch def
	/j exch def
	/i exch def
	/str 10 string def
	npages 1 gt {
		gsave
			coordfont setfont
			0 0 moveto
			(\() show i str cvs show (,) show j str cvs show (\)) show
		grestore
	} if
} bind def

/set_font {
	findfont exch
	scalefont setfont
} def

% draw text fitted to its expected width
/alignedtext {			% width text
	/text exch def
	/width exch def
	gsave
		width 0 gt {
			[] 0 setdash
			text stringwidth pop width exch sub text length div 0 text ashow
		} if
	grestore
} def

/boxprim {				% xcorner ycorner xsize ysize
		4 2 roll
		moveto
		2 copy
		exch 0 rlineto
		0 exch rlineto
		pop neg 0 rlineto
		closepath
} bind def

/ellipse_path {
	/ry exch def
	/rx exch def
	/y exch def
	/x exch def
	matrix currentmatrix
	newpath
	x y translate
	rx ry scale
	0 0 1 0 360 arc
	setmatrix
} bind def

/endpage { showpage } bind def
/showpage { } def

/layercolorseq
	[	% layer color sequence - darkest to lightest
		[0 0 0]
		[.2 .8 .8]
		[.4 .8 .8]
		[.6 .8 .8]
		[.8 .8 .8]
	]
def

/layerlen layercolorseq length def

/setlayer {/maxlayer exch def /curlayer exch def
	layercolorseq curlayer 1 sub layerlen mod get
	aload pop sethsbcolor
	/nodecolor {nopcolor} def
	/edgecolor {nopcolor} def
	/graphcolor {nopcolor} def
} bind def

/onlayer { curlayer ne {invis} if } def

/onlayers {
	/myupper exch def
	/mylower exch def
	curlayer mylower lt
	curlayer myupper gt
	or
	{invis} if
} def

/curlayer 0 def

%%EndResource
%%EndProlog
%%BeginSetup
14 default-font-family set_font
1 setmiterlimit
% /arrowlength 10 def
% /arrowwidth 5 def

% make sure pdfmark is harmless for PS-interpreters other than Distiller
/pdfmark where {pop} {userdict /pdfmark /cleartomark load put} ifelse
% make '<<' and '>>' safe on PS Level 1 devices
/languagelevel where {pop languagelevel}{1} ifelse
2 lt {
    userdict (<<) cvn ([) cvn load put
    userdict (>>) cvn ([) cvn load put
} if

%%EndSetup
setupLatin1
%%Page: 1 1
%%PageBoundingBox: 36 36 1730 2341
%%PageOrientation: Portrait
0 0 1 beginpage
gsave
36 36 1694 2305 boxprim clip newpath
1 1 set_scale 0 rotate 40 40 translate
% 0
gsave
1 setlinewidth
0 0 0 nodecolor
1348 2270.37 75.82 26.74 ellipse_path stroke
0 0 0 nodecolor
14 /Times-Roman set_font
1302.5 2274.17 moveto 91 (accomplish;v;01) alignedtext
0 0 0 nodecolor
14 /Times-Roman set_font
1340 2259.17 moveto 16 (\(0\)) alignedtext
grestore
% 7
gsave
1 setlinewidth
0 0 0 nodecolor
1234 2180.63 41.02 26.74 ellipse_path stroke
0 0 0 nodecolor
14 /Times-Roman set_font
1213 2184.43 moveto 42 (do;v;01) alignedtext
0 0 0 nodecolor
14 /Times-Roman set_font
1226 2169.43 moveto 16 (\(7\)) alignedtext
grestore
% 0->7
gsave
1 setlinewidth
0 0 0 edgecolor
newpath 1312.34 2246.55 moveto
1296.9 2235.32 1279.07 2221.69 1264.27 2209.82 curveto
stroke
0 0 0 edgecolor
newpath 1266.37 2207.02 moveto
1256.4 2203.44 lineto
1261.96 2212.45 lineto
closepath fill
1 setlinewidth
solid
0 0 0 edgecolor
newpath 1266.37 2207.02 moveto
1256.4 2203.44 lineto
1261.96 2212.45 lineto
closepath stroke
grestore
% 35
gsave
1 setlinewidth
0 0 0 nodecolor
1498 655.05 60.21 26.74 ellipse_path stroke
0 0 0 nodecolor
14 /Times-Roman set_font
1463.5 658.85 moveto 69 (success;n;01) alignedtext
0 0 0 nodecolor
14 /Times-Roman set_font
1486.5 643.85 moveto 23 (\(35\)) alignedtext
grestore
% 0->35
gsave
1 setlinewidth
0 0 0 edgecolor
newpath 1384.34 2246.63 moveto
1427 2216.8 1492 2160.14 1492 2091.89 curveto
1492 2091.89 1492 2091.89 1492 833.53 curveto
1492 784.78 1494.29 728.53 1496.04 692.65 curveto
stroke
0 0 0 edgecolor
newpath 1499.56 692.37 moveto
1496.56 682.2 lineto
1492.57 692.02 lineto
closepath fill
1 setlinewidth
solid
0 0 0 edgecolor
newpath 1499.56 692.37 moveto
1496.56 682.2 lineto
1492.57 692.02 lineto
closepath stroke
grestore
% 1
gsave
1 setlinewidth
0 0 0 nodecolor
721 1103.75 54.39 26.74 ellipse_path stroke
0 0 0 nodecolor
14 /Times-Roman set_font
690.5 1107.55 moveto 61 (action;n;01) alignedtext
0 0 0 nodecolor
14 /Times-Roman set_font
713 1092.55 moveto 16 (\(1\)) alignedtext
grestore
% 16
gsave
1 setlinewidth
0 0 0 nodecolor
721 1014.01 62.87 26.74 ellipse_path stroke
0 0 0 nodecolor
14 /Times-Roman set_font
684.5 1017.81 moveto 73 (mention;v;01) alignedtext
0 0 0 nodecolor
14 /Times-Roman set_font
709.5 1002.81 moveto 23 (\(16\)) alignedtext
grestore
% 1->16
gsave
1 setlinewidth
0 0 0 edgecolor
newpath 721 1076.43 moveto
721 1068.46 721 1059.57 721 1051.08 curveto
stroke
0 0 0 edgecolor
newpath 724.5 1051.02 moveto
721 1041.02 lineto
717.5 1051.02 lineto
closepath fill
1 setlinewidth
solid
0 0 0 edgecolor
newpath 724.5 1051.02 moveto
721 1041.02 lineto
717.5 1051.02 lineto
closepath stroke
grestore
% 26
gsave
1 setlinewidth
0 0 0 nodecolor
278 1014.01 60.21 26.74 ellipse_path stroke
0 0 0 nodecolor
14 /Times-Roman set_font
243.5 1017.81 moveto 69 (process;v;01) alignedtext
0 0 0 nodecolor
14 /Times-Roman set_font
266.5 1002.81 moveto 23 (\(26\)) alignedtext
grestore
% 1->26
gsave
1 setlinewidth
0 0 0 edgecolor
newpath 671.04 1092.86 moveto
590.32 1076.87 431.26 1045.37 342.23 1027.73 curveto
stroke
0 0 0 edgecolor
newpath 342.75 1024.27 moveto
332.26 1025.76 lineto
341.39 1031.13 lineto
closepath fill
1 setlinewidth
solid
0 0 0 edgecolor
newpath 342.75 1024.27 moveto
332.26 1025.76 lineto
341.39 1031.13 lineto
closepath stroke
grestore
% 2
gsave
1 setlinewidth
0 0 0 nodecolor
114 565.31 54.39 26.74 ellipse_path stroke
0 0 0 nodecolor
14 /Times-Roman set_font
83.5 569.11 moveto 61 (action;n;02) alignedtext
0 0 0 nodecolor
14 /Times-Roman set_font
106 554.11 moveto 16 (\(2\)) alignedtext
grestore
% 25
gsave
1 setlinewidth
0 0 0 nodecolor
240 1193.49 60.21 26.74 ellipse_path stroke
0 0 0 nodecolor
14 /Times-Roman set_font
205.5 1197.29 moveto 69 (process;n;01) alignedtext
0 0 0 nodecolor
14 /Times-Roman set_font
228.5 1182.29 moveto 23 (\(25\)) alignedtext
grestore
% 2->25
gsave
1 setlinewidth
0 0 0 edgecolor
newpath 114 592.47 moveto
114 627.09 114 690.02 114 743.79 curveto
114 925.27 114 925.27 114 925.27 curveto
114 1020.61 126.35 1049.23 176 1130.62 curveto
183.18 1142.4 193.14 1153.48 203.06 1162.93 curveto
stroke
0 0 0 edgecolor
newpath 200.85 1165.65 moveto
210.59 1169.81 lineto
205.57 1160.48 lineto
closepath fill
1 setlinewidth
solid
0 0 0 edgecolor
newpath 200.85 1165.65 moveto
210.59 1169.81 lineto
205.57 1160.48 lineto
closepath stroke
grestore
% 3
gsave
1 setlinewidth
0 0 0 nodecolor
1086 206.35 48.58 26.74 ellipse_path stroke
0 0 0 nodecolor
14 /Times-Roman set_font
1059.5 210.15 moveto 53 (apart;r;01) alignedtext
0 0 0 nodecolor
14 /Times-Roman set_font
1078 195.15 moveto 16 (\(3\)) alignedtext
grestore
% 8
gsave
1 setlinewidth
0 0 0 nodecolor
923 116.61 44.6 26.74 ellipse_path stroke
0 0 0 nodecolor
14 /Times-Roman set_font
899.5 120.41 moveto 47 (else;r;01) alignedtext
0 0 0 nodecolor
14 /Times-Roman set_font
915 105.41 moveto 16 (\(8\)) alignedtext
grestore
% 3->8
gsave
1 setlinewidth
0 0 0 edgecolor
newpath 1049.11 188.43 moveto
1023.07 175.2 988.35 156.63 961.88 141.83 curveto
stroke
0 0 0 edgecolor
newpath 963.32 138.62 moveto
952.89 136.76 lineto
959.89 144.72 lineto
closepath fill
1 setlinewidth
solid
0 0 0 edgecolor
newpath 963.32 138.62 moveto
952.89 136.76 lineto
959.89 144.72 lineto
closepath stroke
grestore
% 18
gsave
1 setlinewidth
0 0 0 nodecolor
1188 26.87 50.41 26.74 ellipse_path stroke
0 0 0 nodecolor
14 /Times-Roman set_font
1160.5 30.67 moveto 55 (other;a;01) alignedtext
0 0 0 nodecolor
14 /Times-Roman set_font
1176.5 15.67 moveto 23 (\(18\)) alignedtext
grestore
% 3->18
gsave
1 setlinewidth
0 0 0 edgecolor
newpath 1100.4 180.3 moveto
1118.24 149.25 1148.72 96.21 1168.61 61.6 curveto
stroke
0 0 0 edgecolor
newpath 1171.73 63.21 moveto
1173.68 52.79 lineto
1165.66 59.72 lineto
closepath fill
1 setlinewidth
solid
0 0 0 edgecolor
newpath 1171.73 63.21 moveto
1173.68 52.79 lineto
1165.66 59.72 lineto
closepath stroke
grestore
% 4
gsave
1 setlinewidth
0 0 0 nodecolor
653 655.05 67.35 26.74 ellipse_path stroke
0 0 0 nodecolor
14 /Times-Roman set_font
613.5 658.85 moveto 79 (condition;n;01) alignedtext
0 0 0 nodecolor
14 /Times-Roman set_font
645 643.85 moveto 16 (\(4\)) alignedtext
grestore
% 33
gsave
1 setlinewidth
0 0 0 nodecolor
575 1642.19 48.58 26.74 ellipse_path stroke
0 0 0 nodecolor
14 /Times-Roman set_font
548.5 1645.99 moveto 53 (state;n;01) alignedtext
0 0 0 nodecolor
14 /Times-Roman set_font
563.5 1630.99 moveto 23 (\(33\)) alignedtext
grestore
% 4->33
gsave
1 setlinewidth
0 0 0 edgecolor
newpath 638.31 681.44 moveto
619 705.91 584.59 743.3 551 771.66 curveto
529.24 790.03 511.33 782.5 498 807.66 curveto
436.5 923.78 516 971.36 516 1102.75 curveto
516 1284.23 516 1284.23 516 1284.23 curveto
516 1403.45 553.06 1541.18 568.84 1605.12 curveto
stroke
0 0 0 edgecolor
newpath 565.5 1606.21 moveto
571.27 1615.1 lineto
572.3 1604.55 lineto
closepath fill
1 setlinewidth
solid
0 0 0 edgecolor
newpath 565.5 1606.21 moveto
571.27 1615.1 lineto
572.3 1604.55 lineto
closepath stroke
grestore
% 5
gsave
1 setlinewidth
0 0 0 nodecolor
498 1821.67 52.15 26.74 ellipse_path stroke
0 0 0 nodecolor
14 /Times-Roman set_font
469 1825.47 moveto 58 (detail;n;01) alignedtext
0 0 0 nodecolor
14 /Times-Roman set_font
490 1810.47 moveto 16 (\(5\)) alignedtext
grestore
% 9
gsave
1 setlinewidth
0 0 0 nodecolor
498 1731.93 58.88 26.74 ellipse_path stroke
0 0 0 nodecolor
14 /Times-Roman set_font
464.5 1735.73 moveto 67 (general;a;01) alignedtext
0 0 0 nodecolor
14 /Times-Roman set_font
490 1720.73 moveto 16 (\(9\)) alignedtext
grestore
% 5->9
gsave
1 setlinewidth
0 0 0 edgecolor
newpath 498 1794.35 moveto
498 1786.38 498 1777.49 498 1769 curveto
stroke
0 0 0 edgecolor
newpath 501.5 1768.94 moveto
498 1758.94 lineto
494.5 1768.94 lineto
closepath fill
1 setlinewidth
solid
0 0 0 edgecolor
newpath 501.5 1768.94 moveto
498 1758.94 lineto
494.5 1768.94 lineto
closepath stroke
grestore
% 6
gsave
1 setlinewidth
0 0 0 nodecolor
1016 296.09 63.78 26.74 ellipse_path stroke
0 0 0 nodecolor
14 /Times-Roman set_font
979 299.89 moveto 74 (different;a;01) alignedtext
0 0 0 nodecolor
14 /Times-Roman set_font
1008 284.89 moveto 16 (\(6\)) alignedtext
grestore
% 6->3
gsave
1 setlinewidth
0 0 0 edgecolor
newpath 1035.87 270.18 moveto
1043.59 260.51 1052.52 249.31 1060.69 239.07 curveto
stroke
0 0 0 edgecolor
newpath 1063.54 241.11 moveto
1067.04 231.11 lineto
1058.07 236.75 lineto
closepath fill
1 setlinewidth
solid
0 0 0 edgecolor
newpath 1063.54 241.11 moveto
1067.04 231.11 lineto
1058.07 236.75 lineto
closepath stroke
grestore
% 6->25
gsave
1 setlinewidth
0 0 0 edgecolor
newpath 952.67 299.48 moveto
791.5 306.02 374.78 325.94 322 358.96 curveto
81.51 509.4 224.47 703.89 209 987.14 curveto
207.7 1010.99 206.6 1017.12 209 1040.88 curveto
213.07 1081.11 223.07 1126.43 230.62 1156.96 curveto
stroke
0 0 0 edgecolor
newpath 227.24 1157.87 moveto
233.07 1166.71 lineto
234.03 1156.16 lineto
closepath fill
1 setlinewidth
solid
0 0 0 edgecolor
newpath 227.24 1157.87 moveto
233.07 1166.71 lineto
234.03 1156.16 lineto
closepath stroke
grestore
% 29
gsave
1 setlinewidth
0 0 0 nodecolor
1232 565.31 57.97 26.74 ellipse_path stroke
0 0 0 nodecolor
14 /Times-Roman set_font
1199 569.11 moveto 66 (quality;n;01) alignedtext
0 0 0 nodecolor
14 /Times-Roman set_font
1220.5 554.11 moveto 23 (\(29\)) alignedtext
grestore
% 6->29
gsave
1 setlinewidth
0 0 0 edgecolor
newpath 1044.04 320.26 moveto
1056.82 331.39 1071.78 345.26 1084 358.96 curveto
1134.4 415.44 1183.98 488.88 1211.02 530.89 curveto
stroke
0 0 0 edgecolor
newpath 1208.11 532.83 moveto
1216.45 539.36 lineto
1214 529.05 lineto
closepath fill
1 setlinewidth
solid
0 0 0 edgecolor
newpath 1208.11 532.83 moveto
1216.45 539.36 lineto
1214 529.05 lineto
closepath stroke
grestore
% 7->0
gsave
1 setlinewidth
0 0 0 edgecolor
newpath 1263.23 2199.82 moveto
1278.82 2210.94 1297.98 2225.47 1314.19 2238.36 curveto
stroke
0 0 0 edgecolor
newpath 1312.38 2241.4 moveto
1322.37 2244.93 lineto
1316.77 2235.94 lineto
closepath fill
1 setlinewidth
solid
0 0 0 edgecolor
newpath 1312.38 2241.4 moveto
1322.37 2244.93 lineto
1316.77 2235.94 lineto
closepath stroke
grestore
% 7->1
gsave
1 setlinewidth
0 0 0 edgecolor
newpath 1234 2153.47 moveto
1234 2118.85 1234 2055.92 1234 2002.15 curveto
1234 2002.15 1234 2002.15 1234 1820.67 curveto
1234 1556.17 1221.02 1453.78 1045 1256.36 curveto
974.15 1176.89 852.89 1135.87 780.51 1117.44 curveto
stroke
0 0 0 edgecolor
newpath 781.18 1114 moveto
770.63 1114.99 lineto
779.49 1120.79 lineto
closepath fill
1 setlinewidth
solid
0 0 0 edgecolor
newpath 781.18 1114 moveto
770.63 1114.99 lineto
779.49 1120.79 lineto
closepath stroke
grestore
% 7->2
gsave
1 setlinewidth
0 0 0 edgecolor
newpath 1192.78 2178.85 moveto
1005.13 2175.08 236.48 2157.34 137 2117.76 curveto
62.97 2088.31 0 2081.82 0 2002.15 curveto
0 2002.15 0 2002.15 0 1282.23 curveto
0 1162.27 38 1134.97 38 1015.01 curveto
38 1015.01 38 1015.01 38 743.79 curveto
38 689.94 67.93 633.79 90.22 599.43 curveto
stroke
0 0 0 edgecolor
newpath 93.37 601.02 moveto
95.99 590.75 lineto
87.54 597.14 lineto
closepath fill
1 setlinewidth
solid
0 0 0 edgecolor
newpath 93.37 601.02 moveto
95.99 590.75 lineto
87.54 597.14 lineto
closepath stroke
grestore
% 17
gsave
1 setlinewidth
0 0 0 nodecolor
365 1283.23 49.49 26.74 ellipse_path stroke
0 0 0 nodecolor
14 /Times-Roman set_font
338 1287.03 moveto 54 (need;n;01) alignedtext
0 0 0 nodecolor
14 /Times-Roman set_font
353.5 1272.03 moveto 23 (\(17\)) alignedtext
grestore
% 7->17
gsave
1 setlinewidth
0 0 0 edgecolor
newpath 1192.74 2179.5 moveto
1010.67 2176.56 288 2139.32 288 1732.93 curveto
288 1732.93 288 1732.93 288 1551.45 curveto
288 1465 325.67 1368.75 348.32 1318.71 curveto
stroke
0 0 0 edgecolor
newpath 351.63 1319.88 moveto
352.63 1309.33 lineto
345.27 1316.95 lineto
closepath fill
1 setlinewidth
solid
0 0 0 edgecolor
newpath 351.63 1319.88 moveto
352.63 1309.33 lineto
345.27 1316.95 lineto
closepath stroke
grestore
% 7->26
gsave
1 setlinewidth
0 0 0 edgecolor
newpath 1193.18 2177.98 moveto
983.56 2168.95 38 2121.61 38 2002.15 curveto
38 2002.15 38 2002.15 38 1551.45 curveto
38 1427.98 114 1407.71 114 1284.23 curveto
114 1284.23 114 1284.23 114 1192.49 curveto
114 1123.18 182.31 1069.41 230.76 1039.99 curveto
stroke
0 0 0 edgecolor
newpath 232.73 1042.89 moveto
239.55 1034.78 lineto
229.16 1036.87 lineto
closepath fill
1 setlinewidth
solid
0 0 0 edgecolor
newpath 232.73 1042.89 moveto
239.55 1034.78 lineto
229.16 1036.87 lineto
closepath stroke
grestore
% 27
gsave
1 setlinewidth
0 0 0 nodecolor
1108 2090.89 62.45 26.74 ellipse_path stroke
0 0 0 nodecolor
14 /Times-Roman set_font
1072 2094.69 moveto 72 (produce;v;01) alignedtext
0 0 0 nodecolor
14 /Times-Roman set_font
1096.5 2079.69 moveto 23 (\(27\)) alignedtext
grestore
% 7->27
gsave
1 setlinewidth
0 0 0 edgecolor
newpath 1206.66 2160.59 moveto
1189.64 2148.74 1167.43 2133.28 1148.4 2120.03 curveto
stroke
0 0 0 edgecolor
newpath 1150.4 2117.15 moveto
1140.19 2114.31 lineto
1146.4 2122.9 lineto
closepath fill
1 setlinewidth
solid
0 0 0 edgecolor
newpath 1150.4 2117.15 moveto
1140.19 2114.31 lineto
1146.4 2122.9 lineto
closepath stroke
grestore
% 8->3
gsave
1 setlinewidth
0 0 0 edgecolor
newpath 957.85 133.49 moveto
983.72 146.59 1018.93 165.39 1045.95 180.48 curveto
stroke
0 0 0 edgecolor
newpath 1044.34 183.59 moveto
1054.77 185.44 lineto
1047.77 177.49 lineto
closepath fill
1 setlinewidth
solid
0 0 0 edgecolor
newpath 1044.34 183.59 moveto
1054.77 185.44 lineto
1047.77 177.49 lineto
closepath stroke
grestore
% 8->6
gsave
1 setlinewidth
0 0 0 edgecolor
newpath 936 142.42 moveto
952.1 173.14 979.62 225.66 997.81 260.38 curveto
stroke
0 0 0 edgecolor
newpath 994.93 262.43 moveto
1002.68 269.66 lineto
1001.13 259.18 lineto
closepath fill
1 setlinewidth
solid
0 0 0 edgecolor
newpath 994.93 262.43 moveto
1002.68 269.66 lineto
1001.13 259.18 lineto
closepath stroke
grestore
% 13
gsave
1 setlinewidth
0 0 0 nodecolor
763 26.87 56.64 26.74 ellipse_path stroke
0 0 0 nodecolor
14 /Times-Roman set_font
731 30.67 moveto 64 (instead;r;01) alignedtext
0 0 0 nodecolor
14 /Times-Roman set_font
751.5 15.67 moveto 23 (\(13\)) alignedtext
grestore
% 8->13
gsave
1 setlinewidth
0 0 0 edgecolor
newpath 888.29 99.52 moveto
863.64 86.82 830.57 68.84 804.54 54.07 curveto
stroke
0 0 0 edgecolor
newpath 806.07 50.91 moveto
795.65 48.99 lineto
802.6 56.99 lineto
closepath fill
1 setlinewidth
solid
0 0 0 edgecolor
newpath 806.07 50.91 moveto
795.65 48.99 lineto
802.6 56.99 lineto
closepath stroke
grestore
% 14
gsave
1 setlinewidth
0 0 0 nodecolor
883 385.83 45.01 26.74 ellipse_path stroke
0 0 0 nodecolor
14 /Times-Roman set_font
859 389.63 moveto 48 (like;a;01) alignedtext
0 0 0 nodecolor
14 /Times-Roman set_font
871.5 374.63 moveto 23 (\(14\)) alignedtext
grestore
% 8->14
gsave
1 setlinewidth
0 0 0 edgecolor
newpath 917.12 143.41 moveto
914.72 154.48 912.03 167.58 910 179.48 curveto
899.93 238.5 891.54 307.62 886.9 348.73 curveto
stroke
0 0 0 edgecolor
newpath 883.41 348.48 moveto
885.78 358.8 lineto
890.36 349.25 lineto
closepath fill
1 setlinewidth
solid
0 0 0 edgecolor
newpath 883.41 348.48 moveto
885.78 358.8 lineto
890.36 349.25 lineto
closepath stroke
grestore
% 8->18
gsave
1 setlinewidth
0 0 0 edgecolor
newpath 961.53 102.85 moveto
1007.65 87.58 1085.07 61.95 1136.34 44.97 curveto
stroke
0 0 0 edgecolor
newpath 1137.52 48.27 moveto
1145.92 41.8 lineto
1135.32 41.62 lineto
closepath fill
1 setlinewidth
solid
0 0 0 edgecolor
newpath 1137.52 48.27 moveto
1145.92 41.8 lineto
1135.32 41.62 lineto
closepath stroke
grestore
% 30
gsave
1 setlinewidth
0 0 0 nodecolor
721 924.27 49.49 26.74 ellipse_path stroke
0 0 0 nodecolor
14 /Times-Roman set_font
694 928.07 moveto 54 (refer;v;01) alignedtext
0 0 0 nodecolor
14 /Times-Roman set_font
709.5 913.07 moveto 23 (\(30\)) alignedtext
grestore
% 8->30
gsave
1 setlinewidth
0 0 0 edgecolor
newpath 891.82 136.07 moveto
798.09 193.88 521.42 382.36 457 628.18 curveto
450.95 651.29 445.5 660.99 457 681.92 curveto
507.21 773.28 583.04 732.23 655 807.66 curveto
677.39 831.13 695.07 863.62 706.47 888.18 curveto
stroke
0 0 0 edgecolor
newpath 703.38 889.83 moveto
710.68 897.51 lineto
709.76 886.95 lineto
closepath fill
1 setlinewidth
solid
0 0 0 edgecolor
newpath 703.38 889.83 moveto
710.68 897.51 lineto
709.76 886.95 lineto
closepath stroke
grestore
% 31
gsave
1 setlinewidth
0 0 0 nodecolor
914 26.87 57.97 26.74 ellipse_path stroke
0 0 0 nodecolor
14 /Times-Roman set_font
881 30.67 moveto 66 (similar;a;01) alignedtext
0 0 0 nodecolor
14 /Times-Roman set_font
902.5 15.67 moveto 23 (\(31\)) alignedtext
grestore
% 8->31
gsave
1 setlinewidth
0 0 0 edgecolor
newpath 920.35 89.76 moveto
919.52 81.71 918.6 72.68 917.71 64.06 curveto
stroke
0 0 0 edgecolor
newpath 921.17 63.43 moveto
916.66 53.84 lineto
914.2 64.14 lineto
closepath fill
1 setlinewidth
solid
0 0 0 edgecolor
newpath 921.17 63.43 moveto
916.66 53.84 lineto
914.2 64.14 lineto
closepath stroke
grestore
% 9->33
gsave
1 setlinewidth
0 0 0 edgecolor
newpath 519.45 1706.49 moveto
528.17 1696.55 538.36 1684.94 547.61 1674.4 curveto
stroke
0 0 0 edgecolor
newpath 550.5 1676.42 moveto
554.46 1666.6 lineto
545.24 1671.8 lineto
closepath fill
1 setlinewidth
solid
0 0 0 edgecolor
newpath 550.5 1676.42 moveto
554.46 1666.6 lineto
545.24 1671.8 lineto
closepath stroke
grestore
% 36
gsave
1 setlinewidth
0 0 0 nodecolor
517 655.05 50.82 26.74 ellipse_path stroke
0 0 0 nodecolor
14 /Times-Roman set_font
489 658.85 moveto 56 (thing;n;01) alignedtext
0 0 0 nodecolor
14 /Times-Roman set_font
505.5 643.85 moveto 23 (\(36\)) alignedtext
grestore
% 9->36
gsave
1 setlinewidth
0 0 0 edgecolor
newpath 481.02 1706.2 moveto
464.21 1672.4 442 1609.55 442 1553.45 curveto
442 1553.45 442 1553.45 442 1102.75 curveto
442 971.43 432.5 936.68 457 807.66 curveto
464.92 765.93 481.58 719.95 495.63 689.69 curveto
stroke
0 0 0 edgecolor
newpath 498.9 690.97 moveto
500.09 680.44 lineto
492.59 687.93 lineto
closepath fill
1 setlinewidth
solid
0 0 0 edgecolor
newpath 498.9 690.97 moveto
500.09 680.44 lineto
492.59 687.93 lineto
closepath stroke
grestore
% 37
gsave
1 setlinewidth
0 0 0 nodecolor
549 834.53 50.82 26.74 ellipse_path stroke
0 0 0 nodecolor
14 /Times-Roman set_font
521 838.33 moveto 56 (thing;n;02) alignedtext
0 0 0 nodecolor
14 /Times-Roman set_font
537.5 823.33 moveto 23 (\(37\)) alignedtext
grestore
% 9->37
gsave
1 setlinewidth
0 0 0 edgecolor
newpath 502.12 1704.98 moveto
515.05 1622.63 554 1367.67 554 1284.23 curveto
554 1284.23 554 1284.23 554 1013.01 curveto
554 964.26 552.09 908.02 550.63 872.14 curveto
stroke
0 0 0 edgecolor
newpath 554.11 871.53 moveto
550.2 861.69 lineto
547.12 871.82 lineto
closepath fill
1 setlinewidth
solid
0 0 0 edgecolor
newpath 554.11 871.53 moveto
550.2 861.69 lineto
547.12 871.82 lineto
closepath stroke
grestore
% 10
gsave
1 setlinewidth
0 0 0 nodecolor
848 1372.97 49.49 26.74 ellipse_path stroke
0 0 0 nodecolor
14 /Times-Roman set_font
821 1376.77 moveto 54 (have;v;01) alignedtext
0 0 0 nodecolor
14 /Times-Roman set_font
836.5 1361.77 moveto 23 (\(10\)) alignedtext
grestore
% 10->5
gsave
1 setlinewidth
0 0 0 edgecolor
newpath 813.93 1392.5 moveto
767.76 1420.38 691 1477.81 691 1551.45 curveto
691 1643.19 691 1643.19 691 1643.19 curveto
691 1720.81 605.38 1773.77 548.2 1800.48 curveto
stroke
0 0 0 edgecolor
newpath 546.58 1797.37 moveto
538.93 1804.7 lineto
549.48 1803.74 lineto
closepath fill
1 setlinewidth
solid
0 0 0 edgecolor
newpath 546.58 1797.37 moveto
538.93 1804.7 lineto
549.48 1803.74 lineto
closepath stroke
grestore
% 12
gsave
1 setlinewidth
0 0 0 nodecolor
400 385.83 68.68 26.74 ellipse_path stroke
0 0 0 nodecolor
14 /Times-Roman set_font
359.5 389.63 moveto 81 (important;a;01) alignedtext
0 0 0 nodecolor
14 /Times-Roman set_font
388.5 374.63 moveto 23 (\(12\)) alignedtext
grestore
% 10->12
gsave
1 setlinewidth
0 0 0 edgecolor
newpath 805.71 1358.97 moveto
742.31 1336.55 630 1284.17 630 1194.49 curveto
630 1194.49 630 1194.49 630 1013.01 curveto
630 921.27 668.12 877.81 609 807.66 curveto
570.64 762.15 523.74 812.03 480 771.66 curveto
448.77 742.84 457.73 723.04 447 681.92 curveto
423.07 590.2 409.36 479.08 403.47 422.98 curveto
stroke
0 0 0 edgecolor
newpath 406.93 422.42 moveto
402.42 412.84 lineto
399.97 423.14 lineto
closepath fill
1 setlinewidth
solid
0 0 0 edgecolor
newpath 406.93 422.42 moveto
402.42 412.84 lineto
399.97 423.14 lineto
closepath stroke
grestore
% 10->17
gsave
1 setlinewidth
0 0 0 edgecolor
newpath 801.25 1363.48 moveto
711.96 1347.26 517.5 1311.93 421.26 1294.45 curveto
stroke
0 0 0 edgecolor
newpath 421.89 1291.01 moveto
411.42 1292.66 lineto
420.64 1297.9 lineto
closepath fill
1 setlinewidth
solid
0 0 0 edgecolor
newpath 421.89 1291.01 moveto
411.42 1292.66 lineto
420.64 1297.9 lineto
closepath stroke
grestore
% 19
gsave
1 setlinewidth
0 0 0 nodecolor
848 1462.71 48.17 26.74 ellipse_path stroke
0 0 0 nodecolor
14 /Times-Roman set_font
822 1466.51 moveto 52 (own;v;01) alignedtext
0 0 0 nodecolor
14 /Times-Roman set_font
836.5 1451.51 moveto 23 (\(19\)) alignedtext
grestore
% 10->19
gsave
1 setlinewidth
0 0 0 edgecolor
newpath 854.2 1399.64 moveto
854.72 1407.83 854.87 1417.06 854.65 1425.84 curveto
stroke
0 0 0 edgecolor
newpath 851.15 1425.72 moveto
854.22 1435.86 lineto
858.14 1426.02 lineto
closepath fill
1 setlinewidth
solid
0 0 0 edgecolor
newpath 851.15 1425.72 moveto
854.22 1435.86 lineto
858.14 1426.02 lineto
closepath stroke
grestore
% 23
gsave
1 setlinewidth
0 0 0 nodecolor
976 1283.23 60.21 26.74 ellipse_path stroke
0 0 0 nodecolor
14 /Times-Roman set_font
941.5 1287.03 moveto 69 (possess;n;01) alignedtext
0 0 0 nodecolor
14 /Times-Roman set_font
964.5 1272.03 moveto 23 (\(23\)) alignedtext
grestore
% 10->23
gsave
1 setlinewidth
0 0 0 edgecolor
newpath 874.04 1350.06 moveto
890.53 1338.09 912.18 1323.17 931.33 1310.57 curveto
stroke
0 0 0 edgecolor
newpath 933.46 1313.36 moveto
939.92 1304.96 lineto
929.64 1307.5 lineto
closepath fill
1 setlinewidth
solid
0 0 0 edgecolor
newpath 933.46 1313.36 moveto
939.92 1304.96 lineto
929.64 1307.5 lineto
closepath stroke
grestore
% 24
gsave
1 setlinewidth
0 0 0 nodecolor
820 1552.45 72.25 26.74 ellipse_path stroke
0 0 0 nodecolor
14 /Times-Roman set_font
777 1556.25 moveto 86 (possession;n;01) alignedtext
0 0 0 nodecolor
14 /Times-Roman set_font
808.5 1541.25 moveto 23 (\(24\)) alignedtext
grestore
% 10->24
gsave
1 setlinewidth
0 0 0 edgecolor
newpath 820.43 1395.65 moveto
809.02 1406.37 797.06 1420.33 791 1435.84 curveto
780.68 1462.27 789.73 1493.55 800.37 1516.91 curveto
stroke
0 0 0 edgecolor
newpath 797.3 1518.6 moveto
804.81 1526.08 lineto
803.6 1515.55 lineto
closepath fill
1 setlinewidth
solid
0 0 0 edgecolor
newpath 797.3 1518.6 moveto
804.81 1526.08 lineto
803.6 1515.55 lineto
closepath stroke
grestore
% 28
gsave
1 setlinewidth
0 0 0 nodecolor
626 475.57 58.88 26.74 ellipse_path stroke
0 0 0 nodecolor
14 /Times-Roman set_font
592.5 479.37 moveto 67 (qualify;v;01) alignedtext
0 0 0 nodecolor
14 /Times-Roman set_font
614.5 464.37 moveto 23 (\(28\)) alignedtext
grestore
% 10->28
gsave
1 setlinewidth
0 0 0 edgecolor
newpath 842.64 1346.14 moveto
840.43 1335.07 837.94 1321.98 836 1310.1 curveto
823.63 1234.41 777.17 687.87 729 628.18 curveto
702.98 595.94 668.41 624.91 643 592.18 curveto
625.69 569.89 622.17 537.68 622.57 512.92 curveto
stroke
0 0 0 edgecolor
newpath 626.07 512.94 moveto
622.95 502.81 lineto
619.08 512.67 lineto
closepath fill
1 setlinewidth
solid
0 0 0 edgecolor
newpath 626.07 512.94 moveto
622.95 502.81 lineto
619.08 512.67 lineto
closepath stroke
grestore
% 10->31
gsave
1 setlinewidth
0 0 0 edgecolor
newpath 852.87 1345.78 moveto
857.26 1322.33 863.94 1287.03 870 1256.36 curveto
904.75 1080.57 932.91 1039.68 951 861.4 curveto
971.87 655.79 859.84 617.05 829 412.7 curveto
825.44 389.08 827.89 382.82 829 358.96 curveto
834.56 238.92 803.76 198.9 854 89.74 curveto
859.48 77.84 868.23 66.83 877.38 57.51 curveto
stroke
0 0 0 edgecolor
newpath 879.97 59.87 moveto
884.74 50.41 lineto
875.11 54.83 lineto
closepath fill
1 setlinewidth
solid
0 0 0 edgecolor
newpath 879.97 59.87 moveto
884.74 50.41 lineto
875.11 54.83 lineto
closepath stroke
grestore
% 34
gsave
1 setlinewidth
0 0 0 nodecolor
1624 565.31 61.54 26.74 ellipse_path stroke
0 0 0 nodecolor
14 /Times-Roman set_font
1588.5 569.11 moveto 71 (succeed;v;01) alignedtext
0 0 0 nodecolor
14 /Times-Roman set_font
1612.5 554.11 moveto 23 (\(34\)) alignedtext
grestore
% 10->34
gsave
1 setlinewidth
0 0 0 edgecolor
newpath 856.88 1346.41 moveto
866.45 1321.47 883.52 1283.43 907 1256.36 curveto
968.27 1185.72 1546.23 851.45 1595 771.66 curveto
1626.92 719.44 1629.24 646.03 1627.19 602.6 curveto
stroke
0 0 0 edgecolor
newpath 1630.68 602.27 moveto
1626.61 592.49 lineto
1623.69 602.68 lineto
closepath fill
1 setlinewidth
solid
0 0 0 edgecolor
newpath 1630.68 602.27 moveto
1626.61 592.49 lineto
1623.69 602.68 lineto
closepath stroke
grestore
% 11
gsave
1 setlinewidth
0 0 0 nodecolor
400 296.09 74.91 26.74 ellipse_path stroke
0 0 0 nodecolor
14 /Times-Roman set_font
355 299.89 moveto 90 (importance;n;01) alignedtext
0 0 0 nodecolor
14 /Times-Roman set_font
388.5 284.89 moveto 23 (\(11\)) alignedtext
grestore
% 11->5
gsave
1 setlinewidth
0 0 0 edgecolor
newpath 325.23 298.02 moveto
209.46 303.84 0 333.83 0 474.57 curveto
0 1015.01 0 1015.01 0 1015.01 curveto
0 1327.99 55.4 1433.09 261 1669.06 curveto
297.29 1710.71 301.34 1727.71 347 1758.8 curveto
376.35 1778.79 413.15 1794.03 443.08 1804.39 curveto
stroke
0 0 0 edgecolor
newpath 442.35 1807.84 moveto
452.94 1807.71 lineto
444.59 1801.2 lineto
closepath fill
1 setlinewidth
solid
0 0 0 edgecolor
newpath 442.35 1807.84 moveto
452.94 1807.71 lineto
444.59 1801.2 lineto
closepath stroke
grestore
% 11->12
gsave
1 setlinewidth
0 0 0 edgecolor
newpath 406.22 323.06 moveto
406.72 331.12 406.87 340.15 406.65 348.77 curveto
stroke
0 0 0 edgecolor
newpath 403.15 348.84 moveto
406.22 358.98 lineto
410.14 349.14 lineto
closepath fill
1 setlinewidth
solid
0 0 0 edgecolor
newpath 403.15 348.84 moveto
406.22 358.98 lineto
410.14 349.14 lineto
closepath stroke
grestore
% 12->9
gsave
1 setlinewidth
0 0 0 edgecolor
newpath 371.13 410.25 moveto
336.2 441.41 282 500.11 282 564.31 curveto
282 656.05 282 656.05 282 656.05 curveto
282 829.51 362.9 868.15 347 1040.88 curveto
341.51 1100.54 291.51 1231.88 307 1310.1 curveto
340.53 1479.38 372.39 1517.56 455 1669.06 curveto
460.32 1678.81 466.83 1688.89 473.17 1698.02 curveto
stroke
0 0 0 edgecolor
newpath 470.5 1700.31 moveto
479.15 1706.44 lineto
476.21 1696.26 lineto
closepath fill
1 setlinewidth
solid
0 0 0 edgecolor
newpath 470.5 1700.31 moveto
479.15 1706.44 lineto
476.21 1696.26 lineto
closepath stroke
grestore
% 12->11
gsave
1 setlinewidth
0 0 0 edgecolor
newpath 393.78 358.98 moveto
393.28 350.93 393.13 341.9 393.34 333.28 curveto
stroke
0 0 0 edgecolor
newpath 396.85 333.2 moveto
393.78 323.06 lineto
389.86 332.9 lineto
closepath fill
1 setlinewidth
solid
0 0 0 edgecolor
newpath 396.85 333.2 moveto
393.78 323.06 lineto
389.86 332.9 lineto
closepath stroke
grestore
% 13->8
gsave
1 setlinewidth
0 0 0 edgecolor
newpath 802.28 46.33 moveto
827.44 59.4 859.81 77.07 884.76 91.29 curveto
stroke
0 0 0 edgecolor
newpath 883.17 94.41 moveto
893.59 96.36 lineto
886.66 88.34 lineto
closepath fill
1 setlinewidth
solid
0 0 0 edgecolor
newpath 883.17 94.41 moveto
893.59 96.36 lineto
886.66 88.34 lineto
closepath stroke
grestore
% 14->6
gsave
1 setlinewidth
0 0 0 edgecolor
newpath 912.52 365.36 moveto
930.52 353.48 953.82 338.11 973.75 324.96 curveto
stroke
0 0 0 edgecolor
newpath 975.93 327.72 moveto
982.35 319.29 lineto
972.07 321.88 lineto
closepath fill
1 setlinewidth
solid
0 0 0 edgecolor
newpath 975.93 327.72 moveto
982.35 319.29 lineto
972.07 321.88 lineto
closepath stroke
grestore
% 14->31
gsave
1 setlinewidth
0 0 0 edgecolor
newpath 870.97 359.55 moveto
853.63 307.53 828.91 185.34 860 89.74 curveto
863.72 78.29 870.45 67.2 877.98 57.64 curveto
stroke
0 0 0 edgecolor
newpath 880.67 59.89 moveto
884.46 50 lineto
875.32 55.37 lineto
closepath fill
1 setlinewidth
solid
0 0 0 edgecolor
newpath 880.67 59.89 moveto
884.46 50 lineto
875.32 55.37 lineto
closepath stroke
grestore
% 15
gsave
1 setlinewidth
0 0 0 nodecolor
1108 2001.15 52.15 26.74 ellipse_path stroke
0 0 0 nodecolor
14 /Times-Roman set_font
1079 2004.95 moveto 58 (make;v;01) alignedtext
0 0 0 nodecolor
14 /Times-Roman set_font
1096.5 1989.95 moveto 23 (\(15\)) alignedtext
grestore
% 15->27
gsave
1 setlinewidth
0 0 0 edgecolor
newpath 1114.22 2028.12 moveto
1114.72 2036.18 1114.87 2045.21 1114.65 2053.83 curveto
stroke
0 0 0 edgecolor
newpath 1111.15 2053.9 moveto
1114.22 2064.04 lineto
1118.14 2054.2 lineto
closepath fill
1 setlinewidth
solid
0 0 0 edgecolor
newpath 1111.15 2053.9 moveto
1114.22 2064.04 lineto
1118.14 2054.2 lineto
closepath stroke
grestore
% 15->29
gsave
1 setlinewidth
0 0 0 edgecolor
newpath 1130.01 1976.62 moveto
1139.37 1965.63 1149.76 1951.97 1157 1938.28 curveto
1227.31 1805.34 1206.17 1756.5 1258 1615.32 curveto
1353.83 1354.27 1426.86 1307.47 1506 1040.88 curveto
1552.05 885.75 1553.4 843.17 1567 681.92 curveto
1569.01 658.12 1582.28 646.54 1567 628.18 curveto
1533.7 588.17 1387.8 573.93 1299.9 568.94 curveto
stroke
0 0 0 edgecolor
newpath 1299.92 565.43 moveto
1289.74 568.39 lineto
1299.54 572.42 lineto
closepath fill
1 setlinewidth
solid
0 0 0 edgecolor
newpath 1299.92 565.43 moveto
1289.74 568.39 lineto
1299.54 572.42 lineto
closepath stroke
grestore
% 38
gsave
1 setlinewidth
0 0 0 nodecolor
1073 1911.41 41.94 26.74 ellipse_path stroke
0 0 0 nodecolor
14 /Times-Roman set_font
1051.5 1915.21 moveto 43 (not;r;01) alignedtext
0 0 0 nodecolor
14 /Times-Roman set_font
1061.5 1900.21 moveto 23 (\(38\)) alignedtext
grestore
% 15->38
gsave
1 setlinewidth
0 0 0 edgecolor
newpath 1097.88 1974.77 moveto
1094.43 1966.14 1090.52 1956.32 1086.83 1947.08 curveto
stroke
0 0 0 edgecolor
newpath 1090.06 1945.72 moveto
1083.1 1937.73 lineto
1083.56 1948.32 lineto
closepath fill
1 setlinewidth
solid
0 0 0 edgecolor
newpath 1090.06 1945.72 moveto
1083.1 1937.73 lineto
1083.56 1948.32 lineto
closepath stroke
grestore
% 16->30
gsave
1 setlinewidth
0 0 0 edgecolor
newpath 714.78 987.16 moveto
714.27 978.95 714.13 969.72 714.36 960.94 curveto
stroke
0 0 0 edgecolor
newpath 717.85 961.08 moveto
714.8 950.94 lineto
710.86 960.77 lineto
closepath fill
1 setlinewidth
solid
0 0 0 edgecolor
newpath 717.85 961.08 moveto
714.8 950.94 lineto
710.86 960.77 lineto
closepath stroke
grestore
% 17->25
gsave
1 setlinewidth
0 0 0 edgecolor
newpath 335.38 1261.44 moveto
318.87 1249.85 298.09 1235.27 280.15 1222.67 curveto
stroke
0 0 0 edgecolor
newpath 281.79 1219.55 moveto
271.6 1216.67 lineto
277.77 1225.28 lineto
closepath fill
1 setlinewidth
solid
0 0 0 edgecolor
newpath 281.79 1219.55 moveto
271.6 1216.67 lineto
277.77 1225.28 lineto
closepath stroke
grestore
% 17->26
gsave
1 setlinewidth
0 0 0 edgecolor
newpath 356.66 1256.61 moveto
341.04 1208.65 307.38 1105.24 289.58 1050.57 curveto
stroke
0 0 0 edgecolor
newpath 292.87 1049.37 moveto
286.44 1040.95 lineto
286.21 1051.54 lineto
closepath fill
1 setlinewidth
solid
0 0 0 edgecolor
newpath 292.87 1049.37 moveto
286.44 1040.95 lineto
286.21 1051.54 lineto
closepath stroke
grestore
% 17->28
gsave
1 setlinewidth
0 0 0 edgecolor
newpath 367.08 1256.18 moveto
370.5 1211.96 377.23 1119.34 380 1040.88 curveto
380.46 1027.93 379.4 820.35 382 807.66 curveto
399.36 722.97 407.84 699.3 457 628.18 curveto
490.03 580.4 508.59 577.03 552 538.44 curveto
564.22 527.58 577.88 516.01 590.1 505.84 curveto
stroke
0 0 0 edgecolor
newpath 592.43 508.46 moveto
597.9 499.39 lineto
587.97 503.07 lineto
closepath fill
1 setlinewidth
solid
0 0 0 edgecolor
newpath 592.43 508.46 moveto
597.9 499.39 lineto
587.97 503.07 lineto
closepath stroke
grestore
% 18->29
gsave
1 setlinewidth
0 0 0 edgecolor
newpath 1210.18 51.16 moveto
1219.46 62.1 1229.56 75.79 1236 89.74 curveto
1257.98 137.39 1260 152.87 1260 205.35 curveto
1260 386.83 1260 386.83 1260 386.83 curveto
1260 436.37 1249.22 492.75 1241.04 528.42 curveto
stroke
0 0 0 edgecolor
newpath 1237.59 527.81 moveto
1238.71 538.35 lineto
1244.4 529.42 lineto
closepath fill
1 setlinewidth
solid
0 0 0 edgecolor
newpath 1237.59 527.81 moveto
1238.71 538.35 lineto
1244.4 529.42 lineto
closepath stroke
grestore
% 19->10
gsave
1 setlinewidth
0 0 0 edgecolor
newpath 841.78 1435.86 moveto
841.27 1427.65 841.13 1418.42 841.36 1409.64 curveto
stroke
0 0 0 edgecolor
newpath 844.85 1409.78 moveto
841.8 1399.64 lineto
837.86 1409.47 lineto
closepath fill
1 setlinewidth
solid
0 0 0 edgecolor
newpath 844.85 1409.78 moveto
841.8 1399.64 lineto
837.86 1409.47 lineto
closepath stroke
grestore
% 19->23
gsave
1 setlinewidth
0 0 0 edgecolor
newpath 871.52 1438.94 moveto
882.58 1427.67 895.59 1413.57 906 1399.84 curveto
925.65 1373.93 944.54 1342.19 957.74 1318.52 curveto
stroke
0 0 0 edgecolor
newpath 960.91 1320.01 moveto
962.68 1309.56 lineto
954.78 1316.63 lineto
closepath fill
1 setlinewidth
solid
0 0 0 edgecolor
newpath 960.91 1320.01 moveto
962.68 1309.56 lineto
954.78 1316.63 lineto
closepath stroke
grestore
% 19->24
gsave
1 setlinewidth
0 0 0 edgecolor
newpath 845.95 1489.64 moveto
843.78 1498.09 840.87 1507.61 837.74 1516.6 curveto
stroke
0 0 0 edgecolor
newpath 834.43 1515.48 moveto
834.28 1526.07 lineto
841 1517.88 lineto
closepath fill
1 setlinewidth
solid
0 0 0 edgecolor
newpath 834.43 1515.48 moveto
834.28 1526.07 lineto
841 1517.88 lineto
closepath stroke
grestore
% 20
gsave
1 setlinewidth
0 0 0 nodecolor
875 834.53 67.35 26.74 ellipse_path stroke
0 0 0 nodecolor
14 /Times-Roman set_font
835.5 838.33 moveto 79 (particular;a;01) alignedtext
0 0 0 nodecolor
14 /Times-Roman set_font
863.5 823.33 moveto 23 (\(20\)) alignedtext
grestore
% 20->4
gsave
1 setlinewidth
0 0 0 edgecolor
newpath 845.52 809.96 moveto
805.44 777.92 733.74 720.6 690.06 685.68 curveto
stroke
0 0 0 edgecolor
newpath 692.24 682.94 moveto
682.25 679.43 lineto
687.87 688.41 lineto
closepath fill
1 setlinewidth
solid
0 0 0 edgecolor
newpath 692.24 682.94 moveto
682.25 679.43 lineto
687.87 688.41 lineto
closepath stroke
grestore
% 20->7
gsave
1 setlinewidth
0 0 0 edgecolor
newpath 900.44 859.43 moveto
988.06 944.46 1272 1243.76 1272 1551.45 curveto
1272 2002.15 1272 2002.15 1272 2002.15 curveto
1272 2052.34 1257.29 2108.78 1246.17 2144.27 curveto
stroke
0 0 0 edgecolor
newpath 1242.73 2143.54 moveto
1243.01 2154.13 lineto
1249.4 2145.68 lineto
closepath fill
1 setlinewidth
solid
0 0 0 edgecolor
newpath 1242.73 2143.54 moveto
1243.01 2154.13 lineto
1249.4 2145.68 lineto
closepath stroke
grestore
% 21
gsave
1 setlinewidth
0 0 0 nodecolor
754 475.57 51.74 26.74 ellipse_path stroke
0 0 0 nodecolor
14 /Times-Roman set_font
725.5 479.37 moveto 57 (place;n;01) alignedtext
0 0 0 nodecolor
14 /Times-Roman set_font
742.5 464.37 moveto 23 (\(21\)) alignedtext
grestore
% 20->21
gsave
1 setlinewidth
0 0 0 edgecolor
newpath 872.6 807.22 moveto
866.47 743.85 848.88 584.61 823 538.44 curveto
815.59 525.21 804.28 513.34 792.95 503.61 curveto
stroke
0 0 0 edgecolor
newpath 795.11 500.86 moveto
785.15 497.24 lineto
790.68 506.28 lineto
closepath fill
1 setlinewidth
solid
0 0 0 edgecolor
newpath 795.11 500.86 moveto
785.15 497.24 lineto
790.68 506.28 lineto
closepath stroke
grestore
% 20->28
gsave
1 setlinewidth
0 0 0 edgecolor
newpath 861.52 808.04 moveto
843.5 765.5 809.04 679.66 753 628.18 curveto
723.99 601.53 700.21 619.68 672 592.18 curveto
649.61 570.37 635.23 537.63 628.3 512.56 curveto
stroke
0 0 0 edgecolor
newpath 631.65 511.55 moveto
625.85 502.68 lineto
624.86 513.23 lineto
closepath fill
1 setlinewidth
solid
0 0 0 edgecolor
newpath 631.65 511.55 moveto
625.85 502.68 lineto
624.86 513.23 lineto
closepath stroke
grestore
% 32
gsave
1 setlinewidth
0 0 0 nodecolor
1068 744.79 71.34 26.74 ellipse_path stroke
0 0 0 nodecolor
14 /Times-Roman set_font
1025.5 748.59 moveto 85 (something;n;01) alignedtext
0 0 0 nodecolor
14 /Times-Roman set_font
1056.5 733.59 moveto 23 (\(32\)) alignedtext
grestore
% 20->32
gsave
1 setlinewidth
0 0 0 edgecolor
newpath 918.31 813.84 moveto
946.72 800.93 984.06 783.95 1014.34 770.19 curveto
stroke
0 0 0 edgecolor
newpath 1015.84 773.35 moveto
1023.49 766.02 lineto
1012.94 766.98 lineto
closepath fill
1 setlinewidth
solid
0 0 0 edgecolor
newpath 1015.84 773.35 moveto
1023.49 766.02 lineto
1012.94 766.98 lineto
closepath stroke
grestore
% 21->3
gsave
1 setlinewidth
0 0 0 edgecolor
newpath 804.45 469.59 moveto
882.78 458.75 1030.68 425.11 1089 322.96 curveto
1102.76 298.85 1100.78 267.07 1096.05 242.93 curveto
stroke
0 0 0 edgecolor
newpath 1099.46 242.11 moveto
1093.9 233.09 lineto
1092.62 243.61 lineto
closepath fill
1 setlinewidth
solid
0 0 0 edgecolor
newpath 1099.46 242.11 moveto
1093.9 233.09 lineto
1092.62 243.61 lineto
closepath stroke
grestore
% 21->13
gsave
1 setlinewidth
0 0 0 edgecolor
newpath 748.57 448.8 moveto
746.46 437.74 744.25 424.64 743 412.7 curveto
734.4 330.85 737.05 106.15 740 89.74 curveto
741.62 80.73 744.47 71.31 747.63 62.62 curveto
stroke
0 0 0 edgecolor
newpath 750.93 63.77 moveto
751.27 53.18 lineto
744.4 61.25 lineto
closepath fill
1 setlinewidth
solid
0 0 0 edgecolor
newpath 750.93 63.77 moveto
751.27 53.18 lineto
744.4 61.25 lineto
closepath stroke
grestore
% 22
gsave
1 setlinewidth
0 0 0 nodecolor
752 565.31 62.45 26.74 ellipse_path stroke
0 0 0 nodecolor
14 /Times-Roman set_font
716 569.11 moveto 72 (position;n;01) alignedtext
0 0 0 nodecolor
14 /Times-Roman set_font
740.5 554.11 moveto 23 (\(22\)) alignedtext
grestore
% 21->22
gsave
1 setlinewidth
0 0 0 edgecolor
newpath 759.63 502.54 moveto
759.95 510.6 759.89 519.63 759.48 528.25 curveto
stroke
0 0 0 edgecolor
newpath 755.97 528.25 moveto
758.81 538.46 lineto
762.95 528.71 lineto
closepath fill
1 setlinewidth
solid
0 0 0 edgecolor
newpath 755.97 528.25 moveto
758.81 538.46 lineto
762.95 528.71 lineto
closepath stroke
grestore
% 22->21
gsave
1 setlinewidth
0 0 0 edgecolor
newpath 746.37 538.46 moveto
746.05 530.25 746.11 521.02 746.54 512.24 curveto
stroke
0 0 0 edgecolor
newpath 750.04 512.45 moveto
747.21 502.24 lineto
743.05 511.98 lineto
closepath fill
1 setlinewidth
solid
0 0 0 edgecolor
newpath 750.04 512.45 moveto
747.21 502.24 lineto
743.05 511.98 lineto
closepath stroke
grestore
% 23->10
gsave
1 setlinewidth
0 0 0 edgecolor
newpath 948.39 1307.29 moveto
931.33 1319.62 909.21 1334.81 890.03 1347.37 curveto
stroke
0 0 0 edgecolor
newpath 887.94 1344.55 moveto
881.45 1352.93 lineto
891.75 1350.43 lineto
closepath fill
1 setlinewidth
solid
0 0 0 edgecolor
newpath 887.94 1344.55 moveto
881.45 1352.93 lineto
891.75 1350.43 lineto
closepath stroke
grestore
% 24->19
gsave
1 setlinewidth
0 0 0 edgecolor
newpath 822.16 1525.13 moveto
824.36 1516.6 827.3 1507.02 830.45 1498 curveto
stroke
0 0 0 edgecolor
newpath 833.77 1499.11 moveto
833.94 1488.52 lineto
827.2 1496.7 lineto
closepath fill
1 setlinewidth
solid
0 0 0 edgecolor
newpath 833.77 1499.11 moveto
833.94 1488.52 lineto
827.2 1496.7 lineto
closepath stroke
grestore
% 24->23
gsave
1 setlinewidth
0 0 0 edgecolor
newpath 859.6 1529.67 moveto
875.5 1519.28 892.9 1505.6 905 1489.58 curveto
943.84 1438.17 962.46 1363.95 970.55 1320.24 curveto
stroke
0 0 0 edgecolor
newpath 974 1320.8 moveto
972.3 1310.34 lineto
967.11 1319.58 lineto
closepath fill
1 setlinewidth
solid
0 0 0 edgecolor
newpath 974 1320.8 moveto
972.3 1310.34 lineto
967.11 1319.58 lineto
closepath stroke
grestore
% 24->37
gsave
1 setlinewidth
0 0 0 edgecolor
newpath 792.25 1527.44 moveto
747.66 1487.22 660.56 1401.6 616 1310.1 curveto
593.02 1262.92 592 1246.97 592 1194.49 curveto
592 1194.49 592 1194.49 592 1013.01 curveto
592 962.51 575.35 906.15 562.78 870.77 curveto
stroke
0 0 0 edgecolor
newpath 565.9 869.12 moveto
559.19 860.93 lineto
559.33 871.52 lineto
closepath fill
1 setlinewidth
solid
0 0 0 edgecolor
newpath 565.9 869.12 moveto
559.19 860.93 lineto
559.33 871.52 lineto
closepath stroke
grestore
% 25->1
gsave
1 setlinewidth
0 0 0 edgecolor
newpath 295.18 1182.43 moveto
386.01 1165.86 566.32 1132.97 660.51 1115.78 curveto
stroke
0 0 0 edgecolor
newpath 661.25 1119.21 moveto
670.46 1113.97 lineto
659.99 1112.32 lineto
closepath fill
1 setlinewidth
solid
0 0 0 edgecolor
newpath 661.25 1119.21 moveto
670.46 1113.97 lineto
659.99 1112.32 lineto
closepath stroke
grestore
% 27->15
gsave
1 setlinewidth
0 0 0 edgecolor
newpath 1101.78 2064.04 moveto
1101.28 2055.99 1101.13 2046.96 1101.34 2038.34 curveto
stroke
0 0 0 edgecolor
newpath 1104.85 2038.26 moveto
1101.78 2028.12 lineto
1097.86 2037.96 lineto
closepath fill
1 setlinewidth
solid
0 0 0 edgecolor
newpath 1104.85 2038.26 moveto
1101.78 2028.12 lineto
1097.86 2037.96 lineto
closepath stroke
grestore
% 27->25
gsave
1 setlinewidth
0 0 0 edgecolor
newpath 1045.6 2090.27 moveto
848.16 2089.81 250 2074.98 250 1912.41 curveto
250 1912.41 250 1912.41 250 1371.97 curveto
250 1322.96 246.15 1266.45 243.23 1230.61 curveto
stroke
0 0 0 edgecolor
newpath 246.72 1230.3 moveto
242.4 1220.63 lineto
239.74 1230.88 lineto
closepath fill
1 setlinewidth
solid
0 0 0 edgecolor
newpath 246.72 1230.3 moveto
242.4 1220.63 lineto
239.74 1230.88 lineto
closepath stroke
grestore
% 27->26
gsave
1 setlinewidth
0 0 0 edgecolor
newpath 1046.42 2086.87 moveto
861.75 2077.58 323.34 2048.84 292 2028.02 curveto
44.39 1863.52 152 1671.25 152 1373.97 curveto
152 1373.97 152 1373.97 152 1282.23 curveto
152 1230.16 151.26 1214.81 171 1166.62 curveto
189.64 1121.11 224.09 1075.97 248.88 1046.94 curveto
stroke
0 0 0 edgecolor
newpath 251.69 1049.04 moveto
255.59 1039.19 lineto
246.4 1044.46 lineto
closepath fill
1 setlinewidth
solid
0 0 0 edgecolor
newpath 251.69 1049.04 moveto
255.59 1039.19 lineto
246.4 1044.46 lineto
closepath stroke
grestore
% 28->12
gsave
1 setlinewidth
0 0 0 edgecolor
newpath 582.16 457.55 moveto
546.54 443.72 496.02 424.11 457.22 409.05 curveto
stroke
0 0 0 edgecolor
newpath 458.21 405.68 moveto
447.63 405.32 lineto
455.68 412.2 lineto
closepath fill
1 setlinewidth
solid
0 0 0 edgecolor
newpath 458.21 405.68 moveto
447.63 405.32 lineto
455.68 412.2 lineto
closepath stroke
grestore
% 28->14
gsave
1 setlinewidth
0 0 0 edgecolor
newpath 669.48 457.39 moveto
677.29 454.42 685.36 451.42 693 448.7 curveto
740.41 431.84 795.08 414.23 833.58 402.12 curveto
stroke
0 0 0 edgecolor
newpath 835 405.35 moveto
843.49 399.02 lineto
832.9 398.67 lineto
closepath fill
1 setlinewidth
solid
0 0 0 edgecolor
newpath 835 405.35 moveto
843.49 399.02 lineto
832.9 398.67 lineto
closepath stroke
grestore
% 28->20
gsave
1 setlinewidth
0 0 0 edgecolor
newpath 639.27 502.2 moveto
649.23 527.92 664.37 567.21 690 592.18 curveto
718.21 619.68 741.99 601.53 771 628.18 curveto
822.71 675.68 856.05 752.45 869.54 797.44 curveto
stroke
0 0 0 edgecolor
newpath 866.25 798.67 moveto
872.32 807.35 lineto
872.98 796.78 lineto
closepath fill
1 setlinewidth
solid
0 0 0 edgecolor
newpath 866.25 798.67 moveto
872.32 807.35 lineto
872.98 796.78 lineto
closepath stroke
grestore
% 39
gsave
1 setlinewidth
0 0 0 nodecolor
1351 385.83 62.87 26.74 ellipse_path stroke
0 0 0 nodecolor
14 /Times-Roman set_font
1314.5 389.63 moveto 73 (negative;a;01) alignedtext
0 0 0 nodecolor
14 /Times-Roman set_font
1339.5 374.63 moveto 23 (\(39\)) alignedtext
grestore
% 28->39
gsave
1 setlinewidth
0 0 0 edgecolor
newpath 667.62 456.48 moveto
675.9 453.46 684.63 450.67 693 448.7 curveto
802.75 422.87 1131.8 400.24 1278.75 391.11 curveto
stroke
0 0 0 edgecolor
newpath 1279.24 394.59 moveto
1289.01 390.48 lineto
1278.81 387.6 lineto
closepath fill
1 setlinewidth
solid
0 0 0 edgecolor
newpath 1279.24 394.59 moveto
1289.01 390.48 lineto
1278.81 387.6 lineto
closepath stroke
grestore
% 29->28
gsave
1 setlinewidth
0 0 0 edgecolor
newpath 1174.11 562.48 moveto
1074.47 558.26 864.72 544.71 693 502.44 curveto
687.78 501.16 682.42 499.57 677.11 497.82 curveto
stroke
0 0 0 edgecolor
newpath 678.24 494.51 moveto
667.65 494.52 lineto
675.94 501.12 lineto
closepath fill
1 setlinewidth
solid
0 0 0 edgecolor
newpath 678.24 494.51 moveto
667.65 494.52 lineto
675.94 501.12 lineto
closepath stroke
grestore
% 29->31
gsave
1 setlinewidth
0 0 0 edgecolor
newpath 1229.6 538.17 moveto
1226.65 503.58 1222 440.68 1222 386.83 curveto
1222 386.83 1222 386.83 1222 205.35 curveto
1222 152.87 1234.92 127.03 1198 89.74 curveto
1168.16 59.6 1055.06 42.37 980.91 34.09 curveto
stroke
0 0 0 edgecolor
newpath 981.04 30.58 moveto
970.72 32.98 lineto
980.28 37.54 lineto
closepath fill
1 setlinewidth
solid
0 0 0 edgecolor
newpath 981.04 30.58 moveto
970.72 32.98 lineto
980.28 37.54 lineto
closepath stroke
grestore
% 30->11
gsave
1 setlinewidth
0 0 0 edgecolor
newpath 704.15 898.96 moveto
684.44 872.41 649.31 830.62 609 807.66 curveto
549.05 773.52 509.81 817.22 458 771.66 curveto
329.89 659 352.72 580.52 322 412.7 curveto
317.7 389.21 311.61 380.47 322 358.96 curveto
328.48 345.56 339.42 334.17 351.1 324.96 curveto
stroke
0 0 0 edgecolor
newpath 353.29 327.69 moveto
359.25 318.93 lineto
349.13 322.06 lineto
closepath fill
1 setlinewidth
solid
0 0 0 edgecolor
newpath 353.29 327.69 moveto
359.25 318.93 lineto
349.13 322.06 lineto
closepath stroke
grestore
% 30->16
gsave
1 setlinewidth
0 0 0 edgecolor
newpath 727.2 950.94 moveto
727.72 959.13 727.87 968.36 727.65 977.14 curveto
stroke
0 0 0 edgecolor
newpath 724.15 977.02 moveto
727.22 987.16 lineto
731.14 977.32 lineto
closepath fill
1 setlinewidth
solid
0 0 0 edgecolor
newpath 724.15 977.02 moveto
727.22 987.16 lineto
731.14 977.32 lineto
closepath stroke
grestore
% 30->20
gsave
1 setlinewidth
0 0 0 edgecolor
newpath 754.42 904.23 moveto
776.07 891.9 804.57 875.66 828.43 862.06 curveto
stroke
0 0 0 edgecolor
newpath 830.37 864.99 moveto
837.32 857 lineto
826.9 858.91 lineto
closepath fill
1 setlinewidth
solid
0 0 0 edgecolor
newpath 830.37 864.99 moveto
837.32 857 lineto
826.9 858.91 lineto
closepath stroke
grestore
% 30->32
gsave
1 setlinewidth
0 0 0 edgecolor
newpath 758.82 906.84 moveto
768.58 903.54 779.1 900.22 789 897.4 curveto
856.18 878.26 880.87 895.21 942 861.4 curveto
979.59 840.61 1013.41 804.33 1036.73 777.95 curveto
stroke
0 0 0 edgecolor
newpath 1039.65 779.92 moveto
1043.62 770.1 lineto
1034.39 775.3 lineto
closepath fill
1 setlinewidth
solid
0 0 0 edgecolor
newpath 1039.65 779.92 moveto
1043.62 770.1 lineto
1034.39 775.3 lineto
closepath stroke
grestore
% 30->36
gsave
1 setlinewidth
0 0 0 edgecolor
newpath 726.47 897.35 moveto
730.28 872.82 732.42 835.69 718 807.66 curveto
700.38 773.42 611.8 714.5 558.29 681.09 curveto
stroke
0 0 0 edgecolor
newpath 560.04 678.05 moveto
549.69 675.75 lineto
556.34 684 lineto
closepath fill
1 setlinewidth
solid
0 0 0 edgecolor
newpath 560.04 678.05 moveto
549.69 675.75 lineto
556.34 684 lineto
closepath stroke
grestore
% 30->37
gsave
1 setlinewidth
0 0 0 edgecolor
newpath 685.78 905.3 moveto
659.17 891.73 622.47 873.01 593.78 858.37 curveto
stroke
0 0 0 edgecolor
newpath 595.26 855.2 moveto
584.77 853.78 lineto
592.08 861.44 lineto
closepath fill
1 setlinewidth
solid
0 0 0 edgecolor
newpath 595.26 855.2 moveto
584.77 853.78 lineto
592.08 861.44 lineto
closepath stroke
grestore
% 31->14
gsave
1 setlinewidth
0 0 0 edgecolor
newpath 898.6 52.91 moveto
890.82 63.44 882.35 76.35 878 89.74 curveto
848.88 179.28 868.72 292.14 878.96 348.84 curveto
stroke
0 0 0 edgecolor
newpath 875.53 349.53 moveto
880.75 358.75 lineto
882.42 348.29 lineto
closepath fill
1 setlinewidth
solid
0 0 0 edgecolor
newpath 875.53 349.53 moveto
880.75 358.75 lineto
882.42 348.29 lineto
closepath stroke
grestore
% 32->0
gsave
1 setlinewidth
0 0 0 edgecolor
newpath 1131.74 757.02 moveto
1167.96 765.93 1212.43 781.42 1245 807.66 curveto
1291.96 845.49 1316 862.97 1316 923.27 curveto
1316 1015.01 1316 1015.01 1316 1015.01 curveto
1316 1134.62 1348 1162.62 1348 1282.23 curveto
1348 2091.89 1348 2091.89 1348 2091.89 curveto
1348 2140.62 1348 2196.87 1348 2232.76 curveto
stroke
0 0 0 edgecolor
newpath 1344.5 2233.21 moveto
1348 2243.21 lineto
1351.5 2233.21 lineto
closepath fill
1 setlinewidth
solid
0 0 0 edgecolor
newpath 1344.5 2233.21 moveto
1348 2243.21 lineto
1351.5 2233.21 lineto
closepath stroke
grestore
% 32->1
gsave
1 setlinewidth
0 0 0 edgecolor
newpath 1057.71 771.83 moveto
1047.22 796.45 1029.34 833.65 1007 861.4 curveto
933.42 952.82 821.3 1035.38 761.65 1076.07 curveto
stroke
0 0 0 edgecolor
newpath 759.56 1073.26 moveto
753.24 1081.77 lineto
763.49 1079.06 lineto
closepath fill
1 setlinewidth
solid
0 0 0 edgecolor
newpath 759.56 1073.26 moveto
753.24 1081.77 lineto
763.49 1079.06 lineto
closepath stroke
grestore
% 32->3
gsave
1 setlinewidth
0 0 0 edgecolor
newpath 1077.58 718.04 moveto
1089.41 683.87 1108 621.43 1108 566.31 curveto
1108 566.31 1108 566.31 1108 474.57 curveto
1108 383.3 1125.16 359.05 1109 269.22 curveto
1107.38 260.21 1104.53 250.79 1101.37 242.1 curveto
stroke
0 0 0 edgecolor
newpath 1104.6 240.73 moveto
1097.73 232.66 lineto
1098.07 243.25 lineto
closepath fill
1 setlinewidth
solid
0 0 0 edgecolor
newpath 1104.6 240.73 moveto
1097.73 232.66 lineto
1098.07 243.25 lineto
closepath stroke
grestore
% 32->4
gsave
1 setlinewidth
0 0 0 edgecolor
newpath 1006.77 730.84 moveto
930.55 714.73 800.76 687.29 721.37 670.51 curveto
stroke
0 0 0 edgecolor
newpath 721.97 667.06 moveto
711.47 668.41 lineto
720.53 673.9 lineto
closepath fill
1 setlinewidth
solid
0 0 0 edgecolor
newpath 721.97 667.06 moveto
711.47 668.41 lineto
720.53 673.9 lineto
closepath stroke
grestore
% 32->6
gsave
1 setlinewidth
0 0 0 edgecolor
newpath 1068.48 717.63 moveto
1069.07 683.01 1070 620.08 1070 566.31 curveto
1070 566.31 1070 566.31 1070 474.57 curveto
1070 423.2 1049.04 366.94 1033.23 331.83 curveto
stroke
0 0 0 edgecolor
newpath 1036.3 330.13 moveto
1028.93 322.51 lineto
1029.94 333.06 lineto
closepath fill
1 setlinewidth
solid
0 0 0 edgecolor
newpath 1036.3 330.13 moveto
1028.93 322.51 lineto
1029.94 333.06 lineto
closepath stroke
grestore
% 32->7
gsave
1 setlinewidth
0 0 0 edgecolor
newpath 1119.64 763.51 moveto
1181.82 788.52 1278 840.57 1278 923.27 curveto
1278 1015.01 1278 1015.01 1278 1015.01 curveto
1278 1134.62 1310 1162.62 1310 1282.23 curveto
1310 2002.15 1310 2002.15 1310 2002.15 curveto
1310 2056.46 1279.56 2113.12 1257.21 2147.4 curveto
stroke
0 0 0 edgecolor
newpath 1254.08 2145.77 moveto
1251.44 2156.03 lineto
1259.9 2149.66 lineto
closepath fill
1 setlinewidth
solid
0 0 0 edgecolor
newpath 1254.08 2145.77 moveto
1251.44 2156.03 lineto
1259.9 2149.66 lineto
closepath stroke
grestore
% 32->8
gsave
1 setlinewidth
0 0 0 edgecolor
newpath 1060.01 717.96 moveto
1033.68 632.67 950.85 363.17 943 322.96 curveto
931.57 264.42 926.54 195.16 924.43 153.89 curveto
stroke
0 0 0 edgecolor
newpath 927.92 153.59 moveto
923.94 143.77 lineto
920.93 153.93 lineto
closepath fill
1 setlinewidth
solid
0 0 0 edgecolor
newpath 927.92 153.59 moveto
923.94 143.77 lineto
920.93 153.93 lineto
closepath stroke
grestore
% 32->9
gsave
1 setlinewidth
0 0 0 edgecolor
newpath 1076.14 771.66 moveto
1086.2 805.95 1102 868.53 1102 923.27 curveto
1102 1194.49 1102 1194.49 1102 1194.49 curveto
1102 1387.45 1046.1 1452.13 901 1579.32 curveto
802.45 1665.71 649.89 1704.88 563.5 1720.99 curveto
stroke
0 0 0 edgecolor
newpath 562.77 1717.56 moveto
553.56 1722.79 lineto
564.03 1724.45 lineto
closepath fill
1 setlinewidth
solid
0 0 0 edgecolor
newpath 562.77 1717.56 moveto
553.56 1722.79 lineto
564.03 1724.45 lineto
closepath stroke
grestore
% 32->11
gsave
1 setlinewidth
0 0 0 edgecolor
newpath 1037.15 720.52 moveto
1023.33 709.47 1007.21 695.7 994 681.92 curveto
903.55 587.62 920.33 526.02 815 448.7 curveto
710.8 372.22 563.97 330.73 475.78 311.31 curveto
stroke
0 0 0 edgecolor
newpath 476.36 307.86 moveto
465.85 309.16 lineto
474.88 314.7 lineto
closepath fill
1 setlinewidth
solid
0 0 0 edgecolor
newpath 476.36 307.86 moveto
465.85 309.16 lineto
474.88 314.7 lineto
closepath stroke
grestore
% 32->13
gsave
1 setlinewidth
0 0 0 edgecolor
newpath 1036.73 720.28 moveto
1022.99 709.3 1007.04 695.63 994 681.92 curveto
981.09 668.35 798.21 429.99 791 412.7 curveto
741.11 293.02 750.66 134.32 758.28 64.02 curveto
stroke
0 0 0 edgecolor
newpath 761.78 64.24 moveto
759.43 53.91 lineto
754.82 63.45 lineto
closepath fill
1 setlinewidth
solid
0 0 0 edgecolor
newpath 761.78 64.24 moveto
759.43 53.91 lineto
754.82 63.45 lineto
closepath stroke
grestore
% 32->14
gsave
1 setlinewidth
0 0 0 edgecolor
newpath 1044.35 719.23 moveto
1035.04 708.47 1024.95 695.28 1018 681.92 curveto
968.23 586.25 1007.93 540.29 951 448.7 curveto
942.78 435.48 930.96 423.36 919.47 413.41 curveto
stroke
0 0 0 edgecolor
newpath 921.55 410.59 moveto
911.62 406.89 lineto
917.08 415.97 lineto
closepath fill
1 setlinewidth
solid
0 0 0 edgecolor
newpath 921.55 410.59 moveto
911.62 406.89 lineto
917.08 415.97 lineto
closepath stroke
grestore
% 32->15
gsave
1 setlinewidth
0 0 0 edgecolor
newpath 1095.19 769.89 moveto
1127.77 801.55 1178 860.56 1178 923.27 curveto
1178 1104.75 1178 1104.75 1178 1104.75 curveto
1178 1223.79 1196 1252.94 1196 1371.97 curveto
1196 1463.71 1196 1463.71 1196 1463.71 curveto
1196 1583.67 1158 1610.97 1158 1730.93 curveto
1158 1822.67 1158 1822.67 1158 1822.67 curveto
1158 1873.88 1138.48 1930.39 1123.83 1965.58 curveto
stroke
0 0 0 edgecolor
newpath 1120.55 1964.35 moveto
1119.85 1974.92 lineto
1126.99 1967.09 lineto
closepath fill
1 setlinewidth
solid
0 0 0 edgecolor
newpath 1120.55 1964.35 moveto
1119.85 1974.92 lineto
1126.99 1967.09 lineto
closepath stroke
grestore
% 32->18
gsave
1 setlinewidth
0 0 0 edgecolor
newpath 1131.37 732 moveto
1168.91 722.8 1216.02 707.22 1252 681.92 curveto
1408.03 572.19 1442 487.84 1442 297.09 curveto
1442 297.09 1442 297.09 1442 205.35 curveto
1442 109.33 1318.53 60.93 1243.76 40.42 curveto
stroke
0 0 0 edgecolor
newpath 1244.56 37.01 moveto
1234 37.83 lineto
1242.76 43.78 lineto
closepath fill
1 setlinewidth
solid
0 0 0 edgecolor
newpath 1244.56 37.01 moveto
1234 37.83 lineto
1242.76 43.78 lineto
closepath stroke
grestore
% 32->29
gsave
1 setlinewidth
0 0 0 edgecolor
newpath 1107.45 722.37 moveto
1124.85 711.7 1144.76 697.71 1160 681.92 curveto
1183.16 657.94 1202.65 625.31 1215.48 600.83 curveto
stroke
0 0 0 edgecolor
newpath 1218.62 602.37 moveto
1220.07 591.88 lineto
1212.39 599.18 lineto
closepath fill
1 setlinewidth
solid
0 0 0 edgecolor
newpath 1218.62 602.37 moveto
1220.07 591.88 lineto
1212.39 599.18 lineto
closepath stroke
grestore
% 32->30
gsave
1 setlinewidth
0 0 0 edgecolor
newpath 1055.7 771.56 moveto
1037.03 798.16 1000.73 838.87 960 861.4 curveto
898.87 895.21 874.18 878.26 807 897.4 curveto
796.2 900.48 784.66 904.15 773.62 907.74 curveto
stroke
0 0 0 edgecolor
newpath 772.5 904.43 moveto
764.08 910.86 lineto
774.67 911.08 lineto
closepath fill
1 setlinewidth
solid
0 0 0 edgecolor
newpath 772.5 904.43 moveto
764.08 910.86 lineto
774.67 911.08 lineto
closepath stroke
grestore
% 32->31
gsave
1 setlinewidth
0 0 0 edgecolor
newpath 1088.28 718.95 moveto
1096.16 708.15 1104.58 694.99 1110 681.92 curveto
1176.73 521.04 1184 471.26 1184 297.09 curveto
1184 297.09 1184 297.09 1184 205.35 curveto
1184 106.77 1056.77 59.9 976.98 40.2 curveto
stroke
0 0 0 edgecolor
newpath 977.56 36.74 moveto
967.02 37.82 lineto
975.93 43.55 lineto
closepath fill
1 setlinewidth
solid
0 0 0 edgecolor
newpath 977.56 36.74 moveto
967.02 37.82 lineto
975.93 43.55 lineto
closepath stroke
grestore
% 32->35
gsave
1 setlinewidth
0 0 0 edgecolor
newpath 1130.07 731.13 moveto
1211.11 714.59 1352.27 685.79 1434.17 669.07 curveto
stroke
0 0 0 edgecolor
newpath 1435.01 672.48 moveto
1444.11 667.05 lineto
1433.61 665.62 lineto
closepath fill
1 setlinewidth
solid
0 0 0 edgecolor
newpath 1435.01 672.48 moveto
1444.11 667.05 lineto
1433.61 665.62 lineto
closepath stroke
grestore
% 32->36
gsave
1 setlinewidth
0 0 0 edgecolor
newpath 997.04 741.41 moveto
898.83 736.63 717 722.55 568 681.92 curveto
565.18 681.15 562.32 680.27 559.46 679.32 curveto
stroke
0 0 0 edgecolor
newpath 560.43 675.95 moveto
549.84 675.82 lineto
558.04 682.53 lineto
closepath fill
1 setlinewidth
solid
0 0 0 edgecolor
newpath 560.43 675.95 moveto
549.84 675.82 lineto
558.04 682.53 lineto
closepath stroke
grestore
% 32->39
gsave
1 setlinewidth
0 0 0 edgecolor
newpath 1118.49 725.63 moveto
1172.84 703.23 1257.11 659.62 1299 592.18 curveto
1316.47 564.05 1335.1 473.87 1344.6 422.87 curveto
stroke
0 0 0 edgecolor
newpath 1348.07 423.38 moveto
1346.44 412.92 lineto
1341.18 422.12 lineto
closepath fill
1 setlinewidth
solid
0 0 0 edgecolor
newpath 1348.07 423.38 moveto
1346.44 412.92 lineto
1341.18 422.12 lineto
closepath stroke
grestore
% 33->4
gsave
1 setlinewidth
0 0 0 edgecolor
newpath 562.12 1615.97 moveto
539.71 1558.04 498 1410.72 498 1284.23 curveto
498 1284.23 498 1284.23 498 1102.75 curveto
498 971.36 418.5 923.78 480 807.66 curveto
493.33 782.5 511.24 790.03 533 771.66 curveto
563.89 745.58 595.46 711.87 618.65 687.59 curveto
stroke
0 0 0 edgecolor
newpath 621.47 689.7 moveto
625.87 680.06 lineto
616.42 684.85 lineto
closepath fill
1 setlinewidth
solid
0 0 0 edgecolor
newpath 621.47 689.7 moveto
625.87 680.06 lineto
616.42 684.85 lineto
closepath stroke
grestore
% 33->24
gsave
1 setlinewidth
0 0 0 edgecolor
newpath 613.11 1625.39 moveto
621.6 1621.98 630.58 1618.46 639 1615.32 curveto
677.97 1600.8 722.12 1585.68 757.07 1574.02 curveto
stroke
0 0 0 edgecolor
newpath 758.28 1577.31 moveto
766.66 1570.83 lineto
756.07 1570.66 lineto
closepath fill
1 setlinewidth
solid
0 0 0 edgecolor
newpath 758.28 1577.31 moveto
766.66 1570.83 lineto
756.07 1570.66 lineto
closepath stroke
grestore
% 34->0
gsave
1 setlinewidth
0 0 0 edgecolor
newpath 1633.1 592.1 moveto
1644.34 626.32 1662 688.8 1662 743.79 curveto
1662 2091.89 1662 2091.89 1662 2091.89 curveto
1662 2198.98 1521.87 2242.2 1428.83 2259.09 curveto
stroke
0 0 0 edgecolor
newpath 1428.11 2255.66 moveto
1418.86 2260.83 lineto
1429.31 2262.56 lineto
closepath fill
1 setlinewidth
solid
0 0 0 edgecolor
newpath 1428.11 2255.66 moveto
1418.86 2260.83 lineto
1429.31 2262.56 lineto
closepath stroke
grestore
% 35->34
gsave
1 setlinewidth
0 0 0 edgecolor
newpath 1529.47 632.14 moveto
1545.88 620.71 1566.14 606.6 1583.69 594.38 curveto
stroke
0 0 0 edgecolor
newpath 1585.85 597.14 moveto
1592.06 588.55 lineto
1581.85 591.4 lineto
closepath fill
1 setlinewidth
solid
0 0 0 edgecolor
newpath 1585.85 597.14 moveto
1592.06 588.55 lineto
1581.85 591.4 lineto
closepath stroke
grestore
% 36->2
gsave
1 setlinewidth
0 0 0 edgecolor
newpath 470.38 643.9 moveto
396.86 627.89 254.08 596.81 173.35 579.23 curveto
stroke
0 0 0 edgecolor
newpath 173.86 575.76 moveto
163.34 577.05 lineto
172.37 582.6 lineto
closepath fill
1 setlinewidth
solid
0 0 0 edgecolor
newpath 173.86 575.76 moveto
163.34 577.05 lineto
172.37 582.6 lineto
closepath stroke
grestore
% 36->5
gsave
1 setlinewidth
0 0 0 edgecolor
newpath 482.76 675.28 moveto
379.15 736.27 76 936.6 76 1192.49 curveto
76 1284.23 76 1284.23 76 1284.23 curveto
76 1384.55 240.4 1598.8 312 1669.06 curveto
359.96 1716.13 421.33 1764.07 460.16 1793.1 curveto
stroke
0 0 0 edgecolor
newpath 458.46 1796.2 moveto
468.57 1799.36 lineto
462.64 1790.58 lineto
closepath fill
1 setlinewidth
solid
0 0 0 edgecolor
newpath 458.46 1796.2 moveto
468.57 1799.36 lineto
462.64 1790.58 lineto
closepath stroke
grestore
% 36->9
gsave
1 setlinewidth
0 0 0 edgecolor
newpath 512.34 682.03 moveto
502.6 711.77 483.63 762.23 475 807.66 curveto
450.5 936.68 460 971.43 460 1102.75 curveto
460 1553.45 460 1553.45 460 1553.45 curveto
460 1603.93 477.99 1659.88 489.58 1695.21 curveto
stroke
0 0 0 edgecolor
newpath 486.36 1696.63 moveto
492.8 1705.04 lineto
493.01 1694.45 lineto
closepath fill
1 setlinewidth
solid
0 0 0 edgecolor
newpath 486.36 1696.63 moveto
492.8 1705.04 lineto
493.01 1694.45 lineto
closepath stroke
grestore
% 36->12
gsave
1 setlinewidth
0 0 0 edgecolor
newpath 505.78 628.43 moveto
484.68 580.24 439.08 476.1 415.24 421.63 curveto
stroke
0 0 0 edgecolor
newpath 418.4 420.13 moveto
411.18 412.38 lineto
411.99 422.94 lineto
closepath fill
1 setlinewidth
solid
0 0 0 edgecolor
newpath 418.4 420.13 moveto
411.18 412.38 lineto
411.99 422.94 lineto
closepath stroke
grestore
% 36->20
gsave
1 setlinewidth
0 0 0 edgecolor
newpath 555.2 673.12 moveto
562.4 676.16 569.9 679.22 577 681.92 curveto
624.69 700.04 644.28 688.56 686 717.92 curveto
710.79 735.37 703.92 753.25 728 771.66 curveto
752.79 790.62 784.25 804.88 811.69 814.9 curveto
stroke
0 0 0 edgecolor
newpath 810.62 818.23 moveto
821.22 818.27 lineto
812.96 811.63 lineto
closepath fill
1 setlinewidth
solid
0 0 0 edgecolor
newpath 810.62 818.23 moveto
821.22 818.27 lineto
812.96 811.63 lineto
closepath stroke
grestore
% 36->22
gsave
1 setlinewidth
0 0 0 edgecolor
newpath 555.25 637.1 moveto
562.44 634.05 569.92 630.95 577 628.18 curveto
615.64 613.04 659.69 597.47 693.93 585.74 curveto
stroke
0 0 0 edgecolor
newpath 695.44 588.93 moveto
703.77 582.39 lineto
693.18 582.3 lineto
closepath fill
1 setlinewidth
solid
0 0 0 edgecolor
newpath 695.44 588.93 moveto
703.77 582.39 lineto
693.18 582.3 lineto
closepath stroke
grestore
% 36->28
gsave
1 setlinewidth
0 0 0 edgecolor
newpath 532.16 629.37 moveto
551.17 598.42 583.85 545.21 605.19 510.46 curveto
stroke
0 0 0 edgecolor
newpath 608.37 511.96 moveto
610.62 501.61 lineto
602.41 508.3 lineto
closepath fill
1 setlinewidth
solid
0 0 0 edgecolor
newpath 608.37 511.96 moveto
610.62 501.61 lineto
602.41 508.3 lineto
closepath stroke
grestore
% 36->29
gsave
1 setlinewidth
0 0 0 edgecolor
newpath 553.49 636.18 moveto
561.11 633.06 569.2 630.18 577 628.18 curveto
686.88 600.05 1020.5 578.33 1164.57 570 curveto
stroke
0 0 0 edgecolor
newpath 1164.82 573.49 moveto
1174.61 569.43 lineto
1164.42 566.51 lineto
closepath fill
1 setlinewidth
solid
0 0 0 edgecolor
newpath 1164.82 573.49 moveto
1174.61 569.43 lineto
1164.42 566.51 lineto
closepath stroke
grestore
% 36->32
gsave
1 setlinewidth
0 0 0 edgecolor
newpath 557.12 671.59 moveto
566.5 675.51 576.48 679.32 586 681.92 curveto
724.1 719.58 890.41 734.43 987.23 740.2 curveto
stroke
0 0 0 edgecolor
newpath 987.06 743.7 moveto
997.25 740.78 lineto
987.47 736.71 lineto
closepath fill
1 setlinewidth
solid
0 0 0 edgecolor
newpath 987.06 743.7 moveto
997.25 740.78 lineto
987.47 736.71 lineto
closepath stroke
grestore
% 38->5
gsave
1 setlinewidth
0 0 0 edgecolor
newpath 1032.57 1904.24 moveto
932.94 1889.04 675.24 1849.72 557.85 1831.8 curveto
stroke
0 0 0 edgecolor
newpath 558.02 1828.29 moveto
547.61 1830.24 lineto
556.97 1835.21 lineto
closepath fill
1 setlinewidth
solid
0 0 0 edgecolor
newpath 558.02 1828.29 moveto
547.61 1830.24 lineto
556.97 1835.21 lineto
closepath stroke
grestore
% 38->6
gsave
1 setlinewidth
0 0 0 edgecolor
newpath 1084.02 1885.4 moveto
1097.91 1851.52 1120 1788.87 1120 1732.93 curveto
1120 1732.93 1120 1732.93 1120 1641.19 curveto
1120 1334.49 1410 1321.71 1410 1015.01 curveto
1410 1015.01 1410 1015.01 1410 743.79 curveto
1410 572.66 1534.55 488.75 1423 358.96 curveto
1380.9 309.98 1195.39 299.32 1089.94 297.29 curveto
stroke
0 0 0 edgecolor
newpath 1089.74 293.78 moveto
1079.68 297.11 lineto
1089.62 300.78 lineto
closepath fill
1 setlinewidth
solid
0 0 0 edgecolor
newpath 1089.74 293.78 moveto
1079.68 297.11 lineto
1089.62 300.78 lineto
closepath stroke
grestore
% 38->9
gsave
1 setlinewidth
0 0 0 edgecolor
newpath 1035.72 1898.9 moveto
937.9 1868.71 673.38 1787.07 555.75 1750.76 curveto
stroke
0 0 0 edgecolor
newpath 556.43 1747.31 moveto
545.85 1747.7 lineto
554.37 1753.99 lineto
closepath fill
1 setlinewidth
solid
0 0 0 edgecolor
newpath 556.43 1747.31 moveto
545.85 1747.7 lineto
554.37 1753.99 lineto
closepath stroke
grestore
% 38->39
gsave
1 setlinewidth
0 0 0 edgecolor
newpath 1066.87 1884.55 moveto
1064 1849.99 1064 1786.85 1064 1732.93 curveto
1064 1732.93 1064 1732.93 1064 1551.45 curveto
1064 1454.88 1092.25 1432.69 1135 1346.1 curveto
1213.11 1187.9 1354 1191.44 1354 1015.01 curveto
1354 1015.01 1354 1015.01 1354 743.79 curveto
1354 626.32 1347.43 487.22 1347.66 422.84 curveto
stroke
0 0 0 edgecolor
newpath 1351.16 422.83 moveto
1347.76 412.8 lineto
1344.16 422.76 lineto
closepath fill
1 setlinewidth
solid
0 0 0 edgecolor
newpath 1351.16 422.83 moveto
1347.76 412.8 lineto
1344.16 422.76 lineto
closepath stroke
grestore
% 39->38
gsave
1 setlinewidth
0 0 0 edgecolor
newpath 1357.18 412.8 moveto
1364.68 471.66 1372 619.78 1372 743.79 curveto
1372 1015.01 1372 1015.01 1372 1015.01 curveto
1372 1191.44 1231.11 1187.9 1153 1346.1 curveto
1110.25 1432.69 1082 1454.88 1082 1551.45 curveto
1082 1732.93 1082 1732.93 1082 1732.93 curveto
1082 1782.01 1082 1838.72 1079.83 1874.57 curveto
stroke
0 0 0 edgecolor
newpath 1076.34 1874.32 moveto
1079.13 1884.55 lineto
1083.32 1874.82 lineto
closepath fill
1 setlinewidth
solid
0 0 0 edgecolor
newpath 1076.34 1874.32 moveto
1079.13 1884.55 lineto
1083.32 1874.82 lineto
closepath stroke
grestore
endpage
showpage
grestore
%%PageTrailer
%%EndPage: 1
%%Trailer
%%Pages: 1
%%BoundingBox: 36 36 1730 2341
end
restore
%%EOF
