8,1,6.19888305664e-06
9,2,0.000237941741943
10,2,0.00031304359436
11,3,0.000301122665405
12,3,0.00111699104309
13,5,0.0016508102417
14,2,0.000560998916626
15,3,0.0011420249939
16,5,0.00269293785095
17,2,0.000788927078247
18,3,0.000936031341553
19,2,0.00107097625732
20,5,0.225571155548
21,1,0.00148415565491
22,4,0.00177216529846
23,3,0.098757982254
