19,0,8.01086425781e-05
20,1,0.000611066818237
21,1,0.00286817550659
22,2,0.00820207595825
23,2,0.0154049396515
24,2,0.0200378894806
25,2,0.0167090892792
26,2,0.0105781555176
27,1,0.00399684906006
28,0,0.00094199180603
