3,1,0.000123977661133
4,2,0.000501871109009
5,3,0.010782957077
6,3,0.0458137989044
7,4,0.0688090324402
8,5,0.0798070430756
9,5,0.0725691318512
10,5,0.0497000217438
11,5,0.0255551338196
12,5,0.00961399078369
13,5,0.00247693061829
14,5,0.000393867492676
