3,1,0.000540971755981
4,2,0.0375871658325
5,3,0.299607038498
6,3,7.74102187157
7,4,28.8795049191
8,5,88.948166132
9,5,231.785666943
10,5,505.089214087
11,6,941.697268009
12,7,1507.66842699
13,7,2080.97449303
14,8,1603.51484823
15,8,1298.91648817
16,8,1167.45383
17,7,906.796530008
18,7,605.007777929
19,6,346.959223986
20,6,169.576156139
21,5,69.9243409634
22,4,24.4595630169
23,3,6.84208297729
24,2,1.52822995186
25,1,0.264688968658
26,0,0.032772064209
27,-1,0.00259900093079
