3,1,0.000231027603149
4,2,0.00128793716431
5,3,0.00472402572632
6,3,0.0255908966064
7,4,0.0183899402618
8,4,0.0160698890686
9,3,0.010379076004
10,2,0.00473189353943
11,1,0.00148296356201
12,0,0.000282049179077
