5,0,3.48091125488e-05
6,1,0.000154972076416
7,2,0.000765800476074
8,3,0.00418090820312
9,3,0.00615310668945
10,4,0.00888681411743
11,4,0.00983309745789
12,4,0.00767278671265
13,4,0.00414395332336
14,3,0.00150799751282
15,2,0.000332117080688
