5,0,1.19209289551e-05
6,0,0.000125169754028
7,1,0.000224113464355
8,2,0.000347137451172
9,2,0.000471115112305
10,3,0.000601053237915
11,4,0.000731945037842
12,4,0.000872850418091
13,4,0.00106692314148
14,4,0.00114011764526
15,3,0.00129508972168
16,2,0.0013689994812
