9,1,7.15255737305e-06
10,2,0.000487089157104
11,0,0.000307083129883
12,2,0.00047492980957
13,2,0.000430107116699
14,0,0.000720024108887
15,0,0.00054407119751
16,2,0.000995874404907
17,-2,0.00084400177002
18,1,0.00144600868225
19,1,0.000943899154663
20,1,0.00198888778687
21,-1,0.00125002861023
22,-3,0.00142192840576
23,0,0.00152802467346
24,0,0.00169491767883
25,-2,0.00185608863831
26,-2,0.00012993812561
