4,0,4.05311584473e-06
5,0,0.000103950500488
6,0,0.000166893005371
7,0,0.000296115875244
8,0,0.000416994094849
9,0,0.000258922576904
10,0,0.000367879867554
11,-1,5.91278076172e-05
12,-1,5.79357147217e-05
