7,-1,1.59740447998e-05
8,0,0.000207901000977
9,0,0.000391006469727
10,1,0.000593900680542
11,1,0.000809907913208
12,2,0.00121307373047
13,2,0.00136494636536
14,2,0.00153279304504
15,2,0.00197505950928
16,2,0.0019850730896
17,2,0.00241208076477
18,2,0.00241994857788
19,2,0.00267910957336
20,1,0.00284695625305
21,0,0.00298190116882
