5,-1,1.78813934326e-05
6,0,0.000182151794434
7,1,0.000323057174683
8,1,0.000525951385498
9,1,0.000715970993042
10,1,0.000669002532959
11,1,0.000793933868408
12,0,0.000936031341553
13,0,0.00105595588684
14,-1,0.00120711326599
15,-2,0.00127816200256
16,-3,0.00141501426697
