8,1,1.90734863281e-05
9,2,0.000277996063232
10,3,0.000508785247803
11,4,0.000772953033447
12,5,0.00104808807373
13,5,0.00133919715881
14,5,0.00163292884827
15,5,0.0019268989563
16,5,0.00230097770691
17,5,0.00275015830994
18,6,0.00311803817749
19,6,0.00319290161133
20,6,0.00339293479919
21,5,0.00371885299683
22,4,0.00388097763062
23,3,0.00413990020752
