5,0,2.69412994385e-05
6,1,0.000138998031616
7,1,0.000609159469604
8,2,0.00212097167969
9,3,0.00361895561218
10,4,0.004634141922
11,4,0.00469994544983
12,3,0.00265002250671
13,2,0.00110983848572
14,1,0.000272035598755
