3,1,0.000180959701538
4,2,0.00230813026428
5,3,0.0214838981628
6,3,1.82390499115
7,4,5.82637190819
8,4,15.3847908974
9,4,33.9067869186
10,5,61.84405303
11,5,96.1685922146
12,6,126.942430973
13,6,142.101719856
14,6,136.377736092
15,6,110.873418093
16,6,76.6078879833
17,6,44.6220941544
18,6,21.7447988987
19,6,8.72915196419
20,5,2.85051488876
21,5,0.736033916473
22,4,0.146041154861
23,3,0.0209581851959
24,2,0.00189304351807
