8,-1,8.10623168945e-06
9,0,0.00035285949707
10,0,0.000383138656616
11,0,0.000492095947266
12,1,0.000542163848877
13,0,0.000679016113281
14,3,0.00324392318726
15,2,0.000820875167847
16,1,0.00109004974365
17,3,0.0945880413055
18,3,0.00131988525391
19,3,0.00182008743286
20,1,0.00116395950317
21,3,0.00215315818787
22,1,0.00142502784729
23,4,0.00541090965271
24,3,0.00349807739258
25,2,0.00213408470154
