7,0,6.91413879395e-06
8,1,0.000231027603149
9,1,0.000260829925537
10,0,0.000316143035889
11,2,0.000403165817261
12,1,0.000550985336304
13,5,0.00323104858398
14,3,0.000727891921997
15,5,0.00299215316772
16,2,0.000730037689209
17,5,0.00231409072876
18,4,0.00102806091309
19,4,0.0509028434753
20,3,0.000102043151855
21,2,9.89437103271e-05
