7,0,4.00543212891e-05
8,1,0.000272989273071
9,2,0.00197696685791
10,3,0.00941300392151
11,3,0.0304388999939
12,4,0.0731649398804
13,4,0.132599830627
14,4,0.185749053955
15,4,0.202018976212
16,4,0.171999931335
17,4,0.111688137054
18,4,0.0551409721375
19,4,0.019809961319
20,3,0.00488495826721
21,2,0.000758171081543
