8,0,4.29153442383e-05
9,1,0.000375032424927
10,2,0.00322508811951
11,3,0.0181179046631
12,4,0.0642991065979
13,4,0.182420969009
14,5,0.395900011063
15,5,0.670525074005
16,5,0.901278018951
17,5,0.975790023804
18,5,0.838943004608
19,5,0.572181224823
20,5,0.306303977966
21,5,0.125996112823
22,4,0.0393211841583
23,3,0.00831317901611
24,2,0.00120210647583
