5,0,3.19480895996e-05
6,0,0.000174045562744
7,1,0.00094199180603
8,2,0.00369191169739
9,2,0.00839900970459
10,3,0.0148959159851
11,4,0.0191578865051
12,4,0.0178189277649
13,4,0.0123529434204
14,4,0.00600790977478
15,3,0.0019519329071
16,2,0.000394105911255
