5,0,5.00679016113e-06
6,0,0.00015115737915
7,1,0.000182151794434
8,1,0.00019907951355
9,2,0.000239133834839
10,3,0.000397920608521
11,2,0.000460863113403
12,-1,0.000492095947266
13,1,0.00101804733276
14,1,0.000767946243286
15,2,0.000739097595215
16,2,0.000869035720825
