8,-1,3.69548797607e-05
9,0,0.000369787216187
10,1,0.00349497795105
11,2,0.0183138847351
12,3,0.0639171600342
13,3,0.181012153625
14,4,0.394622802734
15,4,0.674808979034
16,4,0.915904998779
17,4,0.984498023987
18,4,0.848514080048
19,4,0.579240083694
20,4,0.312260866165
21,4,0.128432035446
22,4,0.0432119369507
23,3,0.00940895080566
24,1,0.00125885009766
