20,2,1.09672546387e-05
21,3,0.000469923019409
22,2,0.000585079193115
23,2,0.000622987747192
24,2,0.00129103660583
25,1,0.000869035720825
26,-1,0.00103402137756
27,0,0.00199484825134
28,-1,0.00130796432495
29,-2,0.00148701667786
