6,0,2.09808349609e-05
7,0,0.0002281665802
8,0,0.000415802001953
9,0,0.000680923461914
10,1,0.000826120376587
11,2,0.000844955444336
12,2,0.000962972640991
13,2,0.00110983848572
14,2,0.00128293037415
15,2,0.00144600868225
16,1,0.00171709060669
17,0,0.00227499008179
18,-1,0.00183010101318
