9,0,5.50746917725e-05
10,1,0.000586032867432
11,2,0.00493597984314
12,3,0.0268788337708
13,3,0.116857051849
14,4,0.381305932999
15,4,0.961285114288
16,4,1.92552089691
17,4,3.15872478485
18,4,4.40084409714
19,4,4.57728886604
20,4,4.01611709595
21,4,2.83466601372
22,3,1.64512109756
23,3,0.750959157944
24,2,0.265532016754
25,1,0.0698771476746
26,0,0.0134201049805
27,-1,0.00155091285706
