6,0,3.09944152832e-05
7,0,0.000208854675293
8,1,0.00145411491394
9,2,0.00545716285706
10,2,0.014062166214
11,3,0.0276510715485
12,3,0.0408110618591
13,3,0.0440762042999
14,3,0.0359799861908
15,2,0.0217399597168
16,1,0.00941205024719
17,0,0.00278091430664
18,-1,0.000506162643433
