9,0,5.00679016113e-06
10,0,0.000282049179077
11,0,0.00030517578125
12,2,0.000664949417114
13,0,0.000415086746216
14,-2,0.000830888748169
15,2,0.000562191009521
16,4,0.00084400177002
17,2,0.000959873199463
18,-1,0.000931024551392
19,1,0.0011100769043
20,4,0.00612187385559
21,2,0.00217390060425
22,1,0.00166797637939
23,4,0.0127718448639
24,4,0.0134041309357
25,2,0.0085551738739
26,1,0.150582075119
27,0,0.00261306762695
28,1,0.00354313850403
