3,1,0.0014340877533
4,2,0.0212171077728
5,3,0.264295816422
6,3,6.027957201
7,4,21.4536058903
8,5,62.8302512169
9,5,155.777879953
10,5,321.079532146
11,6,563.101756096
12,7,847.982954025
13,7,1097.41489983
14,7,1222.87969184
15,8,1175.16179085
16,8,975.011821985
17,8,695.493503094
18,8,422.736755133
19,8,218.440737009
20,7,95.1406130791
21,7,34.3494429588
22,6,10.2562730312
23,5,2.39770698547
24,4,0.430027961731
25,3,0.0548379421234
26,2,0.00462484359741
