16,3,3.88622283936e-05
17,3,0.000391006469727
18,3,0.000715017318726
19,3,0.00106811523438
20,3,0.00139093399048
21,3,0.00165295600891
22,3,0.00193309783936
23,2,0.0021800994873
24,1,0.00241613388062
