3,1,0.000601053237915
4,2,0.0319719314575
5,2,0.149037122726
6,3,0.509625911713
7,3,1.27157998085
8,4,2.58384084702
9,4,4.37910199165
10,4,5.96804499626
11,4,6.75520920753
12,4,6.33351111412
13,4,4.92175221443
14,4,3.12893605232
15,4,1.6170899868
16,4,0.670589923859
17,3,0.216208934784
18,2,0.0526149272919
19,1,0.00905799865723
20,0,0.000990152359009
