17,0,1.00135803223e-05
18,1,0.000366926193237
19,1,0.000720977783203
20,0,0.000750780105591
21,1,0.000959157943726
22,1,0.000808954238892
23,3,0.000921964645386
24,1,0.000140905380249
25,1,0.000135183334351
