3,1,0.000251054763794
4,2,0.00200414657593
5,3,0.0149040222168
6,3,0.166578054428
7,4,0.335376977921
8,5,0.53829908371
9,5,0.69814491272
10,5,0.715318918228
11,5,0.590222120285
12,5,0.393537998199
13,4,0.201444864273
14,4,0.0792210102081
15,3,0.0232651233673
16,2,0.00481700897217
17,1,0.000631093978882
