5,0,5.00679016113e-06
6,0,0.000195980072021
7,0,0.000160932540894
8,1,0.000354051589966
9,1,0.000339031219482
10,1,0.000297069549561
11,3,0.000884056091309
12,4,0.000830888748169
13,4,0.00124788284302
14,4,0.000730991363525
15,3,0.0010769367218
