8,-1,2.69412994385e-05
9,0,0.000432968139648
10,1,0.000638961791992
11,2,0.000849962234497
12,2,0.00109004974365
13,2,0.001384973526
14,2,0.00172805786133
15,3,0.00205206871033
16,4,0.0023729801178
17,5,0.0027129650116
18,5,0.0030460357666
19,6,0.00352311134338
20,6,0.00380682945251
21,6,0.00449299812317
22,5,0.00457096099854
23,4,0.00462698936462
24,3,0.00490522384644
25,2,0.00505900382996
