10,0,2.28881835938e-05
11,1,0.000406980514526
12,2,0.000794887542725
13,3,0.00121593475342
14,4,0.00177502632141
15,4,0.00217700004578
16,4,0.0026638507843
17,4,0.00318002700806
18,4,0.00374102592468
19,4,0.00426697731018
20,4,0.00485801696777
21,4,0.00535202026367
22,4,0.00588297843933
23,4,0.00631499290466
24,4,0.0068371295929
25,4,0.00728392601013
26,3,0.00776600837708
27,2,0.008131980896
28,1,0.00836801528931
29,1,0.00916290283203
