18,-1,4.6968460083e-05
19,0,0.000512838363647
20,1,0.00101900100708
21,1,0.00142383575439
22,1,0.00186800956726
23,0,0.0022919178009
24,-1,0.00266289710999
25,-2,0.0031259059906
26,-3,0.00329494476318
27,-3,0.00357007980347
