3,1,5.60283660889e-05
4,2,0.00959491729736
5,3,0.0654830932617
6,3,1.02415704727
7,4,2.94420003891
8,5,6.86384701729
9,5,17.2667369843
10,5,21.3323318958
11,6,28.6487989426
12,6,32.3556740284
13,6,30.6832139492
14,7,24.3613381386
15,7,16.1366930008
16,7,8.95363402367
17,6,4.05201911926
18,6,1.472864151
19,5,0.421293020248
20,4,0.091285943985
21,2,0.0142619609833
22,1,0.00147604942322
