5,1,5.00679016113e-06
6,1,0.000113964080811
7,1,0.000185012817383
8,1,0.000218868255615
9,4,0.000577926635742
10,4,0.00730800628662
11,0,6.41345977783e-05
12,4,0.000817060470581
13,4,0.000459909439087
14,4,0.000784873962402
